atlas-dev mailing list archives

Site index · List index
Message view « Date » · « Thread »
Top « Date » · « Thread »
From Apache Jenkins Server <jenk...@builds.apache.org>
Subject Build failed in Jenkins: Atlas-master-NoTests #163
Date Mon, 20 Nov 2017 20:21:35 GMT
See <https://builds.apache.org/job/Atlas-master-NoTests/163/display/redirect?page=changes>

Changes:

[madhan] ATLAS-2269: Error in the Area 0 and 3 model files

------------------------------------------
[...truncated 490.40 KB...]
[INFO] 
[INFO] --- maven-jar-plugin:2.5:jar (default-jar) @ atlas-distro ---
[INFO] Building jar: <https://builds.apache.org/job/Atlas-master-NoTests/ws/distro/target/atlas-distro-1.0.0-SNAPSHOT.jar>
[INFO] 
[INFO] --- maven-site-plugin:3.4:attach-descriptor (attach-descriptor) @ atlas-distro ---
[INFO] 
[INFO] --- maven-assembly-plugin:2.4.1:single (default) @ atlas-distro ---
[INFO] Reading assembly descriptor: src/main/assemblies/standalone-package.xml
[INFO] Reading assembly descriptor: src/main/assemblies/src-package.xml
[INFO] Building tar: <https://builds.apache.org/job/Atlas-master-NoTests/163/artifact/distro/target/apache-atlas-1.0.0-SNAPSHOT-bin.tar.gz>
[INFO] Copying files to <https://builds.apache.org/job/Atlas-master-NoTests/ws/distro/target/apache-atlas-1.0.0-SNAPSHOT-bin>
[WARNING] Assembly file: <https://builds.apache.org/job/Atlas-master-NoTests/ws/distro/target/apache-atlas-1.0.0-SNAPSHOT-bin>
is not a regular file (it may be a directory). It cannot be attached to the project build
for installation or deployment.
[INFO] Building tar: <https://builds.apache.org/job/Atlas-master-NoTests/163/artifact/distro/target/apache-atlas-1.0.0-SNAPSHOT-sources.tar.gz>
[INFO] 
[INFO] --- maven-failsafe-plugin:2.20.1:integration-test (integration-test) @ atlas-distro
---
[INFO] Tests are skipped.
[INFO] 
[INFO] --- maven-source-plugin:2.4:jar-no-fork (attach-sources) @ atlas-distro ---
[INFO] Building jar: <https://builds.apache.org/job/Atlas-master-NoTests/ws/distro/target/atlas-distro-1.0.0-SNAPSHOT-sources.jar>
[INFO] 
[INFO] --- maven-source-plugin:2.4:test-jar-no-fork (attach-sources) @ atlas-distro ---
[INFO] Building jar: <https://builds.apache.org/job/Atlas-master-NoTests/ws/distro/target/atlas-distro-1.0.0-SNAPSHOT-test-sources.jar>
[INFO] 
[INFO] --- maven-failsafe-plugin:2.20.1:verify (verify) @ atlas-distro ---
[INFO] Tests are skipped.
[INFO] 
[INFO] --- maven-checkstyle-plugin:2.9.1:check (checkstyle-check) @ atlas-distro ---
[INFO] 
[INFO] >>> findbugs-maven-plugin:3.0.1:check (findbugs-check) > :findbugs @ atlas-distro
>>>
[INFO] 
[INFO] --- findbugs-maven-plugin:3.0.1:findbugs (findbugs) @ atlas-distro ---
[INFO] 
[INFO] <<< findbugs-maven-plugin:3.0.1:check (findbugs-check) < :findbugs @ atlas-distro
<<<
[INFO] 
[INFO] 
[INFO] --- findbugs-maven-plugin:3.0.1:check (findbugs-check) @ atlas-distro ---
[INFO] 
[INFO] --- maven-install-plugin:2.5.2:install (default-install) @ atlas-distro ---
[INFO] Installing <https://builds.apache.org/job/Atlas-master-NoTests/ws/distro/target/atlas-distro-1.0.0-SNAPSHOT.jar>
to /home/jenkins/.m2/repository/org/apache/atlas/atlas-distro/1.0.0-SNAPSHOT/atlas-distro-1.0.0-SNAPSHOT.jar
[INFO] Installing <https://builds.apache.org/job/Atlas-master-NoTests/ws/distro/pom.xml>
to /home/jenkins/.m2/repository/org/apache/atlas/atlas-distro/1.0.0-SNAPSHOT/atlas-distro-1.0.0-SNAPSHOT.pom
[INFO] Installing <https://builds.apache.org/job/Atlas-master-NoTests/163/artifact/distro/target/apache-atlas-1.0.0-SNAPSHOT-bin.tar.gz>
to /home/jenkins/.m2/repository/org/apache/atlas/atlas-distro/1.0.0-SNAPSHOT/atlas-distro-1.0.0-SNAPSHOT-bin.tar.gz
[INFO] Installing <https://builds.apache.org/job/Atlas-master-NoTests/163/artifact/distro/target/apache-atlas-1.0.0-SNAPSHOT-sources.tar.gz>
to /home/jenkins/.m2/repository/org/apache/atlas/atlas-distro/1.0.0-SNAPSHOT/atlas-distro-1.0.0-SNAPSHOT-sources.tar.gz
[INFO] Installing <https://builds.apache.org/job/Atlas-master-NoTests/ws/distro/target/atlas-distro-1.0.0-SNAPSHOT-sources.jar>
to /home/jenkins/.m2/repository/org/apache/atlas/atlas-distro/1.0.0-SNAPSHOT/atlas-distro-1.0.0-SNAPSHOT-sources.jar
[INFO] Installing <https://builds.apache.org/job/Atlas-master-NoTests/ws/distro/target/atlas-distro-1.0.0-SNAPSHOT-test-sources.jar>
to /home/jenkins/.m2/repository/org/apache/atlas/atlas-distro/1.0.0-SNAPSHOT/atlas-distro-1.0.0-SNAPSHOT-test-sources.jar
[INFO] ------------------------------------------------------------------------
[INFO] Reactor Summary:
[INFO] 
[INFO] Apache Atlas Server Build Tools .................... SUCCESS [  0.581 s]
[INFO] apache-atlas ....................................... SUCCESS [  2.810 s]
[INFO] Apache Atlas Integration ........................... SUCCESS [  5.513 s]
[INFO] Apache Atlas Common ................................ SUCCESS [  3.619 s]
[INFO] Apache Atlas Client ................................ SUCCESS [  0.153 s]
[INFO] atlas-client-common ................................ SUCCESS [  0.790 s]
[INFO] atlas-client-v1 .................................... SUCCESS [  1.757 s]
[INFO] Apache Atlas Server API ............................ SUCCESS [  1.640 s]
[INFO] Apache Atlas Notification .......................... SUCCESS [  2.370 s]
[INFO] atlas-client-v2 .................................... SUCCESS [  0.526 s]
[INFO] Apache Atlas Graph Database Projects ............... SUCCESS [  0.088 s]
[INFO] Apache Atlas Graph Database API .................... SUCCESS [  1.451 s]
[INFO] Graph Database Common Code ......................... SUCCESS [  1.599 s]
[INFO] Apache Atlas JanusGraph DB Impl .................... SUCCESS [  7.927 s]
[INFO] Apache Atlas Graph Database Implementation Dependencies SUCCESS [  1.564 s]
[INFO] Shaded version of Apache hbase client .............. SUCCESS [  7.759 s]
[INFO] Apache Atlas Titan 0.5.4 Graph DB Impl ............. SUCCESS [ 25.759 s]
[INFO] Apache Atlas Titan 1.0.0 GraphDB Impl .............. SUCCESS [ 21.322 s]
[INFO] Shaded version of Apache hbase server .............. SUCCESS [ 20.092 s]
[INFO] Apache Atlas Repository ............................ SUCCESS [  4.602 s]
[INFO] Apache Atlas Authorization ......................... SUCCESS [  1.473 s]
[INFO] Apache Atlas UI .................................... SUCCESS [01:01 min]
[INFO] Apache Atlas Web Application ....................... SUCCESS [ 26.718 s]
[INFO] Apache Atlas Documentation ......................... SUCCESS [  3.440 s]
[INFO] Apache Atlas FileSystem Model ...................... SUCCESS [  1.921 s]
[INFO] Apache Atlas Plugin Classloader .................... SUCCESS [  0.633 s]
[INFO] Apache Atlas Hive Bridge Shim ...................... SUCCESS [  0.845 s]
[INFO] Apache Atlas Hive Bridge ........................... SUCCESS [  4.084 s]
[INFO] Apache Atlas Falcon Bridge Shim .................... SUCCESS [  0.932 s]
[INFO] Apache Atlas Falcon Bridge ......................... SUCCESS [  2.005 s]
[INFO] Apache Atlas Sqoop Bridge Shim ..................... SUCCESS [  0.132 s]
[INFO] Apache Atlas Sqoop Bridge .......................... SUCCESS [  2.393 s]
[INFO] Apache Atlas Storm Bridge Shim ..................... SUCCESS [  0.360 s]
[INFO] Apache Atlas Storm Bridge .......................... SUCCESS [  2.806 s]
[INFO] Apache Atlas Hbase Bridge Shim ..................... SUCCESS [  2.320 s]
[INFO] Apache Atlas Hbase Bridge .......................... SUCCESS [  4.985 s]
[INFO] Apache Atlas Distribution .......................... SUCCESS [ 17.968 s]
[INFO] ------------------------------------------------------------------------
[INFO] BUILD SUCCESS
[INFO] ------------------------------------------------------------------------
[INFO] Total time: 04:07 min
[INFO] Finished at: 2017-11-20T20:20:23Z
[INFO] Final Memory: 258M/2150M
[INFO] ------------------------------------------------------------------------
+ mvn deploy
Java HotSpot(TM) 64-Bit Server VM warning: ignoring option MaxPermSize=1024m; support was
removed in 8.0
[INFO] Scanning for projects...
[WARNING] 
[WARNING] Some problems were encountered while building the effective model for org.apache.atlas:atlas-graphdb-titan0:jar:1.0.0-SNAPSHOT
[WARNING] 'dependencies.dependency.(groupId:artifactId:type:classifier)' must be unique: org.apache.solr:solr-solrj:jar
-> version (?) vs ${solr.version} @ org.apache.atlas:atlas-graphdb-titan0:[unknown-version],
<https://builds.apache.org/job/Atlas-master-NoTests/ws/graphdb/titan0/pom.xml,> line
194, column 21
[WARNING] 'dependencies.dependency.(groupId:artifactId:type:classifier)' must be unique: org.apache.solr:solr-core:jar
-> version (?) vs ${solr.version} @ org.apache.atlas:atlas-graphdb-titan0:[unknown-version],
<https://builds.apache.org/job/Atlas-master-NoTests/ws/graphdb/titan0/pom.xml,> line
200, column 21
[WARNING] 
[WARNING] Some problems were encountered while building the effective model for org.apache.atlas:atlas-graphdb-titan1:jar:1.0.0-SNAPSHOT
[WARNING] 'dependencies.dependency.(groupId:artifactId:type:classifier)' must be unique: org.apache.solr:solr-solrj:jar
-> version (?) vs ${solr.version} @ org.apache.atlas:atlas-graphdb-titan1:[unknown-version],
<https://builds.apache.org/job/Atlas-master-NoTests/ws/graphdb/titan1/pom.xml,> line
150, column 21
[WARNING] 'dependencies.dependency.(groupId:artifactId:type:classifier)' must be unique: org.apache.solr:solr-core:jar
-> version (?) vs ${solr.version} @ org.apache.atlas:atlas-graphdb-titan1:[unknown-version],
<https://builds.apache.org/job/Atlas-master-NoTests/ws/graphdb/titan1/pom.xml,> line
156, column 21
[WARNING] 
[WARNING] It is highly recommended to fix these problems because they threaten the stability
of your build.
[WARNING] 
[WARNING] For this reason, future Maven versions might no longer support building such malformed
projects.
[WARNING] 
[WARNING] The project org.apache.atlas:apache-atlas:pom:1.0.0-SNAPSHOT uses prerequisites
which is only intended for maven-plugin projects but not for non maven-plugin projects. For
such purposes you should use the maven-enforcer-plugin. See https://maven.apache.org/enforcer/enforcer-rules/requireMavenVersion.html
[INFO] ------------------------------------------------------------------------
[INFO] Reactor Build Order:
[INFO] 
[INFO] Apache Atlas Server Build Tools
[INFO] apache-atlas
[INFO] Apache Atlas Integration
[INFO] Apache Atlas Common
[INFO] Apache Atlas Client
[INFO] atlas-client-common
[INFO] atlas-client-v1
[INFO] Apache Atlas Server API
[INFO] Apache Atlas Notification
[INFO] atlas-client-v2
[INFO] Apache Atlas Graph Database Projects
[INFO] Apache Atlas Graph Database API
[INFO] Graph Database Common Code
[INFO] Apache Atlas JanusGraph DB Impl
[INFO] Apache Atlas Graph Database Implementation Dependencies
[INFO] Shaded version of Apache hbase client
[INFO] Apache Atlas Titan 0.5.4 Graph DB Impl
[INFO] Apache Atlas Titan 1.0.0 GraphDB Impl
[INFO] Shaded version of Apache hbase server
[INFO] Apache Atlas Repository
[INFO] Apache Atlas Authorization
[INFO] Apache Atlas UI
[INFO] Apache Atlas Web Application
[INFO] Apache Atlas Documentation
[INFO] Apache Atlas FileSystem Model
[INFO] Apache Atlas Plugin Classloader
[INFO] Apache Atlas Hive Bridge Shim
[INFO] Apache Atlas Hive Bridge
[INFO] Apache Atlas Falcon Bridge Shim
[INFO] Apache Atlas Falcon Bridge
[INFO] Apache Atlas Sqoop Bridge Shim
[INFO] Apache Atlas Sqoop Bridge
[INFO] Apache Atlas Storm Bridge Shim
[INFO] Apache Atlas Storm Bridge
[INFO] Apache Atlas Hbase Bridge Shim
[INFO] Apache Atlas Hbase Bridge
[INFO] Apache Atlas Distribution
[INFO] 
[INFO] ------------------------------------------------------------------------
[INFO] Building Apache Atlas Server Build Tools 1.0
[INFO] ------------------------------------------------------------------------
[INFO] 
[INFO] --- maven-resources-plugin:2.6:resources (default-resources) @ atlas-buildtools ---
[WARNING] Using platform encoding (UTF-8 actually) to copy filtered resources, i.e. build
is platform dependent!
[INFO] Copying 6 resources
[INFO] 
[INFO] --- maven-compiler-plugin:3.1:compile (default-compile) @ atlas-buildtools ---
[INFO] No sources to compile
[INFO] 
[INFO] --- maven-resources-plugin:2.6:testResources (default-testResources) @ atlas-buildtools
---
[WARNING] Using platform encoding (UTF-8 actually) to copy filtered resources, i.e. build
is platform dependent!
[INFO] skip non existing resourceDirectory <https://builds.apache.org/job/Atlas-master-NoTests/ws/build-tools/src/test/resources>
[INFO] 
[INFO] --- maven-compiler-plugin:3.1:testCompile (default-testCompile) @ atlas-buildtools
---
[INFO] No sources to compile
[INFO] 
[INFO] --- maven-surefire-plugin:2.12.4:test (default-test) @ atlas-buildtools ---
[INFO] No tests to run.
[INFO] 
[INFO] --- maven-jar-plugin:2.4:jar (default-jar) @ atlas-buildtools ---
[INFO] 
[INFO] --- maven-install-plugin:2.4:install (default-install) @ atlas-buildtools ---
[INFO] Installing <https://builds.apache.org/job/Atlas-master-NoTests/ws/build-tools/target/atlas-buildtools-1.0.jar>
to /home/jenkins/.m2/repository/org/apache/atlas/atlas-buildtools/1.0/atlas-buildtools-1.0.jar
[INFO] Installing <https://builds.apache.org/job/Atlas-master-NoTests/ws/build-tools/pom.xml>
to /home/jenkins/.m2/repository/org/apache/atlas/atlas-buildtools/1.0/atlas-buildtools-1.0.pom
[INFO] 
[INFO] --- maven-deploy-plugin:2.7:deploy (default-deploy) @ atlas-buildtools ---
[INFO] ------------------------------------------------------------------------
[INFO] Reactor Summary:
[INFO] 
[INFO] Apache Atlas Server Build Tools .................... FAILURE [  0.578 s]
[INFO] apache-atlas ....................................... SKIPPED
[INFO] Apache Atlas Integration ........................... SKIPPED
[INFO] Apache Atlas Common ................................ SKIPPED
[INFO] Apache Atlas Client ................................ SKIPPED
[INFO] atlas-client-common ................................ SKIPPED
[INFO] atlas-client-v1 .................................... SKIPPED
[INFO] Apache Atlas Server API ............................ SKIPPED
[INFO] Apache Atlas Notification .......................... SKIPPED
[INFO] atlas-client-v2 .................................... SKIPPED
[INFO] Apache Atlas Graph Database Projects ............... SKIPPED
[INFO] Apache Atlas Graph Database API .................... SKIPPED
[INFO] Graph Database Common Code ......................... SKIPPED
[INFO] Apache Atlas JanusGraph DB Impl .................... SKIPPED
[INFO] Apache Atlas Graph Database Implementation Dependencies SKIPPED
[INFO] Shaded version of Apache hbase client .............. SKIPPED
[INFO] Apache Atlas Titan 0.5.4 Graph DB Impl ............. SKIPPED
[INFO] Apache Atlas Titan 1.0.0 GraphDB Impl .............. SKIPPED
[INFO] Shaded version of Apache hbase server .............. SKIPPED
[INFO] Apache Atlas Repository ............................ SKIPPED
[INFO] Apache Atlas Authorization ......................... SKIPPED
[INFO] Apache Atlas UI .................................... SKIPPED
[INFO] Apache Atlas Web Application ....................... SKIPPED
[INFO] Apache Atlas Documentation ......................... SKIPPED
[INFO] Apache Atlas FileSystem Model ...................... SKIPPED
[INFO] Apache Atlas Plugin Classloader .................... SKIPPED
[INFO] Apache Atlas Hive Bridge Shim ...................... SKIPPED
[INFO] Apache Atlas Hive Bridge ........................... SKIPPED
[INFO] Apache Atlas Falcon Bridge Shim .................... SKIPPED
[INFO] Apache Atlas Falcon Bridge ......................... SKIPPED
[INFO] Apache Atlas Sqoop Bridge Shim ..................... SKIPPED
[INFO] Apache Atlas Sqoop Bridge .......................... SKIPPED
[INFO] Apache Atlas Storm Bridge Shim ..................... SKIPPED
[INFO] Apache Atlas Storm Bridge .......................... SKIPPED
[INFO] Apache Atlas Hbase Bridge Shim ..................... SKIPPED
[INFO] Apache Atlas Hbase Bridge .......................... SKIPPED
[INFO] Apache Atlas Distribution .......................... SKIPPED
[INFO] ------------------------------------------------------------------------
[INFO] BUILD FAILURE
[INFO] ------------------------------------------------------------------------
[INFO] Total time: 1.830 s
[INFO] Finished at: 2017-11-20T20:20:27Z
[INFO] Final Memory: 39M/1447M
[INFO] ------------------------------------------------------------------------
[ERROR] Failed to execute goal org.apache.maven.plugins:maven-deploy-plugin:2.7:deploy (default-deploy)
on project atlas-buildtools: Deployment failed: repository element was not specified in the
POM inside distributionManagement element or in -DaltDeploymentRepository=id::layout::url
parameter -> [Help 1]
[ERROR] 
[ERROR] To see the full stack trace of the errors, re-run Maven with the -e switch.
[ERROR] Re-run Maven using the -X switch to enable full debug logging.
[ERROR] 
[ERROR] For more information about the errors and possible solutions, please read the following
articles:
[ERROR] [Help 1] http://cwiki.apache.org/confluence/display/MAVEN/MojoExecutionException
Build step 'Execute shell' marked build as failure
[CHECKSTYLE] Collecting checkstyle analysis files...
[CHECKSTYLE] Searching for all files in <https://builds.apache.org/job/Atlas-master-NoTests/ws/>
that match the pattern **/target/checkstyle-result.xml
[CHECKSTYLE] No files found. Configuration error?
<Git Blamer> Using GitBlamer to create author and commit information for all warnings.
<Git Blamer> GIT_COMMIT=4a8777b40e641584c088e6e9bc14145f72f681c0, workspace=<https://builds.apache.org/job/Atlas-master-NoTests/ws/>
[CHECKSTYLE] Computing warning deltas based on reference build #160
[FINDBUGS] Collecting findbugs analysis files...
[FINDBUGS] Searching for all files in <https://builds.apache.org/job/Atlas-master-NoTests/ws/>
that match the pattern **/target/findbugs.xml
[FINDBUGS] No files found. Configuration error?
<Git Blamer> Using GitBlamer to create author and commit information for all warnings.
<Git Blamer> GIT_COMMIT=4a8777b40e641584c088e6e9bc14145f72f681c0, workspace=<https://builds.apache.org/job/Atlas-master-NoTests/ws/>
[FINDBUGS] Computing warning deltas based on reference build #160
Archiving artifacts
[Fast Archiver] Compressed 291.76 MB of artifacts by 33.2% relative to #160
TestNG Reports Processing: START
Looking for TestNG results report in workspace using pattern: **/target/surefire-reports/testng-results.xml,**/target/failsafe-reports/testng-results.xml
Did not find any matching files.

Mime
View raw message