atlas-dev mailing list archives

Site index · List index
Message view « Date » · « Thread »
Top « Date » · « Thread »
From Apache Jenkins Server <jenk...@builds.apache.org>
Subject Build failed in Jenkins: Atlas-master-IntegrationTests #177
Date Fri, 03 Nov 2017 03:01:56 GMT
See <https://builds.apache.org/job/Atlas-master-IntegrationTests/177/display/redirect>

------------------------------------------
[...truncated 565.29 KB...]
127.0.0.1 - - [03/Nov/2017:02:56:25 +0000] "GET /api/atlas/entities/37a3f8f7-4c54-48e5-80d1-ad9941d974f8
HTTP/1.1" 200 711 "-" "Java/1.8.0_152"
127.0.0.1 - - [03/Nov/2017:02:56:25 +0000] "POST /api/atlas/entities HTTP/1.1" 201 854 "-"
"Java/1.8.0_152"
127.0.0.1 - - [03/Nov/2017:02:56:25 +0000] "POST /api/atlas/entities HTTP/1.1" 201 854 "-"
"Java/1.8.0_152"
127.0.0.1 - - [03/Nov/2017:02:56:25 +0000] "DELETE /api/atlas/entities?guid=8f7d4c83-b067-4e5e-8370-ac6b134cdf38&guid=5e6d815f-c325-4d0e-8fff-21dfa1242c51
HTTP/1.1" 200 173 "-" "Java/1.8.0_152"
127.0.0.1 - - [03/Nov/2017:02:56:25 +0000] "GET /api/atlas/entities/5e6d815f-c325-4d0e-8fff-21dfa1242c51
HTTP/1.1" 200 711 "-" "Java/1.8.0_152"
127.0.0.1 - - [03/Nov/2017:02:56:25 +0000] "GET /api/atlas/entities/8f7d4c83-b067-4e5e-8370-ac6b134cdf38
HTTP/1.1" 200 711 "-" "Java/1.8.0_152"
127.0.0.1 - - [03/Nov/2017:02:56:25 +0000] "POST /api/atlas/entities HTTP/1.1" 201 854 "-"
"Java/1.8.0_152"
127.0.0.1 - - [03/Nov/2017:02:56:26 +0000] "DELETE /api/atlas/entities?type=hive_db&property=qualifiedName&value=LThGacFFkE
HTTP/1.1" 200 134 "-" "Java/1.8.0_152"
127.0.0.1 - - [03/Nov/2017:02:56:26 +0000] "GET /api/atlas/entities/93303a0c-64ed-46ab-87bb-42d501eae84b
HTTP/1.1" 200 711 "-" "Java/1.8.0_152"
127.0.0.1 - - [03/Nov/2017:02:56:26 +0000] "POST /api/atlas/entities HTTP/1.1" 201 861 "-"
"Java/1.8.0_152"
127.0.0.1 - - [03/Nov/2017:02:56:26 +0000] "POST /api/atlas/entities HTTP/1.1" 201 2268 "-"
"Java/1.8.0_152"
127.0.0.1 - - [03/Nov/2017:02:56:26 +0000] "GET /api/atlas/v2/types/typedef/name/PII_TraitX6UAiAJHVK
HTTP/1.1" 404 96 "-" "Java/1.8.0_152"
127.0.0.1 - - [03/Nov/2017:02:56:26 +0000] "POST /api/atlas/types HTTP/1.1" 201 111 "-" "Java/1.8.0_152"
127.0.0.1 - - [03/Nov/2017:02:56:26 +0000] "DELETE /api/atlas/entities/aca8aa09-953e-472e-ad0e-adfdd3524523/traits/PII_TraitX6UAiAJHVK
HTTP/1.1" 404 64 "-" "Java/1.8.0_152"
127.0.0.1 - - [03/Nov/2017:02:56:26 +0000] "POST /api/atlas/entities HTTP/1.1" 201 861 "-"
"Java/1.8.0_152"
127.0.0.1 - - [03/Nov/2017:02:56:26 +0000] "POST /api/atlas/entities HTTP/1.1" 201 2268 "-"
"Java/1.8.0_152"
127.0.0.1 - - [03/Nov/2017:02:56:26 +0000] "GET /api/atlas/v2/types/typedef/name/PII_TraitYRh2w8zjBL
HTTP/1.1" 404 96 "-" "Java/1.8.0_152"
127.0.0.1 - - [03/Nov/2017:02:56:26 +0000] "POST /api/atlas/types HTTP/1.1" 201 111 "-" "Java/1.8.0_152"
127.0.0.1 - - [03/Nov/2017:02:56:27 +0000] "POST /api/atlas/entities/31dc7ff4-629c-4c23-9006-732c502e1291/traits
HTTP/1.1" 201 70 "-" "Java/1.8.0_152"
127.0.0.1 - - [03/Nov/2017:02:56:27 +0000] "GET /api/atlas/entities/31dc7ff4-629c-4c23-9006-732c502e1291/audit?count=100
HTTP/1.1" 200 6715 "-" "Java/1.8.0_152"
127.0.0.1 - - [03/Nov/2017:02:56:27 +0000] "DELETE /api/atlas/entities/31dc7ff4-629c-4c23-9006-732c502e1291/traits/PII_TraitYRh2w8zjBL
HTTP/1.1" 200 104 "-" "Java/1.8.0_152"
127.0.0.1 - - [03/Nov/2017:02:56:27 +0000] "GET /api/atlas/entities/31dc7ff4-629c-4c23-9006-732c502e1291/traitDefinitions/PII_TraitYRh2w8zjBL
HTTP/1.1" 404 64 "-" "Java/1.8.0_152"
127.0.0.1 - - [03/Nov/2017:02:56:27 +0000] "GET /api/atlas/entities/31dc7ff4-629c-4c23-9006-732c502e1291/audit?count=100
HTTP/1.1" 200 8800 "-" "Java/1.8.0_152"
127.0.0.1 - - [03/Nov/2017:02:56:27 +0000] "POST /api/atlas/entities HTTP/1.1" 201 861 "-"
"Java/1.8.0_152"
127.0.0.1 - - [03/Nov/2017:02:56:27 +0000] "POST /api/atlas/entities HTTP/1.1" 201 2268 "-"
"Java/1.8.0_152"
127.0.0.1 - - [03/Nov/2017:02:56:27 +0000] "DELETE /api/atlas/entities/240501ea-9253-4603-94ef-7161b745b410/traits/blah_trait
HTTP/1.1" 404 55 "-" "Java/1.8.0_152"
127.0.0.1 - - [03/Nov/2017:02:56:27 +0000] "POST /api/atlas/entities HTTP/1.1" 201 861 "-"
"Java/1.8.0_152"
127.0.0.1 - - [03/Nov/2017:02:56:27 +0000] "GET /api/atlas/entities/5c04d32b-b66a-4242-a038-1743d1661a61/audit?count=100
HTTP/1.1" 200 1588 "-" "Java/1.8.0_152"
127.0.0.1 - - [03/Nov/2017:02:56:27 +0000] "GET /api/atlas/discovery/search/dsl?query=hive_db+where+qualifiedName%3D'dbROzgLJvSFi'&limit=10&offset=0
HTTP/1.1" 200 1602 "-" "Java/1.8.0_152"
127.0.0.1 - - [03/Nov/2017:02:56:28 +0000] "POST /api/atlas/entities HTTP/1.1" 201 861 "-"
"Java/1.8.0_152"
127.0.0.1 - - [03/Nov/2017:02:56:28 +0000] "GET /api/atlas/discovery/search/dsl?query=hive_db+where+qualifiedName%3D'dbROzgLJvSFi'&limit=10&offset=0
HTTP/1.1" 200 1602 "-" "Java/1.8.0_152"
127.0.0.1 - - [03/Nov/2017:02:56:29 +0000] "POST /api/atlas/entities HTTP/1.1" 201 2258 "-"
"Java/1.8.0_152"
127.0.0.1 - - [03/Nov/2017:02:56:29 +0000] "GET /api/atlas/discovery/search/dsl?query=hive_db+where+qualifiedName%3D'dbROzgLJvSFi'&limit=10&offset=0
HTTP/1.1" 200 1602 "-" "Java/1.8.0_152"
127.0.0.1 - - [03/Nov/2017:02:56:30 +0000] "POST /api/atlas/types HTTP/1.1" 201 102 "-" "Java/1.8.0_152"
127.0.0.1 - - [03/Nov/2017:02:56:30 +0000] "POST /api/atlas/entities HTTP/1.1" 201 714 "-"
"Java/1.8.0_152"
127.0.0.1 - - [03/Nov/2017:02:56:30 +0000] "PUT /api/atlas/types HTTP/1.1" 200 102 "-" "Java/1.8.0_152"
127.0.0.1 - - [03/Nov/2017:02:56:31 +0000] "GET /api/atlas/entities/6e86d5bc-fb43-43b6-bce5-f8d4b7c6ac29
HTTP/1.1" 200 589 "-" "Java/1.8.0_152"
127.0.0.1 - - [03/Nov/2017:02:56:31 +0000] "POST /api/atlas/entities HTTP/1.1" 400 146 "-"
"Java/1.8.0_152"
127.0.0.1 - - [03/Nov/2017:02:56:31 +0000] "POST /api/atlas/entities HTTP/1.1" 400 146 "-"
"Java/1.8.0_152"
127.0.0.1 - - [03/Nov/2017:02:56:31 +0000] "POST /api/atlas/entities HTTP/1.1" 201 854 "-"
"Java/1.8.0_152"
127.0.0.1 - - [03/Nov/2017:02:56:31 +0000] "GET /api/atlas/entities?type=hive_db&property=qualifiedName&value=MS2FcO1KsT
HTTP/1.1" 200 710 "-" "Java/1.8.0_152"
127.0.0.1 - - [03/Nov/2017:02:56:31 +0000] "POST /api/atlas/entities HTTP/1.1" 201 861 "-"
"Java/1.8.0_152"
127.0.0.1 - - [03/Nov/2017:02:56:31 +0000] "POST /api/atlas/entities HTTP/1.1" 201 2268 "-"
"Java/1.8.0_152"
127.0.0.1 - - [03/Nov/2017:02:56:31 +0000] "GET /api/atlas/entities/5306b492-891f-4b8e-a729-36f8bab1d4d6
HTTP/1.1" 200 2073 "-" "Java/1.8.0_152"
127.0.0.1 - - [03/Nov/2017:02:56:31 +0000] "POST /api/atlas/entities HTTP/1.1" 201 861 "-"
"Java/1.8.0_152"
127.0.0.1 - - [03/Nov/2017:02:56:31 +0000] "POST /api/atlas/entities HTTP/1.1" 201 2268 "-"
"Java/1.8.0_152"
127.0.0.1 - - [03/Nov/2017:02:56:31 +0000] "GET /api/atlas/entities?type=hive_table HTTP/1.1"
200 741 "-" "Java/1.8.0_152"
127.0.0.1 - - [03/Nov/2017:02:56:31 +0000] "GET /api/atlas/entities?type=blah HTTP/1.1" 400
34 "-" "Java/1.8.0_152"
127.0.0.1 - - [03/Nov/2017:02:56:31 +0000] "GET /api/atlas/v2/types/typedef/name/testNpUcbgBArg
HTTP/1.1" 404 91 "-" "Java/1.8.0_152"
127.0.0.1 - - [03/Nov/2017:02:56:31 +0000] "POST /api/atlas/types HTTP/1.1" 201 106 "-" "Java/1.8.0_152"
127.0.0.1 - - [03/Nov/2017:02:56:32 +0000] "GET /api/atlas/entities?type=testNpUcbgBArg HTTP/1.1"
200 121 "-" "Java/1.8.0_152"
127.0.0.1 - - [03/Nov/2017:02:56:32 +0000] "GET /api/atlas/entities/blah HTTP/1.1" 404 72
"-" "Java/1.8.0_152"
127.0.0.1 - - [03/Nov/2017:02:56:32 +0000] "POST /api/atlas/entities HTTP/1.1" 201 861 "-"
"Java/1.8.0_152"
127.0.0.1 - - [03/Nov/2017:02:56:32 +0000] "POST /api/atlas/entities HTTP/1.1" 201 2268 "-"
"Java/1.8.0_152"
127.0.0.1 - - [03/Nov/2017:02:56:32 +0000] "GET /api/atlas/v2/types/typedef/name/PII_TraitGxItBgJNZ6
HTTP/1.1" 404 96 "-" "Java/1.8.0_152"
127.0.0.1 - - [03/Nov/2017:02:56:32 +0000] "POST /api/atlas/types HTTP/1.1" 201 111 "-" "Java/1.8.0_152"
127.0.0.1 - - [03/Nov/2017:02:56:32 +0000] "POST /api/atlas/entities/0fb4e879-17b9-41fc-84f6-4cbb958fafea/traits
HTTP/1.1" 201 70 "-" "Java/1.8.0_152"
127.0.0.1 - - [03/Nov/2017:02:56:32 +0000] "GET /api/atlas/entities/0fb4e879-17b9-41fc-84f6-4cbb958fafea/traitDefinitions/PII_TraitGxItBgJNZ6
HTTP/1.1" 200 204 "-" "Java/1.8.0_152"
127.0.0.1 - - [03/Nov/2017:02:56:32 +0000] "GET /api/atlas/entities/0fb4e879-17b9-41fc-84f6-4cbb958fafea/traitDefinitions
HTTP/1.1" 200 1033 "-" "Java/1.8.0_152"
127.0.0.1 - - [03/Nov/2017:02:56:32 +0000] "POST /api/atlas/entities HTTP/1.1" 201 861 "-"
"Java/1.8.0_152"
127.0.0.1 - - [03/Nov/2017:02:56:32 +0000] "POST /api/atlas/entities HTTP/1.1" 201 2268 "-"
"Java/1.8.0_152"
127.0.0.1 - - [03/Nov/2017:02:56:33 +0000] "GET /api/atlas/entities/c9cea276-f73c-4a58-a913-729ddc608329/traits
HTTP/1.1" 200 173 "-" "Java/1.8.0_152"
127.0.0.1 - - [03/Nov/2017:02:56:33 +0000] "POST /api/atlas/entities HTTP/1.1" 201 861 "-"
"Java/1.8.0_152"
127.0.0.1 - - [03/Nov/2017:02:56:33 +0000] "POST /api/atlas/entities HTTP/1.1" 201 2268 "-"
"Java/1.8.0_152"
127.0.0.1 - - [03/Nov/2017:02:56:33 +0000] "POST /api/atlas/entities/90aa3b07-9b27-458e-b981-8a52a6ffc398
HTTP/1.1" 200 1133 "-" "Java/1.8.0_152"
127.0.0.1 - - [03/Nov/2017:02:56:33 +0000] "GET /api/atlas/entities/90aa3b07-9b27-458e-b981-8a52a6ffc398
HTTP/1.1" 200 2886 "-" "Java/1.8.0_152"
127.0.0.1 - - [03/Nov/2017:02:56:33 +0000] "POST /api/atlas/entities HTTP/1.1" 201 861 "-"
"Java/1.8.0_152"
127.0.0.1 - - [03/Nov/2017:02:56:33 +0000] "POST /api/atlas/entities HTTP/1.1" 201 2268 "-"
"Java/1.8.0_152"
127.0.0.1 - - [03/Nov/2017:02:56:33 +0000] "POST /api/atlas/entities/qualifiedName?type=hive_table&property=qualifiedName&value=tableIRDdKCUw28
HTTP/1.1" 200 1130 "-" "Java/1.8.0_152"
127.0.0.1 - - [03/Nov/2017:02:56:33 +0000] "GET /api/atlas/entities/f2e2de65-539f-4ef2-ad96-febd3fd99755
HTTP/1.1" 200 2883 "-" "Java/1.8.0_152"
127.0.0.1 - - [03/Nov/2017:02:56:34 +0000] "POST /api/atlas/entities HTTP/1.1" 201 854 "-"
"Java/1.8.0_152"
127.0.0.1 - - [03/Nov/2017:02:56:34 +0000] "GET /api/atlas/entities/d1b9454f-6ab5-4920-ae35-5a8583019ff3/audit?count=10
HTTP/1.1" 200 1607 "-" "Java/1.8.0_152"
127.0.0.1 - - [03/Nov/2017:02:56:34 +0000] "POST /api/atlas/entities HTTP/1.1" 201 861 "-"
"Java/1.8.0_152"
127.0.0.1 - - [03/Nov/2017:02:56:34 +0000] "POST /api/atlas/entities HTTP/1.1" 201 2268 "-"
"Java/1.8.0_152"
127.0.0.1 - - [03/Nov/2017:02:56:34 +0000] "POST /api/atlas/entities HTTP/1.1" 201 861 "-"
"Java/1.8.0_152"
127.0.0.1 - - [03/Nov/2017:02:56:34 +0000] "POST /api/atlas/entities HTTP/1.1" 400 62 "-"
"Java/1.8.0_152"
127.0.0.1 - - [03/Nov/2017:02:56:34 +0000] "POST /api/atlas/entities HTTP/1.1" 201 854 "-"
"Java/1.8.0_152"
127.0.0.1 - - [03/Nov/2017:02:56:34 +0000] "GET /api/atlas/v2/types/typedef/name/rVPggVbRHq
HTTP/1.1" 404 87 "-" "Java/1.8.0_152"
127.0.0.1 - - [03/Nov/2017:02:56:34 +0000] "POST /api/atlas/types HTTP/1.1" 201 102 "-" "Java/1.8.0_152"
127.0.0.1 - - [03/Nov/2017:02:56:34 +0000] "POST /api/atlas/entities HTTP/1.1" 201 758 "-"
"Java/1.8.0_152"
127.0.0.1 - - [03/Nov/2017:02:56:35 +0000] "GET /api/atlas/entities/1e56e050-ad16-41d4-bb04-01a414bdc7ac
HTTP/1.1" 200 614 "-" "Java/1.8.0_152"
Tests run: 136, Failures: 2, Errors: 0, Skipped: 0, Time elapsed: 211.764 sec <<<
FAILURE! - in TestSuite
testSimpleLoginAndAuthorizationWithValidCrendentialsAndInvalidAccessToResource(org.apache.atlas.web.filters.AtlasAuthenticationSimpleFilterIT)
 Time elapsed: 0.028 sec  <<< FAILURE!
java.lang.AssertionError: expected [403] but found [500]
	at org.testng.Assert.fail(Assert.java:94)
	at org.testng.Assert.failNotEquals(Assert.java:496)
	at org.testng.Assert.assertEquals(Assert.java:125)
	at org.testng.Assert.assertEquals(Assert.java:372)
	at org.testng.Assert.assertEquals(Assert.java:382)
	at org.apache.atlas.web.filters.AtlasAuthenticationSimpleFilterIT.testSimpleLoginAndAuthorizationWithValidCrendentialsAndInvalidAccessToResource(AtlasAuthenticationSimpleFilterIT.java:74)

testLineageIsMaintained(org.apache.atlas.examples.QuickStartIT)  Time elapsed: 2.122 sec 
<<< FAILURE!
java.lang.AssertionError: 
	at org.testng.AssertJUnit.fail(AssertJUnit.java:59)
	at org.testng.AssertJUnit.assertTrue(AssertJUnit.java:24)
	at org.testng.AssertJUnit.assertTrue(AssertJUnit.java:33)
	at org.apache.atlas.examples.QuickStartIT.testLineageIsMaintained(QuickStartIT.java:130)


Results :

Failed tests: 
  QuickStartIT.testLineageIsMaintained:130 
  AtlasAuthenticationSimpleFilterIT.testSimpleLoginAndAuthorizationWithValidCrendentialsAndInvalidAccessToResource:74
expected [403] but found [500]

Tests run: 136, Failures: 2, Errors: 0, Skipped: 0

[INFO] 
[INFO] --- jetty-maven-plugin:9.4.0.v20161208:stop (stop-jetty) @ atlas-webapp ---
[INFO] Waiting 10 seconds for jetty to stop
[INFO] Stopped ServerConnector@75fb1578{HTTP/1.1,[http/1.1]}{0.0.0.0:31000}
[INFO] Stopped scavenging
[INFO] Closing Spring root WebApplicationContext
[INFO] Shutting down log4j
[INFO] Stopped o.e.j.m.p.JettyWebAppContext@7ca20eae{/,file://<https://builds.apache.org/job/Atlas-master-IntegrationTests/ws/webapp/target/atlas-webapp-1.0.0-SNAPSHOT/,UNAVAILABLE}{/home/jenkins/jenkins-slave/workspace/Atlas-master-IntegrationTests/webapp/target/atlas-webapp-1.0.0-SNAPSHOT.war}>
[INFO] Server reports itself as stopped
[INFO] 
[INFO] --- maven-source-plugin:2.4:jar-no-fork (attach-sources) @ atlas-webapp ---
[INFO] Building jar: <https://builds.apache.org/job/Atlas-master-IntegrationTests/ws/webapp/target/atlas-webapp-1.0.0-SNAPSHOT-sources.jar>
[INFO] 
[INFO] --- maven-source-plugin:2.4:test-jar-no-fork (attach-sources) @ atlas-webapp ---
[INFO] Building jar: <https://builds.apache.org/job/Atlas-master-IntegrationTests/ws/webapp/target/atlas-webapp-1.0.0-SNAPSHOT-test-sources.jar>
[INFO] 
[INFO] --- maven-failsafe-plugin:2.18.1:verify (verify) @ atlas-webapp ---
[INFO] Failsafe report directory: <https://builds.apache.org/job/Atlas-master-IntegrationTests/ws/webapp/target/failsafe-reports>
[INFO] ------------------------------------------------------------------------
[INFO] Reactor Summary:
[INFO] 
[INFO] Apache Atlas Server Build Tools .................... SUCCESS [  1.082 s]
[INFO] apache-atlas ....................................... SUCCESS [  7.043 s]
[INFO] Apache Atlas Integration ........................... SUCCESS [ 21.764 s]
[INFO] Apache Atlas Common ................................ SUCCESS [  7.960 s]
[INFO] Apache Atlas Typesystem ............................ SUCCESS [ 48.945 s]
[INFO] Apache Atlas Client ................................ SUCCESS [  0.769 s]
[INFO] atlas-client-common ................................ SUCCESS [  6.867 s]
[INFO] atlas-client-v1 .................................... SUCCESS [  7.465 s]
[INFO] Apache Atlas Server API ............................ SUCCESS [  6.140 s]
[INFO] Apache Atlas Notification .......................... SUCCESS [ 10.258 s]
[INFO] atlas-client-v2 .................................... SUCCESS [  5.877 s]
[INFO] Apache Atlas Graph Database Projects ............... SUCCESS [  0.585 s]
[INFO] Apache Atlas Graph Database API .................... SUCCESS [  4.770 s]
[INFO] Graph Database Common Code ......................... SUCCESS [  5.170 s]
[INFO] Shaded version of Apache hbase client .............. SUCCESS [  8.811 s]
[INFO] Apache Atlas Titan 0.5.4 Graph DB Impl ............. SUCCESS [ 43.687 s]
[INFO] Apache Atlas Graph Database Implementation Dependencies SUCCESS [  0.661 s]
[INFO] Apache Atlas Titan 1.0.0 GraphDB Impl .............. SUCCESS [ 33.344 s]
[INFO] Apache Atlas JanusGraph DB Impl .................... SUCCESS [ 23.321 s]
[INFO] Shaded version of Apache hbase server .............. SUCCESS [ 23.392 s]
[INFO] Apache Atlas Repository ............................ SUCCESS [01:19 min]
[INFO] Apache Atlas Authorization ......................... SUCCESS [  7.215 s]
[INFO] Apache Atlas UI .................................... SUCCESS [01:37 min]
[INFO] Apache Atlas Web Application ....................... FAILURE [05:10 min]
[INFO] Apache Atlas Documentation ......................... SKIPPED
[INFO] Apache Atlas FileSystem Model ...................... SKIPPED
[INFO] Apache Atlas Plugin Classloader .................... SKIPPED
[INFO] Apache Atlas Hive Bridge Shim ...................... SKIPPED
[INFO] Apache Atlas Hive Bridge ........................... SKIPPED
[INFO] Apache Atlas Falcon Bridge Shim .................... SKIPPED
[INFO] Apache Atlas Falcon Bridge ......................... SKIPPED
[INFO] Apache Atlas Sqoop Bridge Shim ..................... SKIPPED
[INFO] Apache Atlas Sqoop Bridge .......................... SKIPPED
[INFO] Apache Atlas Storm Bridge Shim ..................... SKIPPED
[INFO] Apache Atlas Storm Bridge .......................... SKIPPED
[INFO] Apache Atlas Hbase Bridge Shim ..................... SKIPPED
[INFO] Apache Atlas Hbase Bridge .......................... SKIPPED
[INFO] Apache Atlas Distribution .......................... SKIPPED
[INFO] ------------------------------------------------------------------------
[INFO] BUILD FAILURE
[INFO] ------------------------------------------------------------------------
[INFO] Total time: 12:44 min
[INFO] Finished at: 2017-11-03T02:56:39Z
[INFO] Final Memory: 388M/2883M
[INFO] ------------------------------------------------------------------------
log4j:WARN No appenders could be found for logger (org.apache.zookeeper.ClientCnxn).
log4j:WARN Please initialize the log4j system properly.
log4j:WARN See http://logging.apache.org/log4j/1.2/faq.html#noconfig for more info.
[ERROR] Failed to execute goal org.apache.maven.plugins:maven-failsafe-plugin:2.18.1:verify
(verify) on project atlas-webapp: There are test failures.
[ERROR] 
[ERROR] Please refer to <https://builds.apache.org/job/Atlas-master-IntegrationTests/ws/webapp/target/failsafe-reports>
for the individual test results.
[ERROR] -> [Help 1]
[ERROR] 
[ERROR] To see the full stack trace of the errors, re-run Maven with the -e switch.
[ERROR] Re-run Maven using the -X switch to enable full debug logging.
[ERROR] 
[ERROR] For more information about the errors and possible solutions, please read the following
articles:
[ERROR] [Help 1] http://cwiki.apache.org/confluence/display/MAVEN/MojoFailureException
[ERROR] 
[ERROR] After correcting the problems, you can resume the build with the command
[ERROR]   mvn <goals> -rf :atlas-webapp
Build step 'Execute shell' marked build as failure
[CHECKSTYLE] Collecting checkstyle analysis files...
[CHECKSTYLE] Searching for all files in <https://builds.apache.org/job/Atlas-master-IntegrationTests/ws/>
that match the pattern **/target/checkstyle-result.xml
[CHECKSTYLE] Parsing 22 files in <https://builds.apache.org/job/Atlas-master-IntegrationTests/ws/>
[CHECKSTYLE] Successfully parsed file <https://builds.apache.org/job/Atlas-master-IntegrationTests/ws/authorization/target/checkstyle-result.xml>
with 461 unique warnings and 0 duplicates.
[CHECKSTYLE] Successfully parsed file <https://builds.apache.org/job/Atlas-master-IntegrationTests/ws/client/client-v1/target/checkstyle-result.xml>
with 1336 unique warnings and 0 duplicates.
[CHECKSTYLE] Successfully parsed file <https://builds.apache.org/job/Atlas-master-IntegrationTests/ws/client/client-v2/target/checkstyle-result.xml>
with 1676 unique warnings and 0 duplicates.
[CHECKSTYLE] Successfully parsed file <https://builds.apache.org/job/Atlas-master-IntegrationTests/ws/client/common/target/checkstyle-result.xml>
with 2166 unique warnings and 0 duplicates.
[CHECKSTYLE] Successfully parsed file <https://builds.apache.org/job/Atlas-master-IntegrationTests/ws/client/target/checkstyle-result.xml>
with 2166 unique warnings and 0 duplicates.
[CHECKSTYLE] Successfully parsed file <https://builds.apache.org/job/Atlas-master-IntegrationTests/ws/common/target/checkstyle-result.xml>
with 3131 unique warnings and 0 duplicates.
[CHECKSTYLE] Successfully parsed file <https://builds.apache.org/job/Atlas-master-IntegrationTests/ws/dashboardv2/target/checkstyle-result.xml>
with 3131 unique warnings and 0 duplicates.
[CHECKSTYLE] Successfully parsed file <https://builds.apache.org/job/Atlas-master-IntegrationTests/ws/graphdb/api/target/checkstyle-result.xml>
with 3404 unique warnings and 0 duplicates.
[CHECKSTYLE] Successfully parsed file <https://builds.apache.org/job/Atlas-master-IntegrationTests/ws/graphdb/common/target/checkstyle-result.xml>
with 3597 unique warnings and 0 duplicates.
[CHECKSTYLE] Successfully parsed file <https://builds.apache.org/job/Atlas-master-IntegrationTests/ws/graphdb/graphdb-impls/target/checkstyle-result.xml>
with 3597 unique warnings and 0 duplicates.
[CHECKSTYLE] Successfully parsed file <https://builds.apache.org/job/Atlas-master-IntegrationTests/ws/graphdb/janus/target/checkstyle-result.xml>
with 4588 unique warnings and 0 duplicates.
[CHECKSTYLE] Successfully parsed file <https://builds.apache.org/job/Atlas-master-IntegrationTests/ws/graphdb/target/checkstyle-result.xml>
with 4588 unique warnings and 0 duplicates.
[CHECKSTYLE] Successfully parsed file <https://builds.apache.org/job/Atlas-master-IntegrationTests/ws/graphdb/titan0/target/checkstyle-result.xml>
with 7047 unique warnings and 0 duplicates.
[CHECKSTYLE] Successfully parsed file <https://builds.apache.org/job/Atlas-master-IntegrationTests/ws/graphdb/titan1/target/checkstyle-result.xml>
with 8018 unique warnings and 0 duplicates.
[CHECKSTYLE] Successfully parsed file <https://builds.apache.org/job/Atlas-master-IntegrationTests/ws/intg/target/checkstyle-result.xml>
with 16224 unique warnings and 0 duplicates.
[CHECKSTYLE] Successfully parsed file <https://builds.apache.org/job/Atlas-master-IntegrationTests/ws/notification/target/checkstyle-result.xml>
with 17789 unique warnings and 0 duplicates.
[CHECKSTYLE] Successfully parsed file <https://builds.apache.org/job/Atlas-master-IntegrationTests/ws/repository/target/checkstyle-result.xml>
with 38123 unique warnings and 0 duplicates.
[CHECKSTYLE] Successfully parsed file <https://builds.apache.org/job/Atlas-master-IntegrationTests/ws/server-api/target/checkstyle-result.xml>
with 38516 unique warnings and 0 duplicates.
[CHECKSTYLE] Successfully parsed file <https://builds.apache.org/job/Atlas-master-IntegrationTests/ws/shaded/hbase-client-shaded/target/checkstyle-result.xml>
with 38516 unique warnings and 0 duplicates.
[CHECKSTYLE] Successfully parsed file <https://builds.apache.org/job/Atlas-master-IntegrationTests/ws/shaded/hbase-server-shaded/target/checkstyle-result.xml>
with 38516 unique warnings and 0 duplicates.
[CHECKSTYLE] Successfully parsed file <https://builds.apache.org/job/Atlas-master-IntegrationTests/ws/target/checkstyle-result.xml>
with 38516 unique warnings and 0 duplicates.
[CHECKSTYLE] Successfully parsed file <https://builds.apache.org/job/Atlas-master-IntegrationTests/ws/typesystem/target/checkstyle-result.xml>
with 42734 unique warnings and 0 duplicates.
<Git Blamer> Using GitBlamer to create author and commit information for all warnings.
<Git Blamer> GIT_COMMIT=37be53bbb7eec13f8ce57377c8653f482216553f, workspace=<https://builds.apache.org/job/Atlas-master-IntegrationTests/ws/>
 > git rev-parse 37be53bbb7eec13f8ce57377c8653f482216553f^{commit} # timeout=10
<Git Blamer> Skipping file <https://builds.apache.org/job/Atlas-master-IntegrationTests/ws/graphdb/titan1/src/main/java/org/apache/atlas/repository/graphdb/titan1/graphson/AtlasGraphSONMode.java,>
no result found.
<Git Blamer> Skipping file <https://builds.apache.org/job/Atlas-master-IntegrationTests/ws/typesystem/src/main/java/org/apache/atlas/typesystem/IStruct.java,>
no result found.
<Git Blamer> Skipping file <https://builds.apache.org/job/Atlas-master-IntegrationTests/ws/graphdb/janus/src/main/java/org/apache/atlas/repository/graphdb/janus/graphson/AtlasGraphSONMode.java,>
no result found.
[FINDBUGS] Collecting findbugs analysis files...
[FINDBUGS] Searching for all files in <https://builds.apache.org/job/Atlas-master-IntegrationTests/ws/>
that match the pattern **/target/findbugs.xml
[FINDBUGS] Parsing 15 files in <https://builds.apache.org/job/Atlas-master-IntegrationTests/ws/>
[FINDBUGS] Successfully parsed file <https://builds.apache.org/job/Atlas-master-IntegrationTests/ws/authorization/target/findbugs.xml>
with 0 unique warnings and 0 duplicates.
[FINDBUGS] Successfully parsed file <https://builds.apache.org/job/Atlas-master-IntegrationTests/ws/client/client-v1/target/findbugs.xml>
with 0 unique warnings and 0 duplicates.
[FINDBUGS] Successfully parsed file <https://builds.apache.org/job/Atlas-master-IntegrationTests/ws/client/client-v2/target/findbugs.xml>
with 0 unique warnings and 0 duplicates.
[FINDBUGS] Successfully parsed file <https://builds.apache.org/job/Atlas-master-IntegrationTests/ws/client/common/target/findbugs.xml>
with 0 unique warnings and 0 duplicates.
[FINDBUGS] Successfully parsed file <https://builds.apache.org/job/Atlas-master-IntegrationTests/ws/common/target/findbugs.xml>
with 0 unique warnings and 0 duplicates.
[FINDBUGS] Successfully parsed file <https://builds.apache.org/job/Atlas-master-IntegrationTests/ws/graphdb/api/target/findbugs.xml>
with 0 unique warnings and 0 duplicates.
[FINDBUGS] Successfully parsed file <https://builds.apache.org/job/Atlas-master-IntegrationTests/ws/graphdb/common/target/findbugs.xml>
with 0 unique warnings and 0 duplicates.
[FINDBUGS] Successfully parsed file <https://builds.apache.org/job/Atlas-master-IntegrationTests/ws/graphdb/janus/target/findbugs.xml>
with 0 unique warnings and 0 duplicates.
[FINDBUGS] Successfully parsed file <https://builds.apache.org/job/Atlas-master-IntegrationTests/ws/graphdb/titan0/target/findbugs.xml>
with 0 unique warnings and 0 duplicates.
[FINDBUGS] Successfully parsed file <https://builds.apache.org/job/Atlas-master-IntegrationTests/ws/graphdb/titan1/target/findbugs.xml>
with 0 unique warnings and 0 duplicates.
[FINDBUGS] Successfully parsed file <https://builds.apache.org/job/Atlas-master-IntegrationTests/ws/intg/target/findbugs.xml>
with 0 unique warnings and 0 duplicates.
[FINDBUGS] Successfully parsed file <https://builds.apache.org/job/Atlas-master-IntegrationTests/ws/notification/target/findbugs.xml>
with 0 unique warnings and 0 duplicates.
[FINDBUGS] Successfully parsed file <https://builds.apache.org/job/Atlas-master-IntegrationTests/ws/repository/target/findbugs.xml>
with 0 unique warnings and 0 duplicates.
[FINDBUGS] Successfully parsed file <https://builds.apache.org/job/Atlas-master-IntegrationTests/ws/server-api/target/findbugs.xml>
with 0 unique warnings and 0 duplicates.
[FINDBUGS] Successfully parsed file <https://builds.apache.org/job/Atlas-master-IntegrationTests/ws/typesystem/target/findbugs.xml>
with 0 unique warnings and 0 duplicates.
<Git Blamer> Using GitBlamer to create author and commit information for all warnings.
<Git Blamer> GIT_COMMIT=37be53bbb7eec13f8ce57377c8653f482216553f, workspace=<https://builds.apache.org/job/Atlas-master-IntegrationTests/ws/>
Archiving artifacts
[Fast Archiver] No prior successful build to compare, so performing full copy of artifacts
TestNG Reports Processing: START
Looking for TestNG results report in workspace using pattern: **/target/surefire-reports/testng-results.xml,**/target/failsafe-reports/testng-results.xml
Saving reports...
Processing '/x1/jenkins/jenkins-home/jobs/Atlas-master-IntegrationTests/builds/177/testng/testng-results.xml'
1.470588% of tests failed, which exceeded threshold of 0%. Marking build as UNSTABLE
TestNG Reports Processing: FINISH

Mime
View raw message