atlas-dev mailing list archives

Site index · List index
Message view « Date » · « Thread »
Top « Date » · « Thread »
From Apache Jenkins Server <jenk...@builds.apache.org>
Subject Build failed in Jenkins: Atlas-master-JanusGraph-IntegrationTests #12
Date Thu, 09 Nov 2017 02:15:22 GMT
See <https://builds.apache.org/job/Atlas-master-JanusGraph-IntegrationTests/12/display/redirect?page=changes>

Changes:

[ssubramanian] ATLAS-2253: Remove shading of janus graph-provider module

------------------------------------------
[...truncated 505.91 KB...]
127.0.0.1 - - [09/Nov/2017:02:04:50 +0000] "GET /api/atlas/v2/types/typedef/name/pci_Tag HTTP/1.1"
503 0 "-" "Java/1.8.0_152"
127.0.0.1 - - [09/Nov/2017:02:04:55 +0000] "GET /api/atlas/v2/types/typedef/name/pci_Tag HTTP/1.1"
503 0 "-" "Java/1.8.0_152"
127.0.0.1 - - [09/Nov/2017:02:05:00 +0000] "GET /api/atlas/v2/types/typedef/name/pci_Tag HTTP/1.1"
503 0 "-" "Java/1.8.0_152"
127.0.0.1 - - [09/Nov/2017:02:05:05 +0000] "GET /api/atlas/v2/types/typedef/name/pci_Tag HTTP/1.1"
503 0 "-" "Java/1.8.0_152"
127.0.0.1 - - [09/Nov/2017:02:05:10 +0000] "GET /api/atlas/v2/types/typedef/name/sox_Tag HTTP/1.1"
503 0 "-" "Java/1.8.0_152"
127.0.0.1 - - [09/Nov/2017:02:05:15 +0000] "GET /api/atlas/v2/types/typedef/name/sox_Tag HTTP/1.1"
503 0 "-" "Java/1.8.0_152"
127.0.0.1 - - [09/Nov/2017:02:05:20 +0000] "GET /api/atlas/v2/types/typedef/name/sox_Tag HTTP/1.1"
503 0 "-" "Java/1.8.0_152"
127.0.0.1 - - [09/Nov/2017:02:05:25 +0000] "GET /api/atlas/v2/types/typedef/name/sox_Tag HTTP/1.1"
503 0 "-" "Java/1.8.0_152"
127.0.0.1 - - [09/Nov/2017:02:05:30 +0000] "GET /api/atlas/v2/types/typedef/name/sec_Tag HTTP/1.1"
503 0 "-" "Java/1.8.0_152"
127.0.0.1 - - [09/Nov/2017:02:05:35 +0000] "GET /api/atlas/v2/types/typedef/name/sec_Tag HTTP/1.1"
503 0 "-" "Java/1.8.0_152"
127.0.0.1 - - [09/Nov/2017:02:05:40 +0000] "GET /api/atlas/v2/types/typedef/name/sec_Tag HTTP/1.1"
503 0 "-" "Java/1.8.0_152"
127.0.0.1 - - [09/Nov/2017:02:05:45 +0000] "GET /api/atlas/v2/types/typedef/name/sec_Tag HTTP/1.1"
503 0 "-" "Java/1.8.0_152"
127.0.0.1 - - [09/Nov/2017:02:05:50 +0000] "GET /api/atlas/v2/types/typedef/name/finance_Tag
HTTP/1.1" 503 0 "-" "Java/1.8.0_152"
127.0.0.1 - - [09/Nov/2017:02:05:55 +0000] "GET /api/atlas/v2/types/typedef/name/finance_Tag
HTTP/1.1" 503 0 "-" "Java/1.8.0_152"
127.0.0.1 - - [09/Nov/2017:02:06:00 +0000] "GET /api/atlas/v2/types/typedef/name/finance_Tag
HTTP/1.1" 503 0 "-" "Java/1.8.0_152"
127.0.0.1 - - [09/Nov/2017:02:06:05 +0000] "GET /api/atlas/v2/types/typedef/name/finance_Tag
HTTP/1.1" 503 0 "-" "Java/1.8.0_152"
127.0.0.1 - - [09/Nov/2017:02:06:10 +0000] "GET /api/atlas/v2/types/typedef/name/FactUiXhrU2nDt
HTTP/1.1" 503 0 "-" "Java/1.8.0_152"
127.0.0.1 - - [09/Nov/2017:02:06:15 +0000] "GET /api/atlas/v2/types/typedef/name/FactUiXhrU2nDt
HTTP/1.1" 503 0 "-" "Java/1.8.0_152"
127.0.0.1 - - [09/Nov/2017:02:06:20 +0000] "GET /api/atlas/v2/types/typedef/name/FactUiXhrU2nDt
HTTP/1.1" 503 0 "-" "Java/1.8.0_152"
127.0.0.1 - - [09/Nov/2017:02:06:25 +0000] "GET /api/atlas/v2/types/typedef/name/FactUiXhrU2nDt
HTTP/1.1" 503 0 "-" "Java/1.8.0_152"
127.0.0.1 - - [09/Nov/2017:02:06:30 +0000] "GET /api/atlas/v2/types/typedef/name/ETLaVrfqTX5wf
HTTP/1.1" 503 0 "-" "Java/1.8.0_152"
127.0.0.1 - - [09/Nov/2017:02:06:35 +0000] "GET /api/atlas/v2/types/typedef/name/ETLaVrfqTX5wf
HTTP/1.1" 503 0 "-" "Java/1.8.0_152"
127.0.0.1 - - [09/Nov/2017:02:06:40 +0000] "GET /api/atlas/v2/types/typedef/name/ETLaVrfqTX5wf
HTTP/1.1" 503 0 "-" "Java/1.8.0_152"
127.0.0.1 - - [09/Nov/2017:02:06:45 +0000] "GET /api/atlas/v2/types/typedef/name/ETLaVrfqTX5wf
HTTP/1.1" 503 0 "-" "Java/1.8.0_152"
127.0.0.1 - - [09/Nov/2017:02:06:50 +0000] "GET /api/atlas/v2/types/typedef/name/DimensionoRUA8bBYRN
HTTP/1.1" 503 0 "-" "Java/1.8.0_152"
127.0.0.1 - - [09/Nov/2017:02:06:55 +0000] "GET /api/atlas/v2/types/typedef/name/DimensionoRUA8bBYRN
HTTP/1.1" 503 0 "-" "Java/1.8.0_152"
127.0.0.1 - - [09/Nov/2017:02:07:00 +0000] "GET /api/atlas/v2/types/typedef/name/DimensionoRUA8bBYRN
HTTP/1.1" 503 0 "-" "Java/1.8.0_152"
127.0.0.1 - - [09/Nov/2017:02:07:05 +0000] "GET /api/atlas/v2/types/typedef/name/DimensionoRUA8bBYRN
HTTP/1.1" 503 0 "-" "Java/1.8.0_152"
127.0.0.1 - - [09/Nov/2017:02:07:10 +0000] "GET /api/atlas/v2/types/typedef/name/MetricLGjhdiM04D
HTTP/1.1" 503 0 "-" "Java/1.8.0_152"
127.0.0.1 - - [09/Nov/2017:02:07:15 +0000] "GET /api/atlas/v2/types/typedef/name/MetricLGjhdiM04D
HTTP/1.1" 503 0 "-" "Java/1.8.0_152"
127.0.0.1 - - [09/Nov/2017:02:07:20 +0000] "GET /api/atlas/v2/types/typedef/name/MetricLGjhdiM04D
HTTP/1.1" 503 0 "-" "Java/1.8.0_152"
127.0.0.1 - - [09/Nov/2017:02:07:25 +0000] "GET /api/atlas/v2/types/typedef/name/MetricLGjhdiM04D
HTTP/1.1" 503 0 "-" "Java/1.8.0_152"
127.0.0.1 - - [09/Nov/2017:02:07:30 +0000] "GET /api/atlas/v2/types/typedef/name/hive_db_v1
HTTP/1.1" 503 0 "-" "Java/1.8.0_152"
127.0.0.1 - - [09/Nov/2017:02:07:35 +0000] "GET /api/atlas/v2/types/typedef/name/hive_db_v1
HTTP/1.1" 503 0 "-" "Java/1.8.0_152"
127.0.0.1 - - [09/Nov/2017:02:07:40 +0000] "GET /api/atlas/v2/types/typedef/name/hive_db_v1
HTTP/1.1" 503 0 "-" "Java/1.8.0_152"
127.0.0.1 - - [09/Nov/2017:02:07:45 +0000] "GET /api/atlas/v2/types/typedef/name/hive_db_v1
HTTP/1.1" 503 0 "-" "Java/1.8.0_152"
127.0.0.1 - - [09/Nov/2017:02:07:50 +0000] "GET /api/atlas/v2/types/typedef/name/hive_column_v1
HTTP/1.1" 503 0 "-" "Java/1.8.0_152"
127.0.0.1 - - [09/Nov/2017:02:07:56 +0000] "GET /api/atlas/v2/types/typedef/name/hive_column_v1
HTTP/1.1" 503 0 "-" "Java/1.8.0_152"
127.0.0.1 - - [09/Nov/2017:02:08:01 +0000] "GET /api/atlas/v2/types/typedef/name/hive_column_v1
HTTP/1.1" 503 0 "-" "Java/1.8.0_152"
127.0.0.1 - - [09/Nov/2017:02:08:06 +0000] "GET /api/atlas/v2/types/typedef/name/hive_column_v1
HTTP/1.1" 503 0 "-" "Java/1.8.0_152"
127.0.0.1 - - [09/Nov/2017:02:08:11 +0000] "GET /api/atlas/v2/types/typedef/name/hive_table_v1
HTTP/1.1" 503 0 "-" "Java/1.8.0_152"
127.0.0.1 - - [09/Nov/2017:02:08:16 +0000] "GET /api/atlas/v2/types/typedef/name/hive_table_v1
HTTP/1.1" 503 0 "-" "Java/1.8.0_152"
127.0.0.1 - - [09/Nov/2017:02:08:21 +0000] "GET /api/atlas/v2/types/typedef/name/hive_table_v1
HTTP/1.1" 503 0 "-" "Java/1.8.0_152"
127.0.0.1 - - [09/Nov/2017:02:08:26 +0000] "GET /api/atlas/v2/types/typedef/name/hive_table_v1
HTTP/1.1" 503 0 "-" "Java/1.8.0_152"
127.0.0.1 - - [09/Nov/2017:02:08:31 +0000] "GET /api/atlas/v2/types/typedef/name/hive_process_v1
HTTP/1.1" 503 0 "-" "Java/1.8.0_152"
127.0.0.1 - - [09/Nov/2017:02:08:36 +0000] "GET /api/atlas/v2/types/typedef/name/hive_process_v1
HTTP/1.1" 503 0 "-" "Java/1.8.0_152"
127.0.0.1 - - [09/Nov/2017:02:08:41 +0000] "GET /api/atlas/v2/types/typedef/name/hive_process_v1
HTTP/1.1" 503 0 "-" "Java/1.8.0_152"
127.0.0.1 - - [09/Nov/2017:02:08:46 +0000] "GET /api/atlas/v2/types/typedef/name/hive_process_v1
HTTP/1.1" 503 0 "-" "Java/1.8.0_152"
127.0.0.1 - - [09/Nov/2017:02:08:51 +0000] "POST /api/atlas/types HTTP/1.1" 503 0 "-" "Java/1.8.0_152"
127.0.0.1 - - [09/Nov/2017:02:08:56 +0000] "POST /api/atlas/types HTTP/1.1" 503 0 "-" "Java/1.8.0_152"
127.0.0.1 - - [09/Nov/2017:02:09:01 +0000] "POST /api/atlas/types HTTP/1.1" 503 0 "-" "Java/1.8.0_152"
127.0.0.1 - - [09/Nov/2017:02:09:06 +0000] "POST /api/atlas/types HTTP/1.1" 503 0 "-" "Java/1.8.0_152"
Tests run: 154, Failures: 5, Errors: 0, Skipped: 142, Time elapsed: 376.392 sec <<<
FAILURE! - in TestSuite
testAccessforUnauthenticatedResource(org.apache.atlas.web.filters.AtlasAuthenticationSimpleFilterIT)
 Time elapsed: 0.119 sec  <<< FAILURE!
java.lang.AssertionError: expected [200] but found [503]
	at org.testng.Assert.fail(Assert.java:94)
	at org.testng.Assert.failNotEquals(Assert.java:496)
	at org.testng.Assert.assertEquals(Assert.java:125)
	at org.testng.Assert.assertEquals(Assert.java:372)
	at org.testng.Assert.assertEquals(Assert.java:382)
	at org.apache.atlas.web.filters.AtlasAuthenticationSimpleFilterIT.testAccessforUnauthenticatedResource(AtlasAuthenticationSimpleFilterIT.java:57)

testSimpleLoginAndAuthorizationWithValidCrendentialsAndInvalidAccessToResource(org.apache.atlas.web.filters.AtlasAuthenticationSimpleFilterIT)
 Time elapsed: 0.006 sec  <<< FAILURE!
java.lang.AssertionError: expected [403] but found [503]
	at org.testng.Assert.fail(Assert.java:94)
	at org.testng.Assert.failNotEquals(Assert.java:496)
	at org.testng.Assert.assertEquals(Assert.java:125)
	at org.testng.Assert.assertEquals(Assert.java:372)
	at org.testng.Assert.assertEquals(Assert.java:382)
	at org.apache.atlas.web.filters.AtlasAuthenticationSimpleFilterIT.testSimpleLoginAndAuthorizationWithValidCrendentialsAndInvalidAccessToResource(AtlasAuthenticationSimpleFilterIT.java:74)

testSimpleLoginForValidUser(org.apache.atlas.web.filters.AtlasAuthenticationSimpleFilterIT)
 Time elapsed: 0.002 sec  <<< FAILURE!
java.lang.AssertionError: expected [200] but found [503]
	at org.testng.Assert.fail(Assert.java:94)
	at org.testng.Assert.failNotEquals(Assert.java:496)
	at org.testng.Assert.assertEquals(Assert.java:125)
	at org.testng.Assert.assertEquals(Assert.java:372)
	at org.testng.Assert.assertEquals(Assert.java:382)
	at org.apache.atlas.web.filters.AtlasAuthenticationSimpleFilterIT.testSimpleLoginForValidUser(AtlasAuthenticationSimpleFilterIT.java:46)

testSimpleLoginWithInvalidCrendentials(org.apache.atlas.web.filters.AtlasAuthenticationSimpleFilterIT)
 Time elapsed: 0.001 sec  <<< FAILURE!
java.lang.AssertionError: expected [401] but found [503]
	at org.testng.Assert.fail(Assert.java:94)
	at org.testng.Assert.failNotEquals(Assert.java:496)
	at org.testng.Assert.assertEquals(Assert.java:125)
	at org.testng.Assert.assertEquals(Assert.java:372)
	at org.testng.Assert.assertEquals(Assert.java:382)
	at org.apache.atlas.web.filters.AtlasAuthenticationSimpleFilterIT.testSimpleLoginWithInvalidCrendentials(AtlasAuthenticationSimpleFilterIT.java:93)

setUp(org.apache.atlas.web.integration.EntityLineageJerseyResourceIT)  Time elapsed: 361.782
sec  <<< FAILURE!
org.apache.atlas.AtlasServiceException: Metadata service API org.apache.atlas.AtlasClient$API_V1@5c9e03a0
failed with status 503 (Service Unavailable) Response Body ()
	at org.apache.atlas.AtlasBaseClient.callAPIWithResource(AtlasBaseClient.java:387)
	at org.apache.atlas.AtlasBaseClient.callAPIWithResource(AtlasBaseClient.java:320)
	at org.apache.atlas.AtlasBaseClient.callAPI(AtlasBaseClient.java:208)
	at org.apache.atlas.AtlasClient.callAPIWithBody(AtlasClient.java:942)
	at org.apache.atlas.AtlasClient.createType(AtlasClient.java:261)
	at org.apache.atlas.AtlasClient.createType(AtlasClient.java:279)
	at org.apache.atlas.web.integration.BaseResourceIT.createType(BaseResourceIT.java:211)
	at org.apache.atlas.web.integration.BaseResourceIT.createTypeDefinitionsV1(BaseResourceIT.java:364)
	at org.apache.atlas.web.integration.DataSetLineageJerseyResourceIT.setUp(DataSetLineageJerseyResourceIT.java:61)
	at org.apache.atlas.web.integration.EntityLineageJerseyResourceIT.setUp(EntityLineageJerseyResourceIT.java:60)


Results :

Failed tests: 
  AtlasAuthenticationSimpleFilterIT.testAccessforUnauthenticatedResource:57 expected [200]
but found [503]
  AtlasAuthenticationSimpleFilterIT.testSimpleLoginAndAuthorizationWithValidCrendentialsAndInvalidAccessToResource:74
expected [403] but found [503]
  AtlasAuthenticationSimpleFilterIT.testSimpleLoginForValidUser:46 expected [200] but found
[503]
  AtlasAuthenticationSimpleFilterIT.testSimpleLoginWithInvalidCrendentials:93 expected [401]
but found [503]
  EntityLineageJerseyResourceIT.setUp:60->DataSetLineageJerseyResourceIT.setUp:61->BaseResourceIT.createTypeDefinitionsV1:364->BaseResourceIT.createType:211
» AtlasService

Tests run: 151, Failures: 5, Errors: 0, Skipped: 139

[INFO] 
[INFO] --- jetty-maven-plugin:9.4.0.v20161208:stop (stop-jetty) @ atlas-webapp ---
[INFO] Waiting 10 seconds for jetty to stop
[INFO] Stopped ServerConnector@1d166177{HTTP/1.1,[http/1.1]}{0.0.0.0:31000}
[INFO] Stopped scavenging
[INFO] Shutting down log4j
[INFO] Stopped o.e.j.m.p.JettyWebAppContext@68ad66d2{/,file://<https://builds.apache.org/job/Atlas-master-JanusGraph-IntegrationTests/ws/webapp/target/atlas-webapp-1.0.0-SNAPSHOT/,UNAVAILABLE}{/home/jenkins/jenkins-slave/workspace/Atlas-master-JanusGraph-IntegrationTests/webapp/target/atlas-webapp-1.0.0-SNAPSHOT.war}>
[INFO] Server reports itself as stopped
[INFO] 
[INFO] --- maven-source-plugin:2.4:jar-no-fork (attach-sources) @ atlas-webapp ---
[INFO] Building jar: <https://builds.apache.org/job/Atlas-master-JanusGraph-IntegrationTests/ws/webapp/target/atlas-webapp-1.0.0-SNAPSHOT-sources.jar>
[INFO] 
[INFO] --- maven-source-plugin:2.4:test-jar-no-fork (attach-sources) @ atlas-webapp ---
[INFO] Building jar: <https://builds.apache.org/job/Atlas-master-JanusGraph-IntegrationTests/ws/webapp/target/atlas-webapp-1.0.0-SNAPSHOT-test-sources.jar>
[INFO] 
[INFO] --- maven-failsafe-plugin:2.18.1:verify (verify) @ atlas-webapp ---
[INFO] Failsafe report directory: <https://builds.apache.org/job/Atlas-master-JanusGraph-IntegrationTests/ws/webapp/target/failsafe-reports>
[INFO] ------------------------------------------------------------------------
[INFO] Reactor Summary:
[INFO] 
[INFO] Apache Atlas Server Build Tools .................... SUCCESS [  2.183 s]
[INFO] apache-atlas ....................................... SUCCESS [ 14.259 s]
[INFO] Apache Atlas Integration ........................... SUCCESS [ 37.434 s]
[INFO] Apache Atlas Common ................................ SUCCESS [ 13.192 s]
[INFO] Apache Atlas Typesystem ............................ SUCCESS [01:18 min]
[INFO] Apache Atlas Client ................................ SUCCESS [  1.187 s]
[INFO] atlas-client-common ................................ SUCCESS [ 11.981 s]
[INFO] atlas-client-v1 .................................... SUCCESS [ 11.810 s]
[INFO] Apache Atlas Server API ............................ SUCCESS [  9.758 s]
[INFO] Apache Atlas Notification .......................... SUCCESS [ 17.535 s]
[INFO] atlas-client-v2 .................................... SUCCESS [  9.853 s]
[INFO] Apache Atlas Graph Database Projects ............... SUCCESS [  0.651 s]
[INFO] Apache Atlas Graph Database API .................... SUCCESS [  7.968 s]
[INFO] Graph Database Common Code ......................... SUCCESS [ 10.252 s]
[INFO] Apache Atlas JanusGraph DB Impl .................... SUCCESS [ 28.496 s]
[INFO] Apache Atlas Graph Database Implementation Dependencies SUCCESS [  2.105 s]
[INFO] Shaded version of Apache hbase client .............. SUCCESS [ 14.969 s]
[INFO] Apache Atlas Titan 0.5.4 Graph DB Impl ............. SUCCESS [01:03 min]
[INFO] Apache Atlas Titan 1.0.0 GraphDB Impl .............. SUCCESS [ 44.197 s]
[INFO] Shaded version of Apache hbase server .............. SUCCESS [ 29.516 s]
[INFO] Apache Atlas Repository ............................ SUCCESS [02:09 min]
[INFO] Apache Atlas Authorization ......................... SUCCESS [ 11.509 s]
[INFO] Apache Atlas UI .................................... SUCCESS [01:34 min]
[INFO] Apache Atlas Web Application ....................... FAILURE [07:15 min]
[INFO] Apache Atlas Documentation ......................... SKIPPED
[INFO] Apache Atlas FileSystem Model ...................... SKIPPED
[INFO] Apache Atlas Plugin Classloader .................... SKIPPED
[INFO] Apache Atlas Hive Bridge Shim ...................... SKIPPED
[INFO] Apache Atlas Hive Bridge ........................... SKIPPED
[INFO] Apache Atlas Falcon Bridge Shim .................... SKIPPED
[INFO] Apache Atlas Falcon Bridge ......................... SKIPPED
[INFO] Apache Atlas Sqoop Bridge Shim ..................... SKIPPED
[INFO] Apache Atlas Sqoop Bridge .......................... SKIPPED
[INFO] Apache Atlas Storm Bridge Shim ..................... SKIPPED
[INFO] Apache Atlas Storm Bridge .......................... SKIPPED
[INFO] Apache Atlas Hbase Bridge Shim ..................... SKIPPED
[INFO] Apache Atlas Hbase Bridge .......................... SKIPPED
[INFO] Apache Atlas Distribution .......................... SKIPPED
[INFO] ------------------------------------------------------------------------
[INFO] BUILD FAILURE
[INFO] ------------------------------------------------------------------------
[INFO] Total time: 18:03 min
[INFO] Finished at: 2017-11-09T02:09:26Z
[INFO] Final Memory: 223M/2407M
[INFO] ------------------------------------------------------------------------
[ERROR] Failed to execute goal org.apache.maven.plugins:maven-failsafe-plugin:2.18.1:verify
(verify) on project atlas-webapp: There are test failures.
[ERROR] 
[ERROR] Please refer to <https://builds.apache.org/job/Atlas-master-JanusGraph-IntegrationTests/ws/webapp/target/failsafe-reports>
for the individual test results.
[ERROR] -> [Help 1]
[ERROR] 
[ERROR] To see the full stack trace of the errors, re-run Maven with the -e switch.
[ERROR] Re-run Maven using the -X switch to enable full debug logging.
[ERROR] 
[ERROR] For more information about the errors and possible solutions, please read the following
articles:
[ERROR] [Help 1] http://cwiki.apache.org/confluence/display/MAVEN/MojoFailureException
[ERROR] 
[ERROR] After correcting the problems, you can resume the build with the command
[ERROR]   mvn <goals> -rf :atlas-webapp
Build step 'Execute shell' marked build as failure
[CHECKSTYLE] Collecting checkstyle analysis files...
[CHECKSTYLE] Searching for all files in <https://builds.apache.org/job/Atlas-master-JanusGraph-IntegrationTests/ws/>
that match the pattern **/target/checkstyle-result.xml
[CHECKSTYLE] Parsing 22 files in <https://builds.apache.org/job/Atlas-master-JanusGraph-IntegrationTests/ws/>
[CHECKSTYLE] Successfully parsed file <https://builds.apache.org/job/Atlas-master-JanusGraph-IntegrationTests/ws/authorization/target/checkstyle-result.xml>
with 461 unique warnings and 0 duplicates.
[CHECKSTYLE] Successfully parsed file <https://builds.apache.org/job/Atlas-master-JanusGraph-IntegrationTests/ws/client/client-v1/target/checkstyle-result.xml>
with 1336 unique warnings and 0 duplicates.
[CHECKSTYLE] Successfully parsed file <https://builds.apache.org/job/Atlas-master-JanusGraph-IntegrationTests/ws/client/client-v2/target/checkstyle-result.xml>
with 1676 unique warnings and 0 duplicates.
[CHECKSTYLE] Successfully parsed file <https://builds.apache.org/job/Atlas-master-JanusGraph-IntegrationTests/ws/client/common/target/checkstyle-result.xml>
with 2166 unique warnings and 0 duplicates.
[CHECKSTYLE] Successfully parsed file <https://builds.apache.org/job/Atlas-master-JanusGraph-IntegrationTests/ws/client/target/checkstyle-result.xml>
with 2166 unique warnings and 0 duplicates.
[CHECKSTYLE] Successfully parsed file <https://builds.apache.org/job/Atlas-master-JanusGraph-IntegrationTests/ws/common/target/checkstyle-result.xml>
with 3131 unique warnings and 0 duplicates.
[CHECKSTYLE] Successfully parsed file <https://builds.apache.org/job/Atlas-master-JanusGraph-IntegrationTests/ws/dashboardv2/target/checkstyle-result.xml>
with 3131 unique warnings and 0 duplicates.
[CHECKSTYLE] Successfully parsed file <https://builds.apache.org/job/Atlas-master-JanusGraph-IntegrationTests/ws/graphdb/api/target/checkstyle-result.xml>
with 3404 unique warnings and 0 duplicates.
[CHECKSTYLE] Successfully parsed file <https://builds.apache.org/job/Atlas-master-JanusGraph-IntegrationTests/ws/graphdb/common/target/checkstyle-result.xml>
with 3597 unique warnings and 0 duplicates.
[CHECKSTYLE] Successfully parsed file <https://builds.apache.org/job/Atlas-master-JanusGraph-IntegrationTests/ws/graphdb/graphdb-impls/target/checkstyle-result.xml>
with 3597 unique warnings and 0 duplicates.
[CHECKSTYLE] Successfully parsed file <https://builds.apache.org/job/Atlas-master-JanusGraph-IntegrationTests/ws/graphdb/janus/target/checkstyle-result.xml>
with 4588 unique warnings and 0 duplicates.
[CHECKSTYLE] Successfully parsed file <https://builds.apache.org/job/Atlas-master-JanusGraph-IntegrationTests/ws/graphdb/target/checkstyle-result.xml>
with 4588 unique warnings and 0 duplicates.
[CHECKSTYLE] Successfully parsed file <https://builds.apache.org/job/Atlas-master-JanusGraph-IntegrationTests/ws/graphdb/titan0/target/checkstyle-result.xml>
with 7047 unique warnings and 0 duplicates.
[CHECKSTYLE] Successfully parsed file <https://builds.apache.org/job/Atlas-master-JanusGraph-IntegrationTests/ws/graphdb/titan1/target/checkstyle-result.xml>
with 8018 unique warnings and 0 duplicates.
[CHECKSTYLE] Successfully parsed file <https://builds.apache.org/job/Atlas-master-JanusGraph-IntegrationTests/ws/intg/target/checkstyle-result.xml>
with 16224 unique warnings and 0 duplicates.
[CHECKSTYLE] Successfully parsed file <https://builds.apache.org/job/Atlas-master-JanusGraph-IntegrationTests/ws/notification/target/checkstyle-result.xml>
with 17789 unique warnings and 0 duplicates.
[CHECKSTYLE] Successfully parsed file <https://builds.apache.org/job/Atlas-master-JanusGraph-IntegrationTests/ws/repository/target/checkstyle-result.xml>
with 38119 unique warnings and 0 duplicates.
[CHECKSTYLE] Successfully parsed file <https://builds.apache.org/job/Atlas-master-JanusGraph-IntegrationTests/ws/server-api/target/checkstyle-result.xml>
with 38512 unique warnings and 0 duplicates.
[CHECKSTYLE] Successfully parsed file <https://builds.apache.org/job/Atlas-master-JanusGraph-IntegrationTests/ws/shaded/hbase-client-shaded/target/checkstyle-result.xml>
with 38512 unique warnings and 0 duplicates.
[CHECKSTYLE] Successfully parsed file <https://builds.apache.org/job/Atlas-master-JanusGraph-IntegrationTests/ws/shaded/hbase-server-shaded/target/checkstyle-result.xml>
with 38512 unique warnings and 0 duplicates.
[CHECKSTYLE] Successfully parsed file <https://builds.apache.org/job/Atlas-master-JanusGraph-IntegrationTests/ws/target/checkstyle-result.xml>
with 38512 unique warnings and 0 duplicates.
[CHECKSTYLE] Successfully parsed file <https://builds.apache.org/job/Atlas-master-JanusGraph-IntegrationTests/ws/typesystem/target/checkstyle-result.xml>
with 42730 unique warnings and 0 duplicates.
<Git Blamer> Using GitBlamer to create author and commit information for all warnings.
<Git Blamer> GIT_COMMIT=c5da0fa1efcfc46775ff7d238154ae71bf05a974, workspace=<https://builds.apache.org/job/Atlas-master-JanusGraph-IntegrationTests/ws/>
 > git rev-parse c5da0fa1efcfc46775ff7d238154ae71bf05a974^{commit} # timeout=10
[FINDBUGS] Collecting findbugs analysis files...
[FINDBUGS] Searching for all files in <https://builds.apache.org/job/Atlas-master-JanusGraph-IntegrationTests/ws/>
that match the pattern **/target/findbugs.xml
[FINDBUGS] Parsing 15 files in <https://builds.apache.org/job/Atlas-master-JanusGraph-IntegrationTests/ws/>
[FINDBUGS] Successfully parsed file <https://builds.apache.org/job/Atlas-master-JanusGraph-IntegrationTests/ws/authorization/target/findbugs.xml>
with 0 unique warnings and 0 duplicates.
[FINDBUGS] Successfully parsed file <https://builds.apache.org/job/Atlas-master-JanusGraph-IntegrationTests/ws/client/client-v1/target/findbugs.xml>
with 0 unique warnings and 0 duplicates.
[FINDBUGS] Successfully parsed file <https://builds.apache.org/job/Atlas-master-JanusGraph-IntegrationTests/ws/client/client-v2/target/findbugs.xml>
with 0 unique warnings and 0 duplicates.
[FINDBUGS] Successfully parsed file <https://builds.apache.org/job/Atlas-master-JanusGraph-IntegrationTests/ws/client/common/target/findbugs.xml>
with 0 unique warnings and 0 duplicates.
[FINDBUGS] Successfully parsed file <https://builds.apache.org/job/Atlas-master-JanusGraph-IntegrationTests/ws/common/target/findbugs.xml>
with 0 unique warnings and 0 duplicates.
[FINDBUGS] Successfully parsed file <https://builds.apache.org/job/Atlas-master-JanusGraph-IntegrationTests/ws/graphdb/api/target/findbugs.xml>
with 0 unique warnings and 0 duplicates.
[FINDBUGS] Successfully parsed file <https://builds.apache.org/job/Atlas-master-JanusGraph-IntegrationTests/ws/graphdb/common/target/findbugs.xml>
with 0 unique warnings and 0 duplicates.
[FINDBUGS] Successfully parsed file <https://builds.apache.org/job/Atlas-master-JanusGraph-IntegrationTests/ws/graphdb/janus/target/findbugs.xml>
with 0 unique warnings and 0 duplicates.
[FINDBUGS] Successfully parsed file <https://builds.apache.org/job/Atlas-master-JanusGraph-IntegrationTests/ws/graphdb/titan0/target/findbugs.xml>
with 0 unique warnings and 0 duplicates.
[FINDBUGS] Successfully parsed file <https://builds.apache.org/job/Atlas-master-JanusGraph-IntegrationTests/ws/graphdb/titan1/target/findbugs.xml>
with 0 unique warnings and 0 duplicates.
[FINDBUGS] Successfully parsed file <https://builds.apache.org/job/Atlas-master-JanusGraph-IntegrationTests/ws/intg/target/findbugs.xml>
with 0 unique warnings and 0 duplicates.
[FINDBUGS] Successfully parsed file <https://builds.apache.org/job/Atlas-master-JanusGraph-IntegrationTests/ws/notification/target/findbugs.xml>
with 0 unique warnings and 0 duplicates.
[FINDBUGS] Successfully parsed file <https://builds.apache.org/job/Atlas-master-JanusGraph-IntegrationTests/ws/repository/target/findbugs.xml>
with 0 unique warnings and 0 duplicates.
[FINDBUGS] Successfully parsed file <https://builds.apache.org/job/Atlas-master-JanusGraph-IntegrationTests/ws/server-api/target/findbugs.xml>
with 0 unique warnings and 0 duplicates.
[FINDBUGS] Successfully parsed file <https://builds.apache.org/job/Atlas-master-JanusGraph-IntegrationTests/ws/typesystem/target/findbugs.xml>
with 0 unique warnings and 0 duplicates.
<Git Blamer> Using GitBlamer to create author and commit information for all warnings.
<Git Blamer> GIT_COMMIT=c5da0fa1efcfc46775ff7d238154ae71bf05a974, workspace=<https://builds.apache.org/job/Atlas-master-JanusGraph-IntegrationTests/ws/>
Archiving artifacts
[Fast Archiver] No prior successful build to compare, so performing full copy of artifacts
TestNG Reports Processing: START
Looking for TestNG results report in workspace using pattern: **/target/surefire-reports/testng-results.xml,**/target/failsafe-reports/testng-results.xml
Saving reports...
Processing '/x1/jenkins/jenkins-home/jobs/Atlas-master-JanusGraph-IntegrationTests/builds/12/testng/testng-results.xml'
2.941176% of tests failed, which exceeded threshold of 0%. Marking build as UNSTABLE
TestNG Reports Processing: FINISH

Mime
View raw message