atlas-dev mailing list archives

Site index · List index
Message view « Date » · « Thread »
Top « Date » · « Thread »
From Apache Jenkins Server <jenk...@builds.apache.org>
Subject Build failed in Jenkins: Atlas-master-IntegrationTests #184
Date Wed, 15 Nov 2017 00:48:11 GMT
See <https://builds.apache.org/job/Atlas-master-IntegrationTests/184/display/redirect?page=changes>

Changes:

[ssubramanian] ATLAS-2258: Fix new Integration test failures introduced due to

------------------------------------------
[...truncated 646.30 KB...]
	at org.apache.atlas.hive.HiveITBase.runCommandWithDelay(HiveITBase.java:113)
	at org.apache.atlas.hive.HiveITBase.runCommand(HiveITBase.java:105)
	at org.apache.atlas.hive.hook.HiveHookIT.testLoadLocalPath(HiveHookIT.java:426)

testLoadLocalPathIntoPartition(org.apache.atlas.hive.hook.HiveHookIT)  Time elapsed: 0.058
sec  <<< FAILURE!
java.lang.AssertionError: expected [0] but found [40000]
	at org.testng.Assert.fail(Assert.java:94)
	at org.testng.Assert.failNotEquals(Assert.java:496)
	at org.testng.Assert.assertEquals(Assert.java:125)
	at org.testng.Assert.assertEquals(Assert.java:372)
	at org.testng.Assert.assertEquals(Assert.java:382)
	at org.apache.atlas.hive.HiveITBase.runCommandWithDelay(HiveITBase.java:120)
	at org.apache.atlas.hive.HiveITBase.runCommandWithDelay(HiveITBase.java:113)
	at org.apache.atlas.hive.HiveITBase.runCommand(HiveITBase.java:105)
	at org.apache.atlas.hive.hook.HiveHookIT.testLoadLocalPathIntoPartition(HiveHookIT.java:437)

testTraitsPreservedOnColumnRename(org.apache.atlas.hive.hook.HiveHookIT)  Time elapsed: 95.146
sec  <<< FAILURE!
java.lang.AssertionError: Assertions failed. Failing after waiting for timeout 80000 msecs
	at org.apache.atlas.AtlasBaseClient.callAPIWithResource(AtlasBaseClient.java:387)
	at org.apache.atlas.AtlasBaseClient.callAPIWithResource(AtlasBaseClient.java:320)
	at org.apache.atlas.AtlasBaseClient.callAPIWithRetries(AtlasBaseClient.java:471)
	at org.apache.atlas.AtlasClient.callAPIWithRetries(AtlasClient.java:962)
	at org.apache.atlas.AtlasClient.getEntity(AtlasClient.java:646)
	at org.apache.atlas.hive.HiveITBase$1.evaluate(HiveITBase.java:161)
	at org.apache.atlas.hive.HiveITBase.waitFor(HiveITBase.java:198)
	at org.apache.atlas.hive.HiveITBase.assertEntityIsRegistered(HiveITBase.java:158)
	at org.apache.atlas.hive.hook.HiveHookIT.assertColumnIsRegistered(HiveHookIT.java:281)
	at org.apache.atlas.hive.hook.HiveHookIT.assertColumnIsRegistered(HiveHookIT.java:276)
	at org.apache.atlas.hive.hook.HiveHookIT.testTraitsPreservedOnColumnRename(HiveHookIT.java:1253)

testTruncateTable(org.apache.atlas.hive.hook.HiveHookIT)  Time elapsed: 95.14 sec  <<<
FAILURE!
java.lang.AssertionError: Assertions failed. Failing after waiting for timeout 80000 msecs
	at org.apache.atlas.AtlasBaseClient.callAPIWithResource(AtlasBaseClient.java:387)
	at org.apache.atlas.AtlasBaseClient.callAPIWithResource(AtlasBaseClient.java:320)
	at org.apache.atlas.AtlasBaseClient.callAPIWithRetries(AtlasBaseClient.java:471)
	at org.apache.atlas.AtlasClient.callAPIWithRetries(AtlasClient.java:962)
	at org.apache.atlas.AtlasClient.getEntity(AtlasClient.java:646)
	at org.apache.atlas.hive.HiveITBase$1.evaluate(HiveITBase.java:161)
	at org.apache.atlas.hive.HiveITBase.waitFor(HiveITBase.java:198)
	at org.apache.atlas.hive.HiveITBase.assertEntityIsRegistered(HiveITBase.java:158)
	at org.apache.atlas.hive.HiveITBase.assertTableIsRegistered(HiveITBase.java:152)
	at org.apache.atlas.hive.HiveITBase.assertTableIsRegistered(HiveITBase.java:146)
	at org.apache.atlas.hive.hook.HiveHookIT.testTruncateTable(HiveHookIT.java:1195)

testUpdateProcess(org.apache.atlas.hive.hook.HiveHookIT)  Time elapsed: 0.215 sec  <<<
FAILURE!
java.lang.AssertionError: expected [0] but found [1]
	at org.testng.Assert.fail(Assert.java:94)
	at org.testng.Assert.failNotEquals(Assert.java:496)
	at org.testng.Assert.assertEquals(Assert.java:125)
	at org.testng.Assert.assertEquals(Assert.java:372)
	at org.testng.Assert.assertEquals(Assert.java:382)
	at org.apache.atlas.hive.HiveITBase.runCommandWithDelay(HiveITBase.java:120)
	at org.apache.atlas.hive.HiveITBase.runCommandWithDelay(HiveITBase.java:113)
	at org.apache.atlas.hive.HiveITBase.runCommand(HiveITBase.java:105)
	at org.apache.atlas.hive.hook.HiveHookIT.testUpdateProcess(HiveHookIT.java:581)


Results :

Failed tests: 
  HiveMetastoreBridgeIT.testCreateTableAndImport:41->HiveITBase.assertDatabaseIsRegistered:237->HiveITBase.assertDatabaseIsRegistered:243->HiveITBase.assertEntityIsRegistered:158->HiveITBase.waitFor:202
Assertions failed. Failing after waiting for timeout 80000 msecs
  HiveMetastoreBridgeIT.testImportCreatedTable:77->HiveITBase.assertDatabaseIsRegistered:237->HiveITBase.assertDatabaseIsRegistered:243->HiveITBase.assertEntityIsRegistered:158->HiveITBase.waitFor:202
Assertions failed. Failing after waiting for timeout 80000 msecs
  HiveHookIT.testAlterDBOwner:1578->HiveITBase.assertDatabaseIsRegistered:237->HiveITBase.assertDatabaseIsRegistered:243->HiveITBase.assertEntityIsRegistered:158->HiveITBase.waitFor:202
Assertions failed. Failing after waiting for timeout 80000 msecs
  HiveHookIT.testAlterDBProperties:1598->testAlterProperties:1619->verifyEntityProperties:1661->HiveITBase.assertDatabaseIsRegistered:243->HiveITBase.assertEntityIsRegistered:158->HiveITBase.waitFor:202
Assertions failed. Failing after waiting for timeout 80000 msecs
  HiveHookIT.testAlterTableAddColumn:964->assertColumnIsRegistered:276->assertColumnIsRegistered:281->HiveITBase.assertEntityIsRegistered:158->HiveITBase.waitFor:202
Assertions failed. Failing after waiting for timeout 80000 msecs
  HiveHookIT.testAlterTableBucketingClusterSort:1351->runBucketSortQuery:1363->assertTableIsRegistered:1811->HiveITBase.assertTableIsRegistered:152->HiveITBase.assertEntityIsRegistered:158->HiveITBase.waitFor:202
Assertions failed. Failing after waiting for timeout 80000 msecs
  HiveHookIT.testAlterTableChangeColumn:1000->assertColumnIsNotRegistered:293->assertEntityIsNotRegistered:1815->HiveITBase.waitFor:202
Assertions failed. Failing after waiting for timeout 1000 msecs
  HiveHookIT.testAlterTableFileFormat:1313->assertTableIsRegistered:1811->HiveITBase.assertTableIsRegistered:152->HiveITBase.assertEntityIsRegistered:158->HiveITBase.waitFor:202
Assertions failed. Failing after waiting for timeout 80000 msecs
  HiveHookIT.testAlterTableLocation:1289->assertTableIsRegistered:1811->HiveITBase.assertTableIsRegistered:152->HiveITBase.assertEntityIsRegistered:158->HiveITBase.waitFor:202
Assertions failed. Failing after waiting for timeout 80000 msecs
  HiveHookIT.testAlterTablePartitionColumnType:1215->assertColumnIsRegistered:281->HiveITBase.assertEntityIsRegistered:158->HiveITBase.waitFor:202
Assertions failed. Failing after waiting for timeout 80000 msecs
  HiveHookIT.testAlterTableProperties:1605->testAlterProperties:1619->verifyEntityProperties:1653->assertTableIsRegistered:1811->HiveITBase.assertTableIsRegistered:152->HiveITBase.assertEntityIsRegistered:158->HiveITBase.waitFor:202
Assertions failed. Failing after waiting for timeout 80000 msecs
  HiveHookIT.testAlterTableRename:877->HiveITBase.assertTableIsRegistered:146->HiveITBase.assertTableIsRegistered:152->HiveITBase.assertEntityIsRegistered:158->HiveITBase.waitFor:202
Assertions failed. Failing after waiting for timeout 80000 msecs
  HiveHookIT.testAlterTableRenameAliasRegistered:861->HiveITBase.assertTableIsRegistered:146->HiveITBase.assertTableIsRegistered:152->HiveITBase.assertEntityIsRegistered:158->HiveITBase.waitFor:202
Assertions failed. Failing after waiting for timeout 80000 msecs
  HiveHookIT.testAlterTableSerde:1400->runSerdePropsQuery:1559->verifyTableSdProperties:1672->assertTableIsRegistered:1811->HiveITBase.assertTableIsRegistered:152->HiveITBase.assertEntityIsRegistered:158->HiveITBase.waitFor:202
Assertions failed. Failing after waiting for timeout 80000 msecs
  HiveHookIT.testAlterTableWithoutHookConf:1238->assertTableIsNotRegistered:1801->assertEntityIsNotRegistered:1815->HiveITBase.waitFor:202
Assertions failed. Failing after waiting for timeout 1000 msecs
  HiveHookIT.testAlterViewAsSelect:378->HiveITBase.assertTableIsRegistered:146->HiveITBase.assertTableIsRegistered:152->HiveITBase.assertEntityIsRegistered:158->HiveITBase.waitFor:202
Assertions failed. Failing after waiting for timeout 80000 msecs
  HiveHookIT.testAlterViewProperties:1646->testAlterProperties:1619->verifyEntityProperties:1653->assertTableIsRegistered:1811->HiveITBase.assertTableIsRegistered:152->HiveITBase.assertEntityIsRegistered:158->HiveITBase.waitFor:202
Assertions failed. Failing after waiting for timeout 80000 msecs
  HiveHookIT.testAlterViewRename:1277->HiveITBase.assertTableIsRegistered:146->HiveITBase.assertTableIsRegistered:152->HiveITBase.assertEntityIsRegistered:158->HiveITBase.waitFor:202
Assertions failed. Failing after waiting for timeout 80000 msecs
  HiveHookIT.testCTAS:302->HiveITBase.runCommand:105->HiveITBase.runCommandWithDelay:113->HiveITBase.runCommandWithDelay:120
expected [0] but found [1]
  HiveHookIT.testCreateDatabase:75->HiveITBase.assertDatabaseIsRegistered:237->HiveITBase.assertDatabaseIsRegistered:243->HiveITBase.assertEntityIsRegistered:158->HiveITBase.waitFor:202
Assertions failed. Failing after waiting for timeout 80000 msecs
  HiveHookIT.testCreateTable:140->HiveITBase.assertTableIsRegistered:146->HiveITBase.assertTableIsRegistered:152->HiveITBase.assertEntityIsRegistered:158->HiveITBase.waitFor:202
Assertions failed. Failing after waiting for timeout 80000 msecs
  HiveHookIT.testCreateView:366->assertProcessIsRegistered:1719->HiveITBase.assertEntityIsRegistered:158->HiveITBase.waitFor:202
Assertions failed. Failing after waiting for timeout 80000 msecs
  HiveHookIT.testDropAndRecreateCTASOutput:334->HiveITBase.runCommand:105->HiveITBase.runCommandWithDelay:113->HiveITBase.runCommandWithDelay:120
expected [0] but found [1]
  HiveHookIT.testDropDatabaseWithCascade:1458->assertColumnIsNotRegistered:293->assertEntityIsNotRegistered:1815->HiveITBase.waitFor:202
Assertions failed. Failing after waiting for timeout 1000 msecs
  HiveHookIT.testDropDatabaseWithoutCascade:1482->assertTableIsNotRegistered:1801->assertEntityIsNotRegistered:1815->HiveITBase.waitFor:202
Assertions failed. Failing after waiting for timeout 1000 msecs
  HiveHookIT.testDropNonExistingDB:1507->assertDBIsNotRegistered:1807->assertEntityIsNotRegistered:1815->HiveITBase.waitFor:202
Assertions failed. Failing after waiting for timeout 1000 msecs
  HiveHookIT.testDropNonExistingTable:1519->assertTableIsNotRegistered:1801->assertEntityIsNotRegistered:1815->HiveITBase.waitFor:202
Assertions failed. Failing after waiting for timeout 1000 msecs
  HiveHookIT.testDropTable:1413->HiveITBase.assertTableIsRegistered:146->HiveITBase.assertTableIsRegistered:152->HiveITBase.assertEntityIsRegistered:158->HiveITBase.waitFor:202
Assertions failed. Failing after waiting for timeout 80000 msecs
  HiveHookIT.testDropView:1535->HiveITBase.assertTableIsRegistered:146->HiveITBase.assertTableIsRegistered:152->HiveITBase.assertEntityIsRegistered:158->HiveITBase.waitFor:202
Assertions failed. Failing after waiting for timeout 80000 msecs
  HiveHookIT.testEmptyStringAsValue:326->HiveITBase.assertTableIsRegistered:146->HiveITBase.assertTableIsRegistered:152->HiveITBase.assertEntityIsRegistered:158->HiveITBase.waitFor:202
Assertions failed. Failing after waiting for timeout 80000 msecs
  HiveHookIT.testExportImportPartitionedTable:778->HiveITBase.assertTableIsRegistered:146->HiveITBase.assertTableIsRegistered:152->HiveITBase.assertEntityIsRegistered:158->HiveITBase.waitFor:202
Assertions failed. Failing after waiting for timeout 80000 msecs
  HiveHookIT.testExportImportUnPartitionedTable:734->HiveITBase.assertTableIsRegistered:146->HiveITBase.assertTableIsRegistered:152->HiveITBase.assertEntityIsRegistered:158->HiveITBase.waitFor:202
Assertions failed. Failing after waiting for timeout 80000 msecs
  HiveHookIT.testIgnoreSelect:850->assertProcessIsNotRegistered:1786->assertEntityIsNotRegistered:1815->HiveITBase.waitFor:202
Assertions failed. Failing after waiting for timeout 1000 msecs
  HiveHookIT.testInsertIntoDFSDirPartitioned:627->HiveITBase.runCommand:105->HiveITBase.runCommandWithDelay:113->HiveITBase.runCommandWithDelay:120
expected [0] but found [1]
  HiveHookIT.testInsertIntoLocalDir:568->HiveITBase.runCommand:105->HiveITBase.runCommandWithDelay:113->HiveITBase.runCommandWithDelay:120
expected [0] but found [1]
  HiveHookIT.testInsertIntoPartition:693->HiveITBase.runCommand:105->HiveITBase.runCommandWithDelay:113->HiveITBase.runCommandWithDelay:120
expected [0] but found [1]
  HiveHookIT.testInsertIntoTable:513->HiveITBase.assertTableIsRegistered:146->HiveITBase.assertTableIsRegistered:152->HiveITBase.assertEntityIsRegistered:158->HiveITBase.waitFor:202
Assertions failed. Failing after waiting for timeout 80000 msecs
  HiveHookIT.testLineage:1839->HiveITBase.runCommand:105->HiveITBase.runCommandWithDelay:113->HiveITBase.runCommandWithDelay:120
expected [0] but found [1]
  HiveHookIT.testLoadDFSPathPartitioned:446->HiveITBase.assertTableIsRegistered:146->HiveITBase.assertTableIsRegistered:152->HiveITBase.assertEntityIsRegistered:158->HiveITBase.waitFor:202
Assertions failed. Failing after waiting for timeout 80000 msecs
  HiveHookIT.testLoadLocalPath:426->HiveITBase.runCommand:105->HiveITBase.runCommandWithDelay:113->HiveITBase.runCommandWithDelay:120
expected [0] but found [40000]
  HiveHookIT.testLoadLocalPathIntoPartition:437->HiveITBase.runCommand:105->HiveITBase.runCommandWithDelay:113->HiveITBase.runCommandWithDelay:120
expected [0] but found [40000]
  HiveHookIT.testTraitsPreservedOnColumnRename:1253->assertColumnIsRegistered:276->assertColumnIsRegistered:281->HiveITBase.assertEntityIsRegistered:158->HiveITBase.waitFor:202
Assertions failed. Failing after waiting for timeout 80000 msecs
  HiveHookIT.testTruncateTable:1195->HiveITBase.assertTableIsRegistered:146->HiveITBase.assertTableIsRegistered:152->HiveITBase.assertEntityIsRegistered:158->HiveITBase.waitFor:202
Assertions failed. Failing after waiting for timeout 80000 msecs
  HiveHookIT.testUpdateProcess:581->HiveITBase.runCommand:105->HiveITBase.runCommandWithDelay:113->HiveITBase.runCommandWithDelay:120
expected [0] but found [1]

Tests run: 45, Failures: 44, Errors: 0, Skipped: 0

[INFO] 
[INFO] --- jetty-maven-plugin:9.4.0.v20161208:stop (stop-jetty) @ hive-bridge ---
[INFO] Waiting 10 seconds for jetty to stop
[INFO] Stopped ServerConnector@61083349{HTTP/1.1,[http/1.1]}{0.0.0.0:31000}
[INFO] Stopped scavenging
[INFO] Shutting down log4j
[INFO] Stopped o.e.j.m.p.JettyWebAppContext@73ec225c{/,file://<https://builds.apache.org/job/Atlas-master-IntegrationTests/ws/webapp/target/atlas-webapp-1.0.0-SNAPSHOT/,UNAVAILABLE}{/home/jenkins/jenkins-slave/workspace/Atlas-master-IntegrationTests/webapp/target/atlas-webapp-1.0.0-SNAPSHOT.war}>
[INFO] Server reports itself as stopped
[INFO] 
[INFO] --- maven-source-plugin:2.4:jar-no-fork (attach-sources) @ hive-bridge ---
[INFO] Building jar: <https://builds.apache.org/job/Atlas-master-IntegrationTests/ws/addons/hive-bridge/target/hive-bridge-1.0.0-SNAPSHOT-sources.jar>
[INFO] 
[INFO] --- maven-source-plugin:2.4:test-jar-no-fork (attach-sources) @ hive-bridge ---
[INFO] Building jar: <https://builds.apache.org/job/Atlas-master-IntegrationTests/ws/addons/hive-bridge/target/hive-bridge-1.0.0-SNAPSHOT-test-sources.jar>
[INFO] 
[INFO] --- maven-failsafe-plugin:2.18.1:verify (verify) @ hive-bridge ---
[INFO] Failsafe report directory: <https://builds.apache.org/job/Atlas-master-IntegrationTests/ws/addons/hive-bridge/target/failsafe-reports>
[INFO] ------------------------------------------------------------------------
[INFO] Reactor Summary:
[INFO] 
[INFO] Apache Atlas Server Build Tools .................... SUCCESS [  1.272 s]
[INFO] apache-atlas ....................................... SUCCESS [  5.510 s]
[INFO] Apache Atlas Integration ........................... SUCCESS [ 24.792 s]
[INFO] Apache Atlas Common ................................ SUCCESS [  8.178 s]
[INFO] Apache Atlas Client ................................ SUCCESS [  0.674 s]
[INFO] atlas-client-common ................................ SUCCESS [  6.826 s]
[INFO] atlas-client-v1 .................................... SUCCESS [  7.139 s]
[INFO] Apache Atlas Server API ............................ SUCCESS [  6.126 s]
[INFO] Apache Atlas Notification .......................... SUCCESS [ 10.336 s]
[INFO] atlas-client-v2 .................................... SUCCESS [  5.814 s]
[INFO] Apache Atlas Graph Database Projects ............... SUCCESS [  0.491 s]
[INFO] Apache Atlas Graph Database API .................... SUCCESS [  4.872 s]
[INFO] Graph Database Common Code ......................... SUCCESS [  5.308 s]
[INFO] Apache Atlas JanusGraph DB Impl .................... SUCCESS [ 17.846 s]
[INFO] Apache Atlas Graph Database Implementation Dependencies SUCCESS [  1.576 s]
[INFO] Shaded version of Apache hbase client .............. SUCCESS [  9.097 s]
[INFO] Apache Atlas Titan 0.5.4 Graph DB Impl ............. SUCCESS [ 41.902 s]
[INFO] Apache Atlas Titan 1.0.0 GraphDB Impl .............. SUCCESS [ 32.176 s]
[INFO] Shaded version of Apache hbase server .............. SUCCESS [ 24.480 s]
[INFO] Apache Atlas Repository ............................ SUCCESS [ 22.658 s]
[INFO] Apache Atlas Authorization ......................... SUCCESS [  6.564 s]
[INFO] Apache Atlas UI .................................... SUCCESS [01:18 min]
[INFO] Apache Atlas Web Application ....................... SUCCESS [ 48.973 s]
[INFO] Apache Atlas Documentation ......................... SUCCESS [  5.434 s]
[INFO] Apache Atlas FileSystem Model ...................... SUCCESS [  1.532 s]
[INFO] Apache Atlas Plugin Classloader .................... SUCCESS [  6.125 s]
[INFO] Apache Atlas Hive Bridge Shim ...................... SUCCESS [  6.798 s]
[INFO] Apache Atlas Hive Bridge ........................... FAILURE [47:35 min]
[INFO] Apache Atlas Falcon Bridge Shim .................... SKIPPED
[INFO] Apache Atlas Falcon Bridge ......................... SKIPPED
[INFO] Apache Atlas Sqoop Bridge Shim ..................... SKIPPED
[INFO] Apache Atlas Sqoop Bridge .......................... SKIPPED
[INFO] Apache Atlas Storm Bridge Shim ..................... SKIPPED
[INFO] Apache Atlas Storm Bridge .......................... SKIPPED
[INFO] Apache Atlas Hbase Bridge Shim ..................... SKIPPED
[INFO] Apache Atlas Hbase Bridge .......................... SKIPPED
[INFO] Apache Atlas Distribution .......................... SKIPPED
[INFO] ------------------------------------------------------------------------
[INFO] BUILD FAILURE
[INFO] ------------------------------------------------------------------------
[INFO] Total time: 54:08 min
[INFO] Finished at: 2017-11-15T00:43:44Z
[INFO] Final Memory: 247M/2006M
[INFO] ------------------------------------------------------------------------
[ERROR] Failed to execute goal org.apache.maven.plugins:maven-failsafe-plugin:2.18.1:verify
(verify) on project hive-bridge: There are test failures.
[ERROR] 
[ERROR] Please refer to <https://builds.apache.org/job/Atlas-master-IntegrationTests/ws/addons/hive-bridge/target/failsafe-reports>
for the individual test results.
[ERROR] -> [Help 1]
[ERROR] 
[ERROR] To see the full stack trace of the errors, re-run Maven with the -e switch.
[ERROR] Re-run Maven using the -X switch to enable full debug logging.
[ERROR] 
[ERROR] For more information about the errors and possible solutions, please read the following
articles:
[ERROR] [Help 1] http://cwiki.apache.org/confluence/display/MAVEN/MojoFailureException
[ERROR] 
[ERROR] After correcting the problems, you can resume the build with the command
[ERROR]   mvn <goals> -rf :hive-bridge
Build step 'Execute shell' marked build as failure
[CHECKSTYLE] Collecting checkstyle analysis files...
[CHECKSTYLE] Searching for all files in <https://builds.apache.org/job/Atlas-master-IntegrationTests/ws/>
that match the pattern **/target/checkstyle-result.xml
[CHECKSTYLE] Parsing 26 files in <https://builds.apache.org/job/Atlas-master-IntegrationTests/ws/>
[CHECKSTYLE] Successfully parsed file <https://builds.apache.org/job/Atlas-master-IntegrationTests/ws/addons/hdfs-model/target/checkstyle-result.xml>
with 0 unique warnings and 0 duplicates.
[CHECKSTYLE] Successfully parsed file <https://builds.apache.org/job/Atlas-master-IntegrationTests/ws/addons/hive-bridge-shim/target/checkstyle-result.xml>
with 15 unique warnings and 0 duplicates.
[CHECKSTYLE] Successfully parsed file <https://builds.apache.org/job/Atlas-master-IntegrationTests/ws/authorization/target/checkstyle-result.xml>
with 476 unique warnings and 0 duplicates.
[CHECKSTYLE] Successfully parsed file <https://builds.apache.org/job/Atlas-master-IntegrationTests/ws/client/client-v1/target/checkstyle-result.xml>
with 1349 unique warnings and 0 duplicates.
[CHECKSTYLE] Successfully parsed file <https://builds.apache.org/job/Atlas-master-IntegrationTests/ws/client/client-v2/target/checkstyle-result.xml>
with 1689 unique warnings and 0 duplicates.
[CHECKSTYLE] Successfully parsed file <https://builds.apache.org/job/Atlas-master-IntegrationTests/ws/client/common/target/checkstyle-result.xml>
with 2179 unique warnings and 0 duplicates.
[CHECKSTYLE] Successfully parsed file <https://builds.apache.org/job/Atlas-master-IntegrationTests/ws/client/target/checkstyle-result.xml>
with 2179 unique warnings and 0 duplicates.
[CHECKSTYLE] Successfully parsed file <https://builds.apache.org/job/Atlas-master-IntegrationTests/ws/common/target/checkstyle-result.xml>
with 3115 unique warnings and 0 duplicates.
[CHECKSTYLE] Successfully parsed file <https://builds.apache.org/job/Atlas-master-IntegrationTests/ws/dashboardv2/target/checkstyle-result.xml>
with 3115 unique warnings and 0 duplicates.
[CHECKSTYLE] Successfully parsed file <https://builds.apache.org/job/Atlas-master-IntegrationTests/ws/docs/target/checkstyle-result.xml>
with 3115 unique warnings and 0 duplicates.
[CHECKSTYLE] Successfully parsed file <https://builds.apache.org/job/Atlas-master-IntegrationTests/ws/graphdb/api/target/checkstyle-result.xml>
with 3387 unique warnings and 0 duplicates.
[CHECKSTYLE] Successfully parsed file <https://builds.apache.org/job/Atlas-master-IntegrationTests/ws/graphdb/common/target/checkstyle-result.xml>
with 3580 unique warnings and 0 duplicates.
[CHECKSTYLE] Successfully parsed file <https://builds.apache.org/job/Atlas-master-IntegrationTests/ws/graphdb/graphdb-impls/target/checkstyle-result.xml>
with 3580 unique warnings and 0 duplicates.
[CHECKSTYLE] Successfully parsed file <https://builds.apache.org/job/Atlas-master-IntegrationTests/ws/graphdb/janus/target/checkstyle-result.xml>
with 4571 unique warnings and 0 duplicates.
[CHECKSTYLE] Successfully parsed file <https://builds.apache.org/job/Atlas-master-IntegrationTests/ws/graphdb/target/checkstyle-result.xml>
with 4571 unique warnings and 0 duplicates.
[CHECKSTYLE] Successfully parsed file <https://builds.apache.org/job/Atlas-master-IntegrationTests/ws/graphdb/titan0/target/checkstyle-result.xml>
with 7030 unique warnings and 0 duplicates.
[CHECKSTYLE] Successfully parsed file <https://builds.apache.org/job/Atlas-master-IntegrationTests/ws/graphdb/titan1/target/checkstyle-result.xml>
with 8001 unique warnings and 0 duplicates.
[CHECKSTYLE] Successfully parsed file <https://builds.apache.org/job/Atlas-master-IntegrationTests/ws/intg/target/checkstyle-result.xml>
with 17836 unique warnings and 0 duplicates.
[CHECKSTYLE] Successfully parsed file <https://builds.apache.org/job/Atlas-master-IntegrationTests/ws/notification/target/checkstyle-result.xml>
with 18997 unique warnings and 0 duplicates.
[CHECKSTYLE] Successfully parsed file <https://builds.apache.org/job/Atlas-master-IntegrationTests/ws/plugin-classloader/target/checkstyle-result.xml>
with 19110 unique warnings and 0 duplicates.
[CHECKSTYLE] Successfully parsed file <https://builds.apache.org/job/Atlas-master-IntegrationTests/ws/repository/target/checkstyle-result.xml>
with 30134 unique warnings and 0 duplicates.
[CHECKSTYLE] Successfully parsed file <https://builds.apache.org/job/Atlas-master-IntegrationTests/ws/server-api/target/checkstyle-result.xml>
with 30346 unique warnings and 0 duplicates.
[CHECKSTYLE] Successfully parsed file <https://builds.apache.org/job/Atlas-master-IntegrationTests/ws/shaded/hbase-client-shaded/target/checkstyle-result.xml>
with 30346 unique warnings and 0 duplicates.
[CHECKSTYLE] Successfully parsed file <https://builds.apache.org/job/Atlas-master-IntegrationTests/ws/shaded/hbase-server-shaded/target/checkstyle-result.xml>
with 30346 unique warnings and 0 duplicates.
[CHECKSTYLE] Successfully parsed file <https://builds.apache.org/job/Atlas-master-IntegrationTests/ws/target/checkstyle-result.xml>
with 30346 unique warnings and 0 duplicates.
[CHECKSTYLE] Successfully parsed file <https://builds.apache.org/job/Atlas-master-IntegrationTests/ws/webapp/target/checkstyle-result.xml>
with 38166 unique warnings and 0 duplicates.
<Git Blamer> Using GitBlamer to create author and commit information for all warnings.
<Git Blamer> GIT_COMMIT=2b43fd0064e1cf7b4f2b8724e2a502106a567999, workspace=<https://builds.apache.org/job/Atlas-master-IntegrationTests/ws/>
 > git rev-parse 2b43fd0064e1cf7b4f2b8724e2a502106a567999^{commit} # timeout=10
<Git Blamer> Skipping file <https://builds.apache.org/job/Atlas-master-IntegrationTests/ws/graphdb/janus/src/main/java/org/apache/atlas/repository/graphdb/janus/graphson/AtlasGraphSONMode.java,>
no result found.
<Git Blamer> Skipping file <https://builds.apache.org/job/Atlas-master-IntegrationTests/ws/graphdb/titan1/src/main/java/org/apache/atlas/repository/graphdb/titan1/graphson/AtlasGraphSONMode.java,>
no result found.
[FINDBUGS] Collecting findbugs analysis files...
[FINDBUGS] Searching for all files in <https://builds.apache.org/job/Atlas-master-IntegrationTests/ws/>
that match the pattern **/target/findbugs.xml
[FINDBUGS] Parsing 17 files in <https://builds.apache.org/job/Atlas-master-IntegrationTests/ws/>
[FINDBUGS] Successfully parsed file <https://builds.apache.org/job/Atlas-master-IntegrationTests/ws/addons/hive-bridge-shim/target/findbugs.xml>
with 0 unique warnings and 0 duplicates.
[FINDBUGS] Successfully parsed file <https://builds.apache.org/job/Atlas-master-IntegrationTests/ws/authorization/target/findbugs.xml>
with 0 unique warnings and 0 duplicates.
[FINDBUGS] Successfully parsed file <https://builds.apache.org/job/Atlas-master-IntegrationTests/ws/client/client-v1/target/findbugs.xml>
with 0 unique warnings and 0 duplicates.
[FINDBUGS] Successfully parsed file <https://builds.apache.org/job/Atlas-master-IntegrationTests/ws/client/client-v2/target/findbugs.xml>
with 0 unique warnings and 0 duplicates.
[FINDBUGS] Successfully parsed file <https://builds.apache.org/job/Atlas-master-IntegrationTests/ws/client/common/target/findbugs.xml>
with 0 unique warnings and 0 duplicates.
[FINDBUGS] Successfully parsed file <https://builds.apache.org/job/Atlas-master-IntegrationTests/ws/common/target/findbugs.xml>
with 0 unique warnings and 0 duplicates.
[FINDBUGS] Successfully parsed file <https://builds.apache.org/job/Atlas-master-IntegrationTests/ws/graphdb/api/target/findbugs.xml>
with 0 unique warnings and 0 duplicates.
[FINDBUGS] Successfully parsed file <https://builds.apache.org/job/Atlas-master-IntegrationTests/ws/graphdb/common/target/findbugs.xml>
with 0 unique warnings and 0 duplicates.
[FINDBUGS] Successfully parsed file <https://builds.apache.org/job/Atlas-master-IntegrationTests/ws/graphdb/janus/target/findbugs.xml>
with 0 unique warnings and 0 duplicates.
[FINDBUGS] Successfully parsed file <https://builds.apache.org/job/Atlas-master-IntegrationTests/ws/graphdb/titan0/target/findbugs.xml>
with 0 unique warnings and 0 duplicates.
[FINDBUGS] Successfully parsed file <https://builds.apache.org/job/Atlas-master-IntegrationTests/ws/graphdb/titan1/target/findbugs.xml>
with 0 unique warnings and 0 duplicates.
[FINDBUGS] Successfully parsed file <https://builds.apache.org/job/Atlas-master-IntegrationTests/ws/intg/target/findbugs.xml>
with 0 unique warnings and 0 duplicates.
[FINDBUGS] Successfully parsed file <https://builds.apache.org/job/Atlas-master-IntegrationTests/ws/notification/target/findbugs.xml>
with 0 unique warnings and 0 duplicates.
[FINDBUGS] Successfully parsed file <https://builds.apache.org/job/Atlas-master-IntegrationTests/ws/plugin-classloader/target/findbugs.xml>
with 0 unique warnings and 0 duplicates.
[FINDBUGS] Successfully parsed file <https://builds.apache.org/job/Atlas-master-IntegrationTests/ws/repository/target/findbugs.xml>
with 0 unique warnings and 0 duplicates.
[FINDBUGS] Successfully parsed file <https://builds.apache.org/job/Atlas-master-IntegrationTests/ws/server-api/target/findbugs.xml>
with 0 unique warnings and 0 duplicates.
[FINDBUGS] Successfully parsed file <https://builds.apache.org/job/Atlas-master-IntegrationTests/ws/webapp/target/findbugs.xml>
with 0 unique warnings and 0 duplicates.
<Git Blamer> Using GitBlamer to create author and commit information for all warnings.
<Git Blamer> GIT_COMMIT=2b43fd0064e1cf7b4f2b8724e2a502106a567999, workspace=<https://builds.apache.org/job/Atlas-master-IntegrationTests/ws/>
Archiving artifacts
[Fast Archiver] No prior successful build to compare, so performing full copy of artifacts
TestNG Reports Processing: START
Looking for TestNG results report in workspace using pattern: **/target/surefire-reports/testng-results.xml,**/target/failsafe-reports/testng-results.xml
Saving reports...
Processing '/x1/jenkins/jenkins-home/jobs/Atlas-master-IntegrationTests/builds/184/testng/testng-results.xml'
97.777779% of tests failed, which exceeded threshold of 0%. Marking build as UNSTABLE
TestNG Reports Processing: FINISH

Mime
View raw message