atlas-dev mailing list archives

Site index · List index
Message view « Date » · « Thread »
Top « Date » · « Thread »
From Apache Jenkins Server <jenk...@builds.apache.org>
Subject Build failed in Jenkins: Atlas-master-IntegrationTests #176
Date Wed, 01 Nov 2017 14:49:39 GMT
See <https://builds.apache.org/job/Atlas-master-IntegrationTests/176/display/redirect?page=changes>

Changes:

[kbhatt] ATLAS-2244 : UI - Basic Search Table not using referredEntities to

[kbhatt] ATLAS-2217 : Remove all taxonomy reference from UI

------------------------------------------
[...truncated 563.16 KB...]
127.0.0.1 - - [01/Nov/2017:14:45:04 +0000] "POST /api/atlas/entities HTTP/1.1" 201 2270 "-"
"Java/1.8.0_152"
127.0.0.1 - - [01/Nov/2017:14:45:04 +0000] "GET /api/atlas/entities/25a21e95-8ef9-468b-9c45-064df04f73e5
HTTP/1.1" 200 2075 "-" "Java/1.8.0_152"
127.0.0.1 - - [01/Nov/2017:14:45:04 +0000] "POST /api/atlas/entities HTTP/1.1" 201 863 "-"
"Java/1.8.0_152"
127.0.0.1 - - [01/Nov/2017:14:45:04 +0000] "POST /api/atlas/entities HTTP/1.1" 201 2270 "-"
"Java/1.8.0_152"
127.0.0.1 - - [01/Nov/2017:14:45:05 +0000] "GET /api/atlas/entities?type=hive_table HTTP/1.1"
200 743 "-" "Java/1.8.0_152"
127.0.0.1 - - [01/Nov/2017:14:45:05 +0000] "GET /api/atlas/entities?type=blah HTTP/1.1" 400
34 "-" "Java/1.8.0_152"
127.0.0.1 - - [01/Nov/2017:14:45:05 +0000] "GET /api/atlas/v2/types/typedef/name/testBOQj3d6B9j
HTTP/1.1" 404 91 "-" "Java/1.8.0_152"
127.0.0.1 - - [01/Nov/2017:14:45:05 +0000] "POST /api/atlas/types HTTP/1.1" 201 108 "-" "Java/1.8.0_152"
127.0.0.1 - - [01/Nov/2017:14:45:05 +0000] "GET /api/atlas/entities?type=testBOQj3d6B9j HTTP/1.1"
200 123 "-" "Java/1.8.0_152"
127.0.0.1 - - [01/Nov/2017:14:45:05 +0000] "GET /api/atlas/entities/blah HTTP/1.1" 404 72
"-" "Java/1.8.0_152"
127.0.0.1 - - [01/Nov/2017:14:45:05 +0000] "POST /api/atlas/entities HTTP/1.1" 201 863 "-"
"Java/1.8.0_152"
127.0.0.1 - - [01/Nov/2017:14:45:05 +0000] "POST /api/atlas/entities HTTP/1.1" 201 2270 "-"
"Java/1.8.0_152"
127.0.0.1 - - [01/Nov/2017:14:45:05 +0000] "GET /api/atlas/v2/types/typedef/name/PII_TraitmWDOGVFMVm
HTTP/1.1" 404 96 "-" "Java/1.8.0_152"
127.0.0.1 - - [01/Nov/2017:14:45:05 +0000] "POST /api/atlas/types HTTP/1.1" 201 113 "-" "Java/1.8.0_152"
127.0.0.1 - - [01/Nov/2017:14:45:05 +0000] "POST /api/atlas/entities/6e06d074-c162-45d9-af50-d044a64a5b55/traits
HTTP/1.1" 201 72 "-" "Java/1.8.0_152"
127.0.0.1 - - [01/Nov/2017:14:45:06 +0000] "GET /api/atlas/entities/6e06d074-c162-45d9-af50-d044a64a5b55/traitDefinitions/PII_TraitmWDOGVFMVm
HTTP/1.1" 200 206 "-" "Java/1.8.0_152"
127.0.0.1 - - [01/Nov/2017:14:45:06 +0000] "GET /api/atlas/entities/6e06d074-c162-45d9-af50-d044a64a5b55/traitDefinitions
HTTP/1.1" 200 1035 "-" "Java/1.8.0_152"
127.0.0.1 - - [01/Nov/2017:14:45:06 +0000] "POST /api/atlas/entities HTTP/1.1" 201 863 "-"
"Java/1.8.0_152"
127.0.0.1 - - [01/Nov/2017:14:45:06 +0000] "POST /api/atlas/entities HTTP/1.1" 201 2270 "-"
"Java/1.8.0_152"
127.0.0.1 - - [01/Nov/2017:14:45:06 +0000] "GET /api/atlas/entities/f5d6eb6e-2b17-4bd8-81b5-e6c7de0f3aed/traits
HTTP/1.1" 200 175 "-" "Java/1.8.0_152"
127.0.0.1 - - [01/Nov/2017:14:45:06 +0000] "POST /api/atlas/entities HTTP/1.1" 201 863 "-"
"Java/1.8.0_152"
127.0.0.1 - - [01/Nov/2017:14:45:06 +0000] "POST /api/atlas/entities HTTP/1.1" 201 2270 "-"
"Java/1.8.0_152"
127.0.0.1 - - [01/Nov/2017:14:45:06 +0000] "POST /api/atlas/entities/af90d08b-09a3-4b99-85fb-11346c6ea55c
HTTP/1.1" 200 1135 "-" "Java/1.8.0_152"
127.0.0.1 - - [01/Nov/2017:14:45:06 +0000] "GET /api/atlas/entities/af90d08b-09a3-4b99-85fb-11346c6ea55c
HTTP/1.1" 200 2888 "-" "Java/1.8.0_152"
127.0.0.1 - - [01/Nov/2017:14:45:06 +0000] "POST /api/atlas/entities HTTP/1.1" 201 863 "-"
"Java/1.8.0_152"
127.0.0.1 - - [01/Nov/2017:14:45:06 +0000] "POST /api/atlas/entities HTTP/1.1" 201 2270 "-"
"Java/1.8.0_152"
127.0.0.1 - - [01/Nov/2017:14:45:07 +0000] "POST /api/atlas/entities/qualifiedName?type=hive_table&property=qualifiedName&value=tableeprQKpwcYU
HTTP/1.1" 200 1132 "-" "Java/1.8.0_152"
127.0.0.1 - - [01/Nov/2017:14:45:07 +0000] "GET /api/atlas/entities/e2555074-7083-4c25-97f9-49d844c5956c
HTTP/1.1" 200 2885 "-" "Java/1.8.0_152"
127.0.0.1 - - [01/Nov/2017:14:45:07 +0000] "POST /api/atlas/entities HTTP/1.1" 201 856 "-"
"Java/1.8.0_152"
127.0.0.1 - - [01/Nov/2017:14:45:07 +0000] "GET /api/atlas/entities/b0404e40-6ef0-41a3-8391-ab3da9e297b7/audit?count=10
HTTP/1.1" 200 1609 "-" "Java/1.8.0_152"
127.0.0.1 - - [01/Nov/2017:14:45:07 +0000] "POST /api/atlas/entities HTTP/1.1" 201 863 "-"
"Java/1.8.0_152"
127.0.0.1 - - [01/Nov/2017:14:45:07 +0000] "POST /api/atlas/entities HTTP/1.1" 201 2270 "-"
"Java/1.8.0_152"
127.0.0.1 - - [01/Nov/2017:14:45:07 +0000] "POST /api/atlas/entities HTTP/1.1" 201 863 "-"
"Java/1.8.0_152"
127.0.0.1 - - [01/Nov/2017:14:45:07 +0000] "POST /api/atlas/entities HTTP/1.1" 400 62 "-"
"Java/1.8.0_152"
127.0.0.1 - - [01/Nov/2017:14:45:07 +0000] "POST /api/atlas/entities HTTP/1.1" 201 856 "-"
"Java/1.8.0_152"
127.0.0.1 - - [01/Nov/2017:14:45:07 +0000] "GET /api/atlas/v2/types/typedef/name/WqIPcYtw1N
HTTP/1.1" 404 87 "-" "Java/1.8.0_152"
127.0.0.1 - - [01/Nov/2017:14:45:07 +0000] "POST /api/atlas/types HTTP/1.1" 201 104 "-" "Java/1.8.0_152"
127.0.0.1 - - [01/Nov/2017:14:45:08 +0000] "POST /api/atlas/entities HTTP/1.1" 201 761 "-"
"Java/1.8.0_152"
127.0.0.1 - - [01/Nov/2017:14:45:08 +0000] "GET /api/atlas/entities/3c258ba9-5c37-4405-838d-702428013c9d
HTTP/1.1" 200 617 "-" "Java/1.8.0_152"
127.0.0.1 - - [01/Nov/2017:14:45:08 +0000] "GET /api/atlas/v2/types/typedef/name/PII_TraitvJeZl4PvgU
HTTP/1.1" 404 96 "-" "Java/1.8.0_152"
127.0.0.1 - - [01/Nov/2017:14:45:08 +0000] "POST /api/atlas/v2/types/typedefs HTTP/1.1" 200
411 "-" "Java/1.8.0_152"
127.0.0.1 - - [01/Nov/2017:14:45:08 +0000] "POST /api/atlas/v2/entity/guid/2878c955-160d-4021-875d-61469f1e3915/classifications
HTTP/1.1" 204 0 "-" "Java/1.8.0_152"
127.0.0.1 - - [01/Nov/2017:14:45:08 +0000] "GET /api/atlas/entities/2878c955-160d-4021-875d-61469f1e3915/audit?count=100
HTTP/1.1" 200 44667 "-" "Java/1.8.0_152"
127.0.0.1 - - [01/Nov/2017:14:45:08 +0000] "GET /api/atlas/v2/types/typedef/name/PII_Traitihym5Mekd5
HTTP/1.1" 404 96 "-" "Java/1.8.0_152"
127.0.0.1 - - [01/Nov/2017:14:45:08 +0000] "POST /api/atlas/v2/types/typedefs HTTP/1.1" 200
579 "-" "Java/1.8.0_152"
127.0.0.1 - - [01/Nov/2017:14:45:09 +0000] "POST /api/atlas/v2/entity/guid/2878c955-160d-4021-875d-61469f1e3915/classifications
HTTP/1.1" 204 0 "-" "Java/1.8.0_152"
127.0.0.1 - - [01/Nov/2017:14:45:09 +0000] "GET /api/atlas/v2/entity/guid/2878c955-160d-4021-875d-61469f1e3915
HTTP/1.1" 200 1554 "-" "Java/1.8.0_152"
127.0.0.1 - - [01/Nov/2017:14:45:09 +0000] "DELETE /api/atlas/v2/entity/guid/2878c955-160d-4021-875d-61469f1e3915/classification/PII_TraitvJeZl4PvgU
HTTP/1.1" 204 0 "-" "Java/1.8.0_152"
127.0.0.1 - - [01/Nov/2017:14:45:09 +0000] "GET /api/atlas/entities/2878c955-160d-4021-875d-61469f1e3915/audit?count=100
HTTP/1.1" 200 51898 "-" "Java/1.8.0_152"
127.0.0.1 - - [01/Nov/2017:14:45:09 +0000] "GET /api/atlas/types/blah HTTP/1.1" 404 43 "-"
"Java/1.8.0_152"
127.0.0.1 - - [01/Nov/2017:14:45:09 +0000] "GET /api/atlas/v2/types/typedef/name/class_trait
HTTP/1.1" 404 88 "-" "Java/1.8.0_152"
127.0.0.1 - - [01/Nov/2017:14:45:09 +0000] "POST /api/atlas/types HTTP/1.1" 201 105 "-" "Java/1.8.0_152"
127.0.0.1 - - [01/Nov/2017:14:45:09 +0000] "GET /api/atlas/v2/types/typedef/name/secure_trait
HTTP/1.1" 404 89 "-" "Java/1.8.0_152"
127.0.0.1 - - [01/Nov/2017:14:45:09 +0000] "POST /api/atlas/types HTTP/1.1" 201 106 "-" "Java/1.8.0_152"
127.0.0.1 - - [01/Nov/2017:14:45:10 +0000] "GET /api/atlas/v2/types/typedef/name/pii_trait
HTTP/1.1" 404 86 "-" "Java/1.8.0_152"
127.0.0.1 - - [01/Nov/2017:14:45:10 +0000] "POST /api/atlas/types HTTP/1.1" 201 103 "-" "Java/1.8.0_152"
127.0.0.1 - - [01/Nov/2017:14:45:10 +0000] "GET /api/atlas/v2/types/typedef/name/ssn_trait
HTTP/1.1" 404 86 "-" "Java/1.8.0_152"
127.0.0.1 - - [01/Nov/2017:14:45:10 +0000] "POST /api/atlas/types HTTP/1.1" 201 103 "-" "Java/1.8.0_152"
127.0.0.1 - - [01/Nov/2017:14:45:10 +0000] "GET /api/atlas/v2/types/typedef/name/salary_trait
HTTP/1.1" 404 89 "-" "Java/1.8.0_152"
127.0.0.1 - - [01/Nov/2017:14:45:10 +0000] "POST /api/atlas/types HTTP/1.1" 201 106 "-" "Java/1.8.0_152"
127.0.0.1 - - [01/Nov/2017:14:45:10 +0000] "GET /api/atlas/v2/types/typedef/name/sox_trait
HTTP/1.1" 404 86 "-" "Java/1.8.0_152"
127.0.0.1 - - [01/Nov/2017:14:45:10 +0000] "POST /api/atlas/types HTTP/1.1" 201 103 "-" "Java/1.8.0_152"
127.0.0.1 - - [01/Nov/2017:14:45:10 +0000] "GET /api/atlas/types?type=TRAIT HTTP/1.1" 200
1413 "-" "Java/1.8.0_152"
127.0.0.1 - - [01/Nov/2017:14:45:10 +0000] "GET /api/atlas/v2/types/typedef/name/AN0gMAItBI6
HTTP/1.1" 404 88 "-" "Java/1.8.0_152"
127.0.0.1 - - [01/Nov/2017:14:45:10 +0000] "POST /api/atlas/types HTTP/1.1" 201 105 "-" "Java/1.8.0_152"
127.0.0.1 - - [01/Nov/2017:14:45:11 +0000] "GET /api/atlas/v2/types/typedef/name/A1WMBOKbCczT
HTTP/1.1" 404 89 "-" "Java/1.8.0_152"
127.0.0.1 - - [01/Nov/2017:14:45:11 +0000] "POST /api/atlas/types HTTP/1.1" 201 106 "-" "Java/1.8.0_152"
127.0.0.1 - - [01/Nov/2017:14:45:11 +0000] "GET /api/atlas/v2/types/typedef/name/BNPOPqiSWEd
HTTP/1.1" 404 88 "-" "Java/1.8.0_152"
127.0.0.1 - - [01/Nov/2017:14:45:11 +0000] "POST /api/atlas/types HTTP/1.1" 201 105 "-" "Java/1.8.0_152"
127.0.0.1 - - [01/Nov/2017:14:45:11 +0000] "GET /api/atlas/v2/types/typedef/name/Cu22MBLy7Pp
HTTP/1.1" 404 88 "-" "Java/1.8.0_152"
127.0.0.1 - - [01/Nov/2017:14:45:11 +0000] "POST /api/atlas/types HTTP/1.1" 201 105 "-" "Java/1.8.0_152"
127.0.0.1 - - [01/Nov/2017:14:45:12 +0000] "GET /api/atlas/types?type=CLASS&supertype=AN0gMAItBI6&notsupertype=BNPOPqiSWEd
HTTP/1.1" 200 109 "-" "Java/1.8.0_152"
127.0.0.1 - - [01/Nov/2017:14:45:12 +0000] "GET /api/atlas/types/database HTTP/1.1" 200 665
"-" "Java/1.8.0_152"
127.0.0.1 - - [01/Nov/2017:14:45:12 +0000] "GET /api/atlas/types/table HTTP/1.1" 200 1447
"-" "Java/1.8.0_152"
127.0.0.1 - - [01/Nov/2017:14:45:12 +0000] "GET /api/atlas/types/fetl HTTP/1.1" 200 495 "-"
"Java/1.8.0_152"
127.0.0.1 - - [01/Nov/2017:14:45:12 +0000] "POST /api/atlas/types HTTP/1.1" 201 104 "-" "Java/1.8.0_152"
127.0.0.1 - - [01/Nov/2017:14:45:12 +0000] "PUT /api/atlas/types HTTP/1.1" 200 104 "-" "Java/1.8.0_152"
127.0.0.1 - - [01/Nov/2017:14:45:12 +0000] "GET /api/atlas/types/DiME65Drgn HTTP/1.1" 200
672 "-" "Java/1.8.0_152"
127.0.0.1 - - [01/Nov/2017:14:45:12 +0000] "POST /api/atlas/types HTTP/1.1" 201 104 "-" "Java/1.8.0_152"
127.0.0.1 - - [01/Nov/2017:14:45:13 +0000] "POST /api/atlas/types HTTP/1.1" 409 48 "-" "Java/1.8.0_152"
127.0.0.1 - - [01/Nov/2017:14:45:13 +0000] "GET /api/atlas/types/database HTTP/1.1" 200 665
"-" "Java/1.8.0_152"
127.0.0.1 - - [01/Nov/2017:14:45:13 +0000] "GET /api/atlas/types/table HTTP/1.1" 200 1447
"-" "Java/1.8.0_152"
127.0.0.1 - - [01/Nov/2017:14:45:13 +0000] "GET /api/atlas/types/fetl HTTP/1.1" 200 495 "-"
"Java/1.8.0_152"
127.0.0.1 - - [01/Nov/2017:14:45:13 +0000] "GET /api/atlas/types HTTP/1.1" 200 3937 "-" "Java/1.8.0_152"
Tests run: 136, Failures: 2, Errors: 0, Skipped: 0, Time elapsed: 213.923 sec <<<
FAILURE! - in TestSuite
testLineageIsMaintained(org.apache.atlas.examples.QuickStartIT)  Time elapsed: 2.039 sec 
<<< FAILURE!
java.lang.AssertionError: 
	at org.testng.AssertJUnit.fail(AssertJUnit.java:59)
	at org.testng.AssertJUnit.assertTrue(AssertJUnit.java:24)
	at org.testng.AssertJUnit.assertTrue(AssertJUnit.java:33)
	at org.apache.atlas.examples.QuickStartIT.testLineageIsMaintained(QuickStartIT.java:130)

testSimpleLoginAndAuthorizationWithValidCrendentialsAndInvalidAccessToResource(org.apache.atlas.web.filters.AtlasAuthenticationSimpleFilterIT)
 Time elapsed: 0.014 sec  <<< FAILURE!
java.lang.AssertionError: expected [403] but found [500]
	at org.testng.Assert.fail(Assert.java:94)
	at org.testng.Assert.failNotEquals(Assert.java:496)
	at org.testng.Assert.assertEquals(Assert.java:125)
	at org.testng.Assert.assertEquals(Assert.java:372)
	at org.testng.Assert.assertEquals(Assert.java:382)
	at org.apache.atlas.web.filters.AtlasAuthenticationSimpleFilterIT.testSimpleLoginAndAuthorizationWithValidCrendentialsAndInvalidAccessToResource(AtlasAuthenticationSimpleFilterIT.java:74)


Results :

Failed tests: 
  QuickStartIT.testLineageIsMaintained:130 
  AtlasAuthenticationSimpleFilterIT.testSimpleLoginAndAuthorizationWithValidCrendentialsAndInvalidAccessToResource:74
expected [403] but found [500]

Tests run: 136, Failures: 2, Errors: 0, Skipped: 0

[INFO] 
[INFO] --- jetty-maven-plugin:9.4.0.v20161208:stop (stop-jetty) @ atlas-webapp ---
[INFO] Waiting 10 seconds for jetty to stop
[INFO] Stopped ServerConnector@3b1722eb{HTTP/1.1,[http/1.1]}{0.0.0.0:31000}
[INFO] Stopped scavenging
[INFO] Closing Spring root WebApplicationContext
[INFO] Shutting down log4j
[INFO] Stopped o.e.j.m.p.JettyWebAppContext@6b2ee52c{/,file://<https://builds.apache.org/job/Atlas-master-IntegrationTests/ws/webapp/target/atlas-webapp-1.0.0-SNAPSHOT/,UNAVAILABLE}{/home/jenkins/jenkins-slave/workspace/Atlas-master-IntegrationTests/webapp/target/atlas-webapp-1.0.0-SNAPSHOT.war}>
[INFO] Server reports itself as stopped
[INFO] 
[INFO] --- maven-source-plugin:2.4:jar-no-fork (attach-sources) @ atlas-webapp ---
[INFO] Building jar: <https://builds.apache.org/job/Atlas-master-IntegrationTests/ws/webapp/target/atlas-webapp-1.0.0-SNAPSHOT-sources.jar>
log4j:WARN No appenders could be found for logger (org.apache.zookeeper.ClientCnxn).
log4j:WARN Please initialize the log4j system properly.
log4j:WARN See http://logging.apache.org/log4j/1.2/faq.html#noconfig for more info.
[INFO] 
[INFO] --- maven-source-plugin:2.4:test-jar-no-fork (attach-sources) @ atlas-webapp ---
[INFO] Building jar: <https://builds.apache.org/job/Atlas-master-IntegrationTests/ws/webapp/target/atlas-webapp-1.0.0-SNAPSHOT-test-sources.jar>
[INFO] 
[INFO] --- maven-failsafe-plugin:2.18.1:verify (verify) @ atlas-webapp ---
[INFO] Failsafe report directory: <https://builds.apache.org/job/Atlas-master-IntegrationTests/ws/webapp/target/failsafe-reports>
[INFO] ------------------------------------------------------------------------
[INFO] Reactor Summary:
[INFO] 
[INFO] Apache Atlas Server Build Tools .................... SUCCESS [  0.648 s]
[INFO] apache-atlas ....................................... SUCCESS [  4.060 s]
[INFO] Apache Atlas Integration ........................... SUCCESS [ 21.365 s]
[INFO] Apache Atlas Common ................................ SUCCESS [  7.896 s]
[INFO] Apache Atlas Typesystem ............................ SUCCESS [ 46.663 s]
[INFO] Apache Atlas Client ................................ SUCCESS [  0.634 s]
[INFO] atlas-client-common ................................ SUCCESS [  7.378 s]
[INFO] atlas-client-v1 .................................... SUCCESS [  7.413 s]
[INFO] Apache Atlas Server API ............................ SUCCESS [  6.043 s]
[INFO] Apache Atlas Notification .......................... SUCCESS [ 10.094 s]
[INFO] atlas-client-v2 .................................... SUCCESS [  6.138 s]
[INFO] Apache Atlas Graph Database Projects ............... SUCCESS [  0.491 s]
[INFO] Apache Atlas Graph Database API .................... SUCCESS [  5.400 s]
[INFO] Graph Database Common Code ......................... SUCCESS [  5.199 s]
[INFO] Shaded version of Apache hbase client .............. SUCCESS [  8.980 s]
[INFO] Apache Atlas Titan 0.5.4 Graph DB Impl ............. SUCCESS [ 41.525 s]
[INFO] Apache Atlas Graph Database Implementation Dependencies SUCCESS [  0.618 s]
[INFO] Apache Atlas Titan 1.0.0 GraphDB Impl .............. SUCCESS [ 31.897 s]
[INFO] Apache Atlas JanusGraph DB Impl .................... SUCCESS [ 18.456 s]
[INFO] Shaded version of Apache hbase server .............. SUCCESS [ 22.221 s]
[INFO] Apache Atlas Repository ............................ SUCCESS [01:20 min]
[INFO] Apache Atlas Authorization ......................... SUCCESS [  6.927 s]
[INFO] Apache Atlas UI .................................... SUCCESS [01:26 min]
[INFO] Apache Atlas Web Application ....................... FAILURE [05:10 min]
[INFO] Apache Atlas Documentation ......................... SKIPPED
[INFO] Apache Atlas FileSystem Model ...................... SKIPPED
[INFO] Apache Atlas Plugin Classloader .................... SKIPPED
[INFO] Apache Atlas Hive Bridge Shim ...................... SKIPPED
[INFO] Apache Atlas Hive Bridge ........................... SKIPPED
[INFO] Apache Atlas Falcon Bridge Shim .................... SKIPPED
[INFO] Apache Atlas Falcon Bridge ......................... SKIPPED
[INFO] Apache Atlas Sqoop Bridge Shim ..................... SKIPPED
[INFO] Apache Atlas Sqoop Bridge .......................... SKIPPED
[INFO] Apache Atlas Storm Bridge Shim ..................... SKIPPED
[INFO] Apache Atlas Storm Bridge .......................... SKIPPED
[INFO] Apache Atlas Hbase Bridge Shim ..................... SKIPPED
[INFO] Apache Atlas Hbase Bridge .......................... SKIPPED
[INFO] Apache Atlas Distribution .......................... SKIPPED
[INFO] ------------------------------------------------------------------------
[INFO] BUILD FAILURE
[INFO] ------------------------------------------------------------------------
[INFO] Total time: 12:18 min
[INFO] Finished at: 2017-11-01T14:45:35Z
[INFO] Final Memory: 401M/2836M
[INFO] ------------------------------------------------------------------------
[ERROR] Failed to execute goal org.apache.maven.plugins:maven-failsafe-plugin:2.18.1:verify
(verify) on project atlas-webapp: There are test failures.
[ERROR] 
[ERROR] Please refer to <https://builds.apache.org/job/Atlas-master-IntegrationTests/ws/webapp/target/failsafe-reports>
for the individual test results.
[ERROR] -> [Help 1]
[ERROR] 
[ERROR] To see the full stack trace of the errors, re-run Maven with the -e switch.
[ERROR] Re-run Maven using the -X switch to enable full debug logging.
[ERROR] 
[ERROR] For more information about the errors and possible solutions, please read the following
articles:
[ERROR] [Help 1] http://cwiki.apache.org/confluence/display/MAVEN/MojoFailureException
[ERROR] 
[ERROR] After correcting the problems, you can resume the build with the command
[ERROR]   mvn <goals> -rf :atlas-webapp
Build step 'Execute shell' marked build as failure
[CHECKSTYLE] Collecting checkstyle analysis files...
[CHECKSTYLE] Searching for all files in <https://builds.apache.org/job/Atlas-master-IntegrationTests/ws/>
that match the pattern **/target/checkstyle-result.xml
[CHECKSTYLE] Parsing 22 files in <https://builds.apache.org/job/Atlas-master-IntegrationTests/ws/>
[CHECKSTYLE] Successfully parsed file <https://builds.apache.org/job/Atlas-master-IntegrationTests/ws/authorization/target/checkstyle-result.xml>
with 461 unique warnings and 0 duplicates.
[CHECKSTYLE] Successfully parsed file <https://builds.apache.org/job/Atlas-master-IntegrationTests/ws/client/client-v1/target/checkstyle-result.xml>
with 1336 unique warnings and 0 duplicates.
[CHECKSTYLE] Successfully parsed file <https://builds.apache.org/job/Atlas-master-IntegrationTests/ws/client/client-v2/target/checkstyle-result.xml>
with 1676 unique warnings and 0 duplicates.
[CHECKSTYLE] Successfully parsed file <https://builds.apache.org/job/Atlas-master-IntegrationTests/ws/client/common/target/checkstyle-result.xml>
with 2166 unique warnings and 0 duplicates.
[CHECKSTYLE] Successfully parsed file <https://builds.apache.org/job/Atlas-master-IntegrationTests/ws/client/target/checkstyle-result.xml>
with 2166 unique warnings and 0 duplicates.
[CHECKSTYLE] Successfully parsed file <https://builds.apache.org/job/Atlas-master-IntegrationTests/ws/common/target/checkstyle-result.xml>
with 3131 unique warnings and 0 duplicates.
[CHECKSTYLE] Successfully parsed file <https://builds.apache.org/job/Atlas-master-IntegrationTests/ws/dashboardv2/target/checkstyle-result.xml>
with 3131 unique warnings and 0 duplicates.
[CHECKSTYLE] Successfully parsed file <https://builds.apache.org/job/Atlas-master-IntegrationTests/ws/graphdb/api/target/checkstyle-result.xml>
with 3404 unique warnings and 0 duplicates.
[CHECKSTYLE] Successfully parsed file <https://builds.apache.org/job/Atlas-master-IntegrationTests/ws/graphdb/common/target/checkstyle-result.xml>
with 3597 unique warnings and 0 duplicates.
[CHECKSTYLE] Successfully parsed file <https://builds.apache.org/job/Atlas-master-IntegrationTests/ws/graphdb/graphdb-impls/target/checkstyle-result.xml>
with 3597 unique warnings and 0 duplicates.
[CHECKSTYLE] Successfully parsed file <https://builds.apache.org/job/Atlas-master-IntegrationTests/ws/graphdb/janus/target/checkstyle-result.xml>
with 4588 unique warnings and 0 duplicates.
[CHECKSTYLE] Successfully parsed file <https://builds.apache.org/job/Atlas-master-IntegrationTests/ws/graphdb/target/checkstyle-result.xml>
with 4588 unique warnings and 0 duplicates.
[CHECKSTYLE] Successfully parsed file <https://builds.apache.org/job/Atlas-master-IntegrationTests/ws/graphdb/titan0/target/checkstyle-result.xml>
with 7047 unique warnings and 0 duplicates.
[CHECKSTYLE] Successfully parsed file <https://builds.apache.org/job/Atlas-master-IntegrationTests/ws/graphdb/titan1/target/checkstyle-result.xml>
with 8018 unique warnings and 0 duplicates.
[CHECKSTYLE] Successfully parsed file <https://builds.apache.org/job/Atlas-master-IntegrationTests/ws/intg/target/checkstyle-result.xml>
with 16224 unique warnings and 0 duplicates.
[CHECKSTYLE] Successfully parsed file <https://builds.apache.org/job/Atlas-master-IntegrationTests/ws/notification/target/checkstyle-result.xml>
with 17789 unique warnings and 0 duplicates.
[CHECKSTYLE] Successfully parsed file <https://builds.apache.org/job/Atlas-master-IntegrationTests/ws/repository/target/checkstyle-result.xml>
with 38123 unique warnings and 0 duplicates.
[CHECKSTYLE] Successfully parsed file <https://builds.apache.org/job/Atlas-master-IntegrationTests/ws/server-api/target/checkstyle-result.xml>
with 38516 unique warnings and 0 duplicates.
[CHECKSTYLE] Successfully parsed file <https://builds.apache.org/job/Atlas-master-IntegrationTests/ws/shaded/hbase-client-shaded/target/checkstyle-result.xml>
with 38516 unique warnings and 0 duplicates.
[CHECKSTYLE] Successfully parsed file <https://builds.apache.org/job/Atlas-master-IntegrationTests/ws/shaded/hbase-server-shaded/target/checkstyle-result.xml>
with 38516 unique warnings and 0 duplicates.
[CHECKSTYLE] Successfully parsed file <https://builds.apache.org/job/Atlas-master-IntegrationTests/ws/target/checkstyle-result.xml>
with 38516 unique warnings and 0 duplicates.
[CHECKSTYLE] Successfully parsed file <https://builds.apache.org/job/Atlas-master-IntegrationTests/ws/typesystem/target/checkstyle-result.xml>
with 42734 unique warnings and 0 duplicates.
<Git Blamer> Using GitBlamer to create author and commit information for all warnings.
<Git Blamer> GIT_COMMIT=37be53bbb7eec13f8ce57377c8653f482216553f, workspace=<https://builds.apache.org/job/Atlas-master-IntegrationTests/ws/>
 > git rev-parse 37be53bbb7eec13f8ce57377c8653f482216553f^{commit} # timeout=10
[FINDBUGS] Collecting findbugs analysis files...
[FINDBUGS] Searching for all files in <https://builds.apache.org/job/Atlas-master-IntegrationTests/ws/>
that match the pattern **/target/findbugs.xml
[FINDBUGS] Parsing 15 files in <https://builds.apache.org/job/Atlas-master-IntegrationTests/ws/>
[FINDBUGS] Successfully parsed file <https://builds.apache.org/job/Atlas-master-IntegrationTests/ws/authorization/target/findbugs.xml>
with 0 unique warnings and 0 duplicates.
[FINDBUGS] Successfully parsed file <https://builds.apache.org/job/Atlas-master-IntegrationTests/ws/client/client-v1/target/findbugs.xml>
with 0 unique warnings and 0 duplicates.
[FINDBUGS] Successfully parsed file <https://builds.apache.org/job/Atlas-master-IntegrationTests/ws/client/client-v2/target/findbugs.xml>
with 0 unique warnings and 0 duplicates.
[FINDBUGS] Successfully parsed file <https://builds.apache.org/job/Atlas-master-IntegrationTests/ws/client/common/target/findbugs.xml>
with 0 unique warnings and 0 duplicates.
[FINDBUGS] Successfully parsed file <https://builds.apache.org/job/Atlas-master-IntegrationTests/ws/common/target/findbugs.xml>
with 0 unique warnings and 0 duplicates.
[FINDBUGS] Successfully parsed file <https://builds.apache.org/job/Atlas-master-IntegrationTests/ws/graphdb/api/target/findbugs.xml>
with 0 unique warnings and 0 duplicates.
[FINDBUGS] Successfully parsed file <https://builds.apache.org/job/Atlas-master-IntegrationTests/ws/graphdb/common/target/findbugs.xml>
with 0 unique warnings and 0 duplicates.
[FINDBUGS] Successfully parsed file <https://builds.apache.org/job/Atlas-master-IntegrationTests/ws/graphdb/janus/target/findbugs.xml>
with 0 unique warnings and 0 duplicates.
[FINDBUGS] Successfully parsed file <https://builds.apache.org/job/Atlas-master-IntegrationTests/ws/graphdb/titan0/target/findbugs.xml>
with 0 unique warnings and 0 duplicates.
[FINDBUGS] Successfully parsed file <https://builds.apache.org/job/Atlas-master-IntegrationTests/ws/graphdb/titan1/target/findbugs.xml>
with 0 unique warnings and 0 duplicates.
[FINDBUGS] Successfully parsed file <https://builds.apache.org/job/Atlas-master-IntegrationTests/ws/intg/target/findbugs.xml>
with 0 unique warnings and 0 duplicates.
[FINDBUGS] Successfully parsed file <https://builds.apache.org/job/Atlas-master-IntegrationTests/ws/notification/target/findbugs.xml>
with 0 unique warnings and 0 duplicates.
[FINDBUGS] Successfully parsed file <https://builds.apache.org/job/Atlas-master-IntegrationTests/ws/repository/target/findbugs.xml>
with 0 unique warnings and 0 duplicates.
[FINDBUGS] Successfully parsed file <https://builds.apache.org/job/Atlas-master-IntegrationTests/ws/server-api/target/findbugs.xml>
with 0 unique warnings and 0 duplicates.
[FINDBUGS] Successfully parsed file <https://builds.apache.org/job/Atlas-master-IntegrationTests/ws/typesystem/target/findbugs.xml>
with 0 unique warnings and 0 duplicates.
<Git Blamer> Using GitBlamer to create author and commit information for all warnings.
<Git Blamer> GIT_COMMIT=37be53bbb7eec13f8ce57377c8653f482216553f, workspace=<https://builds.apache.org/job/Atlas-master-IntegrationTests/ws/>
Archiving artifacts
[Fast Archiver] No prior successful build to compare, so performing full copy of artifacts
TestNG Reports Processing: START
Looking for TestNG results report in workspace using pattern: **/target/surefire-reports/testng-results.xml,**/target/failsafe-reports/testng-results.xml
Saving reports...
Processing '/x1/jenkins/jenkins-home/jobs/Atlas-master-IntegrationTests/builds/176/testng/testng-results.xml'
1.470588% of tests failed, which exceeded threshold of 0%. Marking build as UNSTABLE
TestNG Reports Processing: FINISH

Mime
View raw message