atlas-dev mailing list archives

Site index · List index
Message view « Date » · « Thread »
Top « Date » · « Thread »
From Apache Jenkins Server <jenk...@builds.apache.org>
Subject Build failed in Jenkins: Atlas-0.8-IntegrationTests #133
Date Tue, 21 Nov 2017 04:57:42 GMT
See <https://builds.apache.org/job/Atlas-0.8-IntegrationTests/133/display/redirect?page=changes>

Changes:

[ssubramanian] ATLAS-2271: Skip deploy of build-tools module during - mvn deploy

------------------------------------------
[...truncated 527.79 KB...]
127.0.0.1 - - [21/Nov/2017:04:52:44 +0000] "GET /api/atlas/v2/search/dsl?offset=0&query=%60Log+Data%60&limit=10
HTTP/1.1" 200 - "-" "Java/1.8.0_152"
127.0.0.1 - - [21/Nov/2017:04:52:45 +0000] "GET /api/atlas/v2/search/dsl?offset=0&query=Table+where+name%3D%22sales_fact%22,+columns&limit=10
HTTP/1.1" 200 - "-" "Java/1.8.0_152"
127.0.0.1 - - [21/Nov/2017:04:52:45 +0000] "GET /api/atlas/v2/search/dsl?offset=0&query=Table+where+name%3D%22sales_fact%22,+columns+as+column+select+column.name,+column.dataType,+column.comment&limit=10
HTTP/1.1" 200 - "-" "Java/1.8.0_152"
127.0.0.1 - - [21/Nov/2017:04:52:47 +0000] "GET /api/atlas/v2/search/dsl?offset=0&query=from+DataSet&limit=10
HTTP/1.1" 200 - "-" "Java/1.8.0_152"
127.0.0.1 - - [21/Nov/2017:04:52:48 +0000] "GET /api/atlas/v2/search/dsl?offset=0&query=from+Process&limit=10
HTTP/1.1" 200 - "-" "Java/1.8.0_152"
127.0.0.1 - - [21/Nov/2017:04:52:48 +0000] "GET /api/atlas/v2/entity/uniqueAttribute/type/Table?attr:qualifiedName=sales_fact_daily_mv
HTTP/1.1" 200 - "-" "Java/1.8.0_152"
127.0.0.1 - - [21/Nov/2017:04:52:48 +0000] "GET /api/atlas/v2/lineage/f7ac3b24-69ce-428d-a7c7-1547d1b3fdbd?depth=0&direction=BOTH
HTTP/1.1" 200 - "-" "Java/1.8.0_152"
127.0.0.1 - - [21/Nov/2017:04:52:50 +0000] "GET /api/atlas/v2/entity/uniqueAttribute/type/DB?attr:name=Sales
HTTP/1.1" 200 - "-" "Java/1.8.0_152"
127.0.0.1 - - [21/Nov/2017:04:52:50 +0000] "GET /api/atlas/v2/entity/uniqueAttribute/type/Table?attr:qualifiedName=sales_fact
HTTP/1.1" 200 - "-" "Java/1.8.0_152"
127.0.0.1 - - [21/Nov/2017:04:52:50 +0000] "GET /api/atlas/v2/entity/uniqueAttribute/type/Table?attr:qualifiedName=time_dim
HTTP/1.1" 200 - "-" "Java/1.8.0_152"
127.0.0.1 - - [21/Nov/2017:04:52:50 +0000] "GET /api/atlas/v2/entity/uniqueAttribute/type/Table?attr:qualifiedName=sales_fact_daily_mv
HTTP/1.1" 200 - "-" "Java/1.8.0_152"
127.0.0.1 - - [21/Nov/2017:04:52:51 +0000] "GET /api/atlas/v2/entity/uniqueAttribute/type/Table?attr:qualifiedName=sales_fact_monthly_mv
HTTP/1.1" 200 - "-" "Java/1.8.0_152"
127.0.0.1 - - [21/Nov/2017:04:52:51 +0000] "GET /api/atlas/v2/entity/uniqueAttribute/type/LoadProcess?attr:qualifiedName=loadSalesDaily
HTTP/1.1" 200 - "-" "Java/1.8.0_152"
127.0.0.1 - - [21/Nov/2017:04:52:51 +0000] "GET /api/atlas/v2/entity/uniqueAttribute/type/LoadProcess?attr:qualifiedName=loadSalesMonthly
HTTP/1.1" 200 - "-" "Java/1.8.0_152"
127.0.0.1 - - [21/Nov/2017:04:52:51 +0000] "GET /api/atlas/v2/lineage/f7ac3b24-69ce-428d-a7c7-1547d1b3fdbd?depth=0&direction=BOTH
HTTP/1.1" 200 - "-" "Java/1.8.0_152"
127.0.0.1 - - [21/Nov/2017:04:52:52 +0000] "GET /api/atlas/v2/entity/uniqueAttribute/type/LoadProcess?attr:qualifiedName=loadSalesDaily
HTTP/1.1" 200 - "-" "Java/1.8.0_152"
127.0.0.1 - - [21/Nov/2017:04:52:52 +0000] "GET /api/atlas/v2/entity/uniqueAttribute/type/Table?attr:qualifiedName=sales_fact
HTTP/1.1" 200 - "-" "Java/1.8.0_152"
127.0.0.1 - - [21/Nov/2017:04:52:53 +0000] "GET /api/atlas/v2/entity/uniqueAttribute/type/Table?attr:qualifiedName=time_dim
HTTP/1.1" 200 - "-" "Java/1.8.0_152"
127.0.0.1 - - [21/Nov/2017:04:52:53 +0000] "GET /api/atlas/v2/entity/uniqueAttribute/type/Table?attr:qualifiedName=sales_fact_daily_mv
HTTP/1.1" 200 - "-" "Java/1.8.0_152"
127.0.0.1 - - [21/Nov/2017:04:52:53 +0000] "GET /api/atlas/v2/entity/uniqueAttribute/type/Table?attr:qualifiedName=sales_fact
HTTP/1.1" 200 - "-" "Java/1.8.0_152"
127.0.0.1 - - [21/Nov/2017:04:52:53 +0000] "GET /api/atlas/v2/entity/uniqueAttribute/type/DB?attr:name=Sales
HTTP/1.1" 200 - "-" "Java/1.8.0_152"
127.0.0.1 - - [21/Nov/2017:04:52:53 +0000] "GET /api/atlas/v2/entity/guid/2fb97199-725d-4a84-9627-7b0dc2dda388/classifications
HTTP/1.1" 200 - "-" "Java/1.8.0_152"
127.0.0.1 - - [21/Nov/2017:04:52:53 +0000] "GET /api/atlas/v2/entity/uniqueAttribute/type/View?attr:qualifiedName=product_dim_view
HTTP/1.1" 200 - "-" "Java/1.8.0_152"
127.0.0.1 - - [21/Nov/2017:04:52:53 +0000] "GET /api/atlas/v2/entity/uniqueAttribute/type/Table?attr:qualifiedName=product_dim
HTTP/1.1" 200 - "-" "Java/1.8.0_152"
127.0.0.1 - - [21/Nov/2017:04:52:53 +0000] "POST /api/atlas/types HTTP/1.1" 201 - "-" "Java/1.8.0_152"
127.0.0.1 - - [21/Nov/2017:04:52:54 +0000] "GET /api/atlas/types HTTP/1.1" 200 - "-" "Java/1.8.0_152"
127.0.0.1 - - [21/Nov/2017:04:52:54 +0000] "POST /api/atlas/entities HTTP/1.1" 201 - "-" "Java/1.8.0_152"
127.0.0.1 - - [21/Nov/2017:04:52:55 +0000] "POST /api/atlas/entities HTTP/1.1" 201 - "-" "Java/1.8.0_152"
127.0.0.1 - - [21/Nov/2017:04:52:55 +0000] "POST /api/atlas/entities HTTP/1.1" 201 - "-" "Java/1.8.0_152"
127.0.0.1 - - [21/Nov/2017:04:52:55 +0000] "POST /api/atlas/entities HTTP/1.1" 201 - "-" "Java/1.8.0_152"
127.0.0.1 - - [21/Nov/2017:04:52:55 +0000] "POST /api/atlas/entities HTTP/1.1" 201 - "-" "Java/1.8.0_152"
127.0.0.1 - - [21/Nov/2017:04:52:55 +0000] "POST /api/atlas/entities HTTP/1.1" 201 - "-" "Java/1.8.0_152"
127.0.0.1 - - [21/Nov/2017:04:52:55 +0000] "POST /api/atlas/entities HTTP/1.1" 201 - "-" "Java/1.8.0_152"
127.0.0.1 - - [21/Nov/2017:04:52:55 +0000] "POST /api/atlas/entities HTTP/1.1" 201 - "-" "Java/1.8.0_152"
127.0.0.1 - - [21/Nov/2017:04:52:55 +0000] "POST /api/atlas/entities HTTP/1.1" 201 - "-" "Java/1.8.0_152"
127.0.0.1 - - [21/Nov/2017:04:52:55 +0000] "POST /api/atlas/entities HTTP/1.1" 201 - "-" "Java/1.8.0_152"
127.0.0.1 - - [21/Nov/2017:04:52:56 +0000] "POST /api/atlas/entities HTTP/1.1" 201 - "-" "Java/1.8.0_152"
127.0.0.1 - - [21/Nov/2017:04:52:56 +0000] "POST /api/atlas/entities HTTP/1.1" 201 - "-" "Java/1.8.0_152"
127.0.0.1 - - [21/Nov/2017:04:52:56 +0000] "POST /api/atlas/entities HTTP/1.1" 201 - "-" "Java/1.8.0_152"
127.0.0.1 - - [21/Nov/2017:04:52:56 +0000] "POST /api/atlas/entities HTTP/1.1" 201 - "-" "Java/1.8.0_152"
127.0.0.1 - - [21/Nov/2017:04:52:56 +0000] "POST /api/atlas/entities HTTP/1.1" 201 - "-" "Java/1.8.0_152"
127.0.0.1 - - [21/Nov/2017:04:52:56 +0000] "POST /api/atlas/entities HTTP/1.1" 201 - "-" "Java/1.8.0_152"
127.0.0.1 - - [21/Nov/2017:04:52:56 +0000] "GET /api/atlas/discovery/search?query=from+DB_v1&limit=10&offset=0
HTTP/1.1" 200 - "-" "Java/1.8.0_152"
127.0.0.1 - - [21/Nov/2017:04:52:57 +0000] "GET /api/atlas/discovery/search?query=DB_v1&limit=10&offset=0
HTTP/1.1" 200 - "-" "Java/1.8.0_152"
127.0.0.1 - - [21/Nov/2017:04:52:58 +0000] "GET /api/atlas/discovery/search?query=DB_v1+where+name%3D%22Reporting%22&limit=10&offset=0
HTTP/1.1" 200 - "-" "Java/1.8.0_152"
127.0.0.1 - - [21/Nov/2017:04:52:58 +0000] "GET /api/atlas/discovery/search?query=DB_v1+where+DB_v1.name%3D%22Reporting%22&limit=10&offset=0
HTTP/1.1" 200 - "-" "Java/1.8.0_152"
127.0.0.1 - - [21/Nov/2017:04:52:59 +0000] "GET /api/atlas/discovery/search?query=DB_v1+name+%3D+%22Reporting%22&limit=10&offset=0
HTTP/1.1" 200 - "-" "Java/1.8.0_152"
127.0.0.1 - - [21/Nov/2017:04:53:00 +0000] "GET /api/atlas/discovery/search?query=DB_v1+DB_v1.name+%3D+%22Reporting%22&limit=10&offset=0
HTTP/1.1" 200 - "-" "Java/1.8.0_152"
127.0.0.1 - - [21/Nov/2017:04:53:01 +0000] "GET /api/atlas/discovery/search?query=DB_v1+where+name%3D%22Reporting%22+select+name,+owner&limit=10&offset=0
HTTP/1.1" 200 - "-" "Java/1.8.0_152"
127.0.0.1 - - [21/Nov/2017:04:53:02 +0000] "GET /api/atlas/discovery/search?query=DB_v1+where+DB_v1.name%3D%22Reporting%22+select+name,+owner&limit=10&offset=0
HTTP/1.1" 200 - "-" "Java/1.8.0_152"
127.0.0.1 - - [21/Nov/2017:04:53:03 +0000] "GET /api/atlas/discovery/search?query=DB_v1+has+name&limit=10&offset=0
HTTP/1.1" 200 - "-" "Java/1.8.0_152"
127.0.0.1 - - [21/Nov/2017:04:53:04 +0000] "GET /api/atlas/discovery/search?query=DB_v1+where+DB_v1+has+name&limit=10&offset=0
HTTP/1.1" 200 - "-" "Java/1.8.0_152"
127.0.0.1 - - [21/Nov/2017:04:53:05 +0000] "GET /api/atlas/discovery/search?query=DB_v1,+Table_v1&limit=10&offset=0
HTTP/1.1" 200 - "-" "Java/1.8.0_152"
127.0.0.1 - - [21/Nov/2017:04:53:06 +0000] "GET /api/atlas/discovery/search?query=DB_v1+is+JdbcAccess&limit=10&offset=0
HTTP/1.1" 200 - "-" "Java/1.8.0_152"
127.0.0.1 - - [21/Nov/2017:04:53:06 +0000] "GET /api/atlas/discovery/search?query=from+Table_v1&limit=10&offset=0
HTTP/1.1" 200 - "-" "Java/1.8.0_152"
127.0.0.1 - - [21/Nov/2017:04:53:07 +0000] "GET /api/atlas/discovery/search?query=Table_v1&limit=10&offset=0
HTTP/1.1" 200 - "-" "Java/1.8.0_152"
127.0.0.1 - - [21/Nov/2017:04:53:08 +0000] "GET /api/atlas/discovery/search?query=Table_v1+is+Dimension_v1&limit=10&offset=0
HTTP/1.1" 200 - "-" "Java/1.8.0_152"
127.0.0.1 - - [21/Nov/2017:04:53:09 +0000] "GET /api/atlas/discovery/search?query=Column_v1+where+Column_v1+isa+PII_v1&limit=10&offset=0
HTTP/1.1" 200 - "-" "Java/1.8.0_152"
127.0.0.1 - - [21/Nov/2017:04:53:09 +0000] "GET /api/atlas/discovery/search?query=View_v1+is+Dimension_v1&limit=10&offset=0
HTTP/1.1" 200 - "-" "Java/1.8.0_152"
127.0.0.1 - - [21/Nov/2017:04:53:10 +0000] "GET /api/atlas/discovery/search?query=Column_v1+select+Column_v1.name&limit=10&offset=0
HTTP/1.1" 200 - "-" "Java/1.8.0_152"
127.0.0.1 - - [21/Nov/2017:04:53:11 +0000] "GET /api/atlas/discovery/search?query=Column_v1+select+name&limit=10&offset=0
HTTP/1.1" 200 - "-" "Java/1.8.0_152"
127.0.0.1 - - [21/Nov/2017:04:53:12 +0000] "GET /api/atlas/discovery/search?query=Column_v1+where+Column_v1.name%3D%22customer_id%22&limit=10&offset=0
HTTP/1.1" 200 - "-" "Java/1.8.0_152"
127.0.0.1 - - [21/Nov/2017:04:53:13 +0000] "GET /api/atlas/discovery/search?query=from+Table_v1+select+Table_v1.name&limit=10&offset=0
HTTP/1.1" 200 - "-" "Java/1.8.0_152"
127.0.0.1 - - [21/Nov/2017:04:53:14 +0000] "GET /api/atlas/discovery/search?query=DB_v1+where+(name+%3D+%22Reporting%22)&limit=10&offset=0
HTTP/1.1" 200 - "-" "Java/1.8.0_152"
127.0.0.1 - - [21/Nov/2017:04:53:15 +0000] "GET /api/atlas/discovery/search?query=DB_v1+where+(name+%3D+%22Reporting%22)+select+name+as+_col_0,+owner+as+_col_1&limit=10&offset=0
HTTP/1.1" 200 - "-" "Java/1.8.0_152"
127.0.0.1 - - [21/Nov/2017:04:53:16 +0000] "GET /api/atlas/discovery/search?query=DB_v1+where+DB_v1+is+JdbcAccess_v1&limit=10&offset=0
HTTP/1.1" 200 - "-" "Java/1.8.0_152"
127.0.0.1 - - [21/Nov/2017:04:53:17 +0000] "GET /api/atlas/discovery/search?query=DB_v1+where+DB_v1+has+name&limit=10&offset=0
HTTP/1.1" 200 - "-" "Java/1.8.0_152"
127.0.0.1 - - [21/Nov/2017:04:53:18 +0000] "GET /api/atlas/discovery/search?query=DB_v1+Table_v1&limit=10&offset=0
HTTP/1.1" 200 - "-" "Java/1.8.0_152"
127.0.0.1 - - [21/Nov/2017:04:53:18 +0000] "GET /api/atlas/discovery/search?query=DB_v1+where+DB_v1+has+name&limit=10&offset=0
HTTP/1.1" 200 - "-" "Java/1.8.0_152"
127.0.0.1 - - [21/Nov/2017:04:53:19 +0000] "GET /api/atlas/discovery/search?query=DB_v1+as+db1+Table+where+(db1.name+%3D+%22Reporting%22)&limit=10&offset=0
HTTP/1.1" 200 - "-" "Java/1.8.0_152"
127.0.0.1 - - [21/Nov/2017:04:53:19 +0000] "GET /api/atlas/discovery/search?query=DB_v1+where+(name+%3D+%22Reporting%22)+select+name+as+_col_0,+(createTime+%2B+1)+as+_col_1+&limit=10&offset=0
HTTP/1.1" 200 - "-" "Java/1.8.0_152"
127.0.0.1 - - [21/Nov/2017:04:53:21 +0000] "GET /api/atlas/discovery/search?query=Dimension_v1&limit=10&offset=0
HTTP/1.1" 200 - "-" "Java/1.8.0_152"
127.0.0.1 - - [21/Nov/2017:04:53:21 +0000] "GET /api/atlas/discovery/search?query=JdbcAccess_v1&limit=10&offset=0
HTTP/1.1" 200 - "-" "Java/1.8.0_152"
127.0.0.1 - - [21/Nov/2017:04:53:22 +0000] "GET /api/atlas/discovery/search?query=ETL_v1&limit=10&offset=0
HTTP/1.1" 200 - "-" "Java/1.8.0_152"
127.0.0.1 - - [21/Nov/2017:04:53:23 +0000] "GET /api/atlas/discovery/search?query=Metric_v1&limit=10&offset=0
HTTP/1.1" 200 - "-" "Java/1.8.0_152"
127.0.0.1 - - [21/Nov/2017:04:53:24 +0000] "GET /api/atlas/discovery/search?query=PII_v1&limit=10&offset=0
HTTP/1.1" 200 - "-" "Java/1.8.0_152"
127.0.0.1 - - [21/Nov/2017:04:53:24 +0000] "GET /api/atlas/discovery/search?query=%60Log+Data_v1%60&limit=10&offset=0
HTTP/1.1" 200 - "-" "Java/1.8.0_152"
127.0.0.1 - - [21/Nov/2017:04:53:25 +0000] "GET /api/atlas/discovery/search?query=Table_v1+where+name%3D%22sales_fact%22,+columns&limit=10&offset=0
HTTP/1.1" 200 - "-" "Java/1.8.0_152"
127.0.0.1 - - [21/Nov/2017:04:53:26 +0000] "GET /api/atlas/discovery/search?query=Table_v1+where+name%3D%22sales_fact%22,+columns+as+column+select+column.name,+column.dataType,+column.comment&limit=10&offset=0
HTTP/1.1" 200 - "-" "Java/1.8.0_152"
127.0.0.1 - - [21/Nov/2017:04:53:27 +0000] "GET /api/atlas/discovery/search?query=from+DataSet&limit=10&offset=0
HTTP/1.1" 200 - "-" "Java/1.8.0_152"
127.0.0.1 - - [21/Nov/2017:04:53:28 +0000] "GET /api/atlas/discovery/search?query=from+Process&limit=10&offset=0
HTTP/1.1" 200 - "-" "Java/1.8.0_152"
127.0.0.1 - - [21/Nov/2017:04:53:29 +0000] "GET /api/atlas/entities?type=DB_v1&property=name&value=Sales
HTTP/1.1" 200 - "-" "Java/1.8.0_152"
127.0.0.1 - - [21/Nov/2017:04:53:29 +0000] "GET /api/atlas/entities?type=Table_v1&property=qualifiedName&value=sales_fact
HTTP/1.1" 200 - "-" "Java/1.8.0_152"
127.0.0.1 - - [21/Nov/2017:04:53:29 +0000] "GET /api/atlas/entities?type=Table_v1&property=qualifiedName&value=time_dim
HTTP/1.1" 200 - "-" "Java/1.8.0_152"
127.0.0.1 - - [21/Nov/2017:04:53:29 +0000] "GET /api/atlas/entities?type=Table_v1&property=qualifiedName&value=sales_fact_daily_mv
HTTP/1.1" 200 - "-" "Java/1.8.0_152"
127.0.0.1 - - [21/Nov/2017:04:53:29 +0000] "GET /api/atlas/lineage/hive/table/sales_fact_daily_mv/inputs/graph
HTTP/1.1" 200 - "-" "Java/1.8.0_152"
127.0.0.1 - - [21/Nov/2017:04:53:31 +0000] "GET /api/atlas/entities?type=LoadProcess_v1&property=qualifiedName&value=loadSalesDaily
HTTP/1.1" 200 - "-" "Java/1.8.0_152"
127.0.0.1 - - [21/Nov/2017:04:53:31 +0000] "GET /api/atlas/entities?type=Table_v1&property=qualifiedName&value=sales_fact
HTTP/1.1" 200 - "-" "Java/1.8.0_152"
127.0.0.1 - - [21/Nov/2017:04:53:31 +0000] "GET /api/atlas/entities?type=Table_v1&property=qualifiedName&value=time_dim
HTTP/1.1" 200 - "-" "Java/1.8.0_152"
127.0.0.1 - - [21/Nov/2017:04:53:31 +0000] "GET /api/atlas/entities?type=Table_v1&property=qualifiedName&value=sales_fact_daily_mv
HTTP/1.1" 200 - "-" "Java/1.8.0_152"
127.0.0.1 - - [21/Nov/2017:04:53:31 +0000] "GET /api/atlas/entities?type=Table_v1&property=qualifiedName&value=sales_fact
HTTP/1.1" 200 - "-" "Java/1.8.0_152"
127.0.0.1 - - [21/Nov/2017:04:53:31 +0000] "GET /api/atlas/entities?type=DB_v1&property=name&value=Sales
HTTP/1.1" 200 - "-" "Java/1.8.0_152"
127.0.0.1 - - [21/Nov/2017:04:53:31 +0000] "GET /api/atlas/entities?type=View_v1&property=qualifiedName&value=product_dim_view
HTTP/1.1" 200 - "-" "Java/1.8.0_152"
127.0.0.1 - - [21/Nov/2017:04:53:31 +0000] "GET /api/atlas/entities?type=Table_v1&property=qualifiedName&value=product_dim
HTTP/1.1" 200 - "-" "Java/1.8.0_152"
Tests run: 136, Failures: 1, Errors: 0, Skipped: 0, Time elapsed: 198.667 sec <<<
FAILURE! - in TestSuite
testLineageIsMaintained(org.apache.atlas.examples.QuickStartIT)  Time elapsed: 2.099 sec 
<<< FAILURE!
java.lang.AssertionError: 
	at org.testng.AssertJUnit.fail(AssertJUnit.java:59)
	at org.testng.AssertJUnit.assertTrue(AssertJUnit.java:24)
	at org.testng.AssertJUnit.assertTrue(AssertJUnit.java:33)
	at org.apache.atlas.examples.QuickStartIT.testLineageIsMaintained(QuickStartIT.java:130)


Results :

Failed tests: 
  QuickStartIT.testLineageIsMaintained:130 

Tests run: 136, Failures: 1, Errors: 0, Skipped: 0

[INFO] 
[INFO] --- jetty-maven-plugin:9.2.12.v20150709:stop (stop-jetty) @ atlas-webapp ---
[INFO] Waiting 10 seconds for jetty to stop
[INFO] Stopped ServerConnector@656b1b76{HTTP/1.1}{0.0.0.0:31000}
[INFO] Closing Spring root WebApplicationContext
[INFO] Shutting down log4j
[INFO] Not cleaning cached beans: no such field javax.el.BeanELResolver.properties
[INFO] Stopped o.e.j.m.p.JettyWebAppContext@27f969a9{/,<https://builds.apache.org/job/Atlas-0.8-IntegrationTests/ws/webapp/target/atlas-webapp-0.8.2-SNAPSHOT/,UNAVAILABLE}{/home/jenkins/jenkins-slave/workspace/Atlas-0.8-IntegrationTests/webapp/target/atlas-webapp-0.8.2-SNAPSHOT.war}>
[INFO] Server reports itself as stopped
[INFO] 
[INFO] --- maven-source-plugin:2.4:jar-no-fork (attach-sources) @ atlas-webapp ---
[INFO] Building jar: <https://builds.apache.org/job/Atlas-0.8-IntegrationTests/ws/webapp/target/atlas-webapp-0.8.2-SNAPSHOT-sources.jar>
[INFO] 
[INFO] --- maven-source-plugin:2.4:test-jar-no-fork (attach-sources) @ atlas-webapp ---
[INFO] Building jar: <https://builds.apache.org/job/Atlas-0.8-IntegrationTests/ws/webapp/target/atlas-webapp-0.8.2-SNAPSHOT-test-sources.jar>
[INFO] 
[INFO] --- maven-failsafe-plugin:2.18.1:verify (verify) @ atlas-webapp ---
[INFO] Failsafe report directory: <https://builds.apache.org/job/Atlas-0.8-IntegrationTests/ws/webapp/target/failsafe-reports>
[INFO] ------------------------------------------------------------------------
[INFO] Reactor Summary:
[INFO] 
[INFO] Apache Atlas Server Build Tools .................... SUCCESS [  7.455 s]
[INFO] apache-atlas ....................................... SUCCESS [ 39.498 s]
[INFO] Apache Atlas Integration ........................... SUCCESS [ 49.339 s]
[INFO] Apache Atlas Common ................................ SUCCESS [  9.708 s]
[INFO] Apache Atlas Typesystem ............................ SUCCESS [ 51.436 s]
[INFO] Apache Atlas Client ................................ SUCCESS [  0.809 s]
[INFO] atlas-client-common ................................ SUCCESS [  7.614 s]
[INFO] atlas-client-v1 .................................... SUCCESS [  7.919 s]
[INFO] Apache Atlas Server API ............................ SUCCESS [  6.677 s]
[INFO] Apache Atlas Notification .......................... SUCCESS [ 10.892 s]
[INFO] atlas-client-v2 .................................... SUCCESS [  6.542 s]
[INFO] Apache Atlas Graph Database Projects ............... SUCCESS [  0.544 s]
[INFO] Apache Atlas Graph Database API .................... SUCCESS [  5.553 s]
[INFO] Graph Database Common Code ......................... SUCCESS [  5.649 s]
[INFO] Apache Atlas Titan 1.0.0 GraphDB Impl .............. SUCCESS [ 39.327 s]
[INFO] Shaded version of Apache hbase client .............. SUCCESS [  9.037 s]
[INFO] Apache Atlas Titan 0.5.4 Graph DB Impl ............. SUCCESS [ 39.932 s]
[INFO] Apache Atlas Graph Database Implementation Dependencies SUCCESS [  0.612 s]
[INFO] Shaded version of Apache hbase server .............. SUCCESS [ 22.585 s]
[INFO] Apache Atlas Repository ............................ SUCCESS [01:23 min]
[INFO] Apache Atlas Authorization ......................... SUCCESS [  7.151 s]
[INFO] Apache Atlas Business Catalog ...................... SUCCESS [ 10.568 s]
[INFO] Apache Atlas UI .................................... SUCCESS [01:13 min]
[INFO] Apache Atlas Web Application ....................... FAILURE [04:55 min]
[INFO] Apache Atlas Documentation ......................... SKIPPED
[INFO] Apache Atlas FileSystem Model ...................... SKIPPED
[INFO] Apache Atlas Plugin Classloader .................... SKIPPED
[INFO] Apache Atlas Hive Bridge Shim ...................... SKIPPED
[INFO] Apache Atlas Hive Bridge ........................... SKIPPED
[INFO] Apache Atlas Falcon Bridge Shim .................... SKIPPED
[INFO] Apache Atlas Falcon Bridge ......................... SKIPPED
[INFO] Apache Atlas Sqoop Bridge Shim ..................... SKIPPED
[INFO] Apache Atlas Sqoop Bridge .......................... SKIPPED
[INFO] Apache Atlas Storm Bridge Shim ..................... SKIPPED
[INFO] Apache Atlas Storm Bridge .......................... SKIPPED
[INFO] Apache Atlas Hbase Bridge Shim ..................... SKIPPED
[INFO] Apache Atlas Hbase Bridge .......................... SKIPPED
[INFO] Apache Atlas Distribution .......................... SKIPPED
[INFO] ------------------------------------------------------------------------
[INFO] BUILD FAILURE
[INFO] ------------------------------------------------------------------------
[INFO] Total time: 13:26 min
[INFO] Finished at: 2017-11-21T04:53:35Z
[INFO] Final Memory: 378M/2565M
[INFO] ------------------------------------------------------------------------
log4j:WARN No appenders could be found for logger (org.apache.zookeeper.ClientCnxn).
log4j:WARN Please initialize the log4j system properly.
log4j:WARN See http://logging.apache.org/log4j/1.2/faq.html#noconfig for more info.
[ERROR] Failed to execute goal org.apache.maven.plugins:maven-failsafe-plugin:2.18.1:verify
(verify) on project atlas-webapp: There are test failures.
[ERROR] 
[ERROR] Please refer to <https://builds.apache.org/job/Atlas-0.8-IntegrationTests/ws/webapp/target/failsafe-reports>
for the individual test results.
[ERROR] -> [Help 1]
[ERROR] 
[ERROR] To see the full stack trace of the errors, re-run Maven with the -e switch.
[ERROR] Re-run Maven using the -X switch to enable full debug logging.
[ERROR] 
[ERROR] For more information about the errors and possible solutions, please read the following
articles:
[ERROR] [Help 1] http://cwiki.apache.org/confluence/display/MAVEN/MojoFailureException
[ERROR] 
[ERROR] After correcting the problems, you can resume the build with the command
[ERROR]   mvn <goals> -rf :atlas-webapp
Build step 'Execute shell' marked build as failure
[CHECKSTYLE] Collecting checkstyle analysis files...
[CHECKSTYLE] Searching for all files in <https://builds.apache.org/job/Atlas-0.8-IntegrationTests/ws/>
that match the pattern **/target/checkstyle-result.xml
[CHECKSTYLE] Parsing 22 files in <https://builds.apache.org/job/Atlas-0.8-IntegrationTests/ws/>
[CHECKSTYLE] Successfully parsed file <https://builds.apache.org/job/Atlas-0.8-IntegrationTests/ws/authorization/target/checkstyle-result.xml>
with 467 unique warnings and 0 duplicates.
[CHECKSTYLE] Successfully parsed file <https://builds.apache.org/job/Atlas-0.8-IntegrationTests/ws/catalog/target/checkstyle-result.xml>
with 2604 unique warnings and 0 duplicates.
[CHECKSTYLE] Successfully parsed file <https://builds.apache.org/job/Atlas-0.8-IntegrationTests/ws/client/client-v1/target/checkstyle-result.xml>
with 3480 unique warnings and 0 duplicates.
[CHECKSTYLE] Successfully parsed file <https://builds.apache.org/job/Atlas-0.8-IntegrationTests/ws/client/client-v2/target/checkstyle-result.xml>
with 3805 unique warnings and 0 duplicates.
[CHECKSTYLE] Successfully parsed file <https://builds.apache.org/job/Atlas-0.8-IntegrationTests/ws/client/common/target/checkstyle-result.xml>
with 4295 unique warnings and 0 duplicates.
[CHECKSTYLE] Successfully parsed file <https://builds.apache.org/job/Atlas-0.8-IntegrationTests/ws/client/target/checkstyle-result.xml>
with 4295 unique warnings and 0 duplicates.
[CHECKSTYLE] Successfully parsed file <https://builds.apache.org/job/Atlas-0.8-IntegrationTests/ws/common/target/checkstyle-result.xml>
with 5254 unique warnings and 0 duplicates.
[CHECKSTYLE] Successfully parsed file <https://builds.apache.org/job/Atlas-0.8-IntegrationTests/ws/dashboardv2/target/checkstyle-result.xml>
with 5254 unique warnings and 0 duplicates.
[CHECKSTYLE] Successfully parsed file <https://builds.apache.org/job/Atlas-0.8-IntegrationTests/ws/graphdb/api/target/checkstyle-result.xml>
with 5527 unique warnings and 0 duplicates.
[CHECKSTYLE] Successfully parsed file <https://builds.apache.org/job/Atlas-0.8-IntegrationTests/ws/graphdb/common/target/checkstyle-result.xml>
with 5714 unique warnings and 0 duplicates.
[CHECKSTYLE] Successfully parsed file <https://builds.apache.org/job/Atlas-0.8-IntegrationTests/ws/graphdb/graphdb-impls/target/checkstyle-result.xml>
with 5714 unique warnings and 0 duplicates.
[CHECKSTYLE] Successfully parsed file <https://builds.apache.org/job/Atlas-0.8-IntegrationTests/ws/graphdb/target/checkstyle-result.xml>
with 5714 unique warnings and 0 duplicates.
[CHECKSTYLE] Successfully parsed file <https://builds.apache.org/job/Atlas-0.8-IntegrationTests/ws/graphdb/titan0/target/checkstyle-result.xml>
with 8169 unique warnings and 0 duplicates.
[CHECKSTYLE] Successfully parsed file <https://builds.apache.org/job/Atlas-0.8-IntegrationTests/ws/graphdb/titan1/target/checkstyle-result.xml>
with 9136 unique warnings and 0 duplicates.
[CHECKSTYLE] Successfully parsed file <https://builds.apache.org/job/Atlas-0.8-IntegrationTests/ws/intg/target/checkstyle-result.xml>
with 15872 unique warnings and 0 duplicates.
[CHECKSTYLE] Successfully parsed file <https://builds.apache.org/job/Atlas-0.8-IntegrationTests/ws/notification/target/checkstyle-result.xml>
with 17437 unique warnings and 0 duplicates.
[CHECKSTYLE] Successfully parsed file <https://builds.apache.org/job/Atlas-0.8-IntegrationTests/ws/repository/target/checkstyle-result.xml>
with 36394 unique warnings and 0 duplicates.
[CHECKSTYLE] Successfully parsed file <https://builds.apache.org/job/Atlas-0.8-IntegrationTests/ws/server-api/target/checkstyle-result.xml>
with 36787 unique warnings and 0 duplicates.
[CHECKSTYLE] Successfully parsed file <https://builds.apache.org/job/Atlas-0.8-IntegrationTests/ws/shaded/hbase-client-shaded/target/checkstyle-result.xml>
with 36787 unique warnings and 0 duplicates.
[CHECKSTYLE] Successfully parsed file <https://builds.apache.org/job/Atlas-0.8-IntegrationTests/ws/shaded/hbase-server-shaded/target/checkstyle-result.xml>
with 36787 unique warnings and 0 duplicates.
[CHECKSTYLE] Successfully parsed file <https://builds.apache.org/job/Atlas-0.8-IntegrationTests/ws/target/checkstyle-result.xml>
with 36787 unique warnings and 0 duplicates.
[CHECKSTYLE] Successfully parsed file <https://builds.apache.org/job/Atlas-0.8-IntegrationTests/ws/typesystem/target/checkstyle-result.xml>
with 41005 unique warnings and 0 duplicates.
<Git Blamer> Using GitBlamer to create author and commit information for all warnings.
<Git Blamer> GIT_COMMIT=5045172e9543c45c54b5f548752c906d42abdc89, workspace=<https://builds.apache.org/job/Atlas-0.8-IntegrationTests/ws/>
 > git rev-parse 5045172e9543c45c54b5f548752c906d42abdc89^{commit} # timeout=10
[FINDBUGS] Collecting findbugs analysis files...
[FINDBUGS] Searching for all files in <https://builds.apache.org/job/Atlas-0.8-IntegrationTests/ws/>
that match the pattern **/target/findbugs.xml
[FINDBUGS] Parsing 15 files in <https://builds.apache.org/job/Atlas-0.8-IntegrationTests/ws/>
[FINDBUGS] Successfully parsed file <https://builds.apache.org/job/Atlas-0.8-IntegrationTests/ws/authorization/target/findbugs.xml>
with 0 unique warnings and 0 duplicates.
[FINDBUGS] Successfully parsed file <https://builds.apache.org/job/Atlas-0.8-IntegrationTests/ws/catalog/target/findbugs.xml>
with 0 unique warnings and 0 duplicates.
[FINDBUGS] Successfully parsed file <https://builds.apache.org/job/Atlas-0.8-IntegrationTests/ws/client/client-v1/target/findbugs.xml>
with 0 unique warnings and 0 duplicates.
[FINDBUGS] Successfully parsed file <https://builds.apache.org/job/Atlas-0.8-IntegrationTests/ws/client/client-v2/target/findbugs.xml>
with 0 unique warnings and 0 duplicates.
[FINDBUGS] Successfully parsed file <https://builds.apache.org/job/Atlas-0.8-IntegrationTests/ws/client/common/target/findbugs.xml>
with 0 unique warnings and 0 duplicates.
[FINDBUGS] Successfully parsed file <https://builds.apache.org/job/Atlas-0.8-IntegrationTests/ws/common/target/findbugs.xml>
with 0 unique warnings and 0 duplicates.
[FINDBUGS] Successfully parsed file <https://builds.apache.org/job/Atlas-0.8-IntegrationTests/ws/graphdb/api/target/findbugs.xml>
with 0 unique warnings and 0 duplicates.
[FINDBUGS] Successfully parsed file <https://builds.apache.org/job/Atlas-0.8-IntegrationTests/ws/graphdb/common/target/findbugs.xml>
with 0 unique warnings and 0 duplicates.
[FINDBUGS] Successfully parsed file <https://builds.apache.org/job/Atlas-0.8-IntegrationTests/ws/graphdb/titan0/target/findbugs.xml>
with 0 unique warnings and 0 duplicates.
[FINDBUGS] Successfully parsed file <https://builds.apache.org/job/Atlas-0.8-IntegrationTests/ws/graphdb/titan1/target/findbugs.xml>
with 0 unique warnings and 0 duplicates.
[FINDBUGS] Successfully parsed file <https://builds.apache.org/job/Atlas-0.8-IntegrationTests/ws/intg/target/findbugs.xml>
with 0 unique warnings and 0 duplicates.
[FINDBUGS] Successfully parsed file <https://builds.apache.org/job/Atlas-0.8-IntegrationTests/ws/notification/target/findbugs.xml>
with 0 unique warnings and 0 duplicates.
[FINDBUGS] Successfully parsed file <https://builds.apache.org/job/Atlas-0.8-IntegrationTests/ws/repository/target/findbugs.xml>
with 0 unique warnings and 0 duplicates.
[FINDBUGS] Successfully parsed file <https://builds.apache.org/job/Atlas-0.8-IntegrationTests/ws/server-api/target/findbugs.xml>
with 0 unique warnings and 0 duplicates.
[FINDBUGS] Successfully parsed file <https://builds.apache.org/job/Atlas-0.8-IntegrationTests/ws/typesystem/target/findbugs.xml>
with 0 unique warnings and 0 duplicates.
<Git Blamer> Using GitBlamer to create author and commit information for all warnings.
<Git Blamer> GIT_COMMIT=5045172e9543c45c54b5f548752c906d42abdc89, workspace=<https://builds.apache.org/job/Atlas-0.8-IntegrationTests/ws/>
Archiving artifacts
[Fast Archiver] No prior successful build to compare, so performing full copy of artifacts
TestNG Reports Processing: START
Looking for TestNG results report in workspace using pattern: **/target/surefire-reports/testng-results.xml,**/target/failsafe-reports/testng-results.xml
Saving reports...
Processing '/x1/jenkins/jenkins-home/jobs/Atlas-0.8-IntegrationTests/builds/133/testng/testng-results.xml'
0.735294% of tests failed, which exceeded threshold of 0%. Marking build as UNSTABLE
TestNG Reports Processing: FINISH

Mime
View raw message