atlas-dev mailing list archives

Site index · List index
Message view « Date » · « Thread »
Top « Date » · « Thread »
From Apache Jenkins Server <jenk...@builds.apache.org>
Subject Build failed in Jenkins: Atlas-master-IntegrationTests #153
Date Sat, 14 Oct 2017 03:45:11 GMT
See <https://builds.apache.org/job/Atlas-master-IntegrationTests/153/display/redirect?page=changes>

Changes:

[madhan] ATLAS-2195: fix to close trasaction left open while queries index keys

------------------------------------------
[...truncated 464.03 KB...]
INFO: Registering Spring bean, notFoundExceptionMapper, of type org.apache.atlas.web.errors.NotFoundExceptionMapper
as a provider class
Oct 14, 2017 3:40:49 AM com.sun.jersey.server.impl.application.WebApplicationImpl _initiate
INFO: Initiating Jersey application, version 'Jersey: 1.19 02/11/2015 03:25 AM'
[INFO] Started o.e.j.m.p.JettyWebAppContext@62d79bd8{/,file://<https://builds.apache.org/job/Atlas-master-IntegrationTests/ws/webapp/target/atlas-webapp-1.0.0-SNAPSHOT/,AVAILABLE}{/home/jenkins/jenkins-slave/workspace/Atlas-master-IntegrationTests/webapp/target/atlas-webapp-1.0.0-SNAPSHOT.war}>
[INFO] Started ServerConnector@4f22ff7a{HTTP/1.1,[http/1.1]}{0.0.0.0:31000}
[INFO] Started @457259ms
[INFO] Started Jetty Server
[INFO] 
[INFO] --- maven-failsafe-plugin:2.18.1:integration-test (integration-test) @ atlas-webapp
---
[WARNING] useSystemClassloader setting has no effect when not forking
[INFO] Failsafe report directory: <https://builds.apache.org/job/Atlas-master-IntegrationTests/ws/webapp/target/failsafe-reports>
Running TestSuite
127.0.0.1 - - [14/Oct/2017:03:40:54 +0000] "GET /api/atlas/v2/types/typedef/name/database
HTTP/1.1" 404 85 "-" "Java/1.8.0_144"
127.0.0.1 - - [14/Oct/2017:03:40:54 +0000] "GET /api/atlas/v2/types/typedef/name/table HTTP/1.1"
404 82 "-" "Java/1.8.0_144"
127.0.0.1 - - [14/Oct/2017:03:40:54 +0000] "GET /api/atlas/v2/types/typedef/name/fetl HTTP/1.1"
404 81 "-" "Java/1.8.0_144"
127.0.0.1 - - [14/Oct/2017:03:40:54 +0000] "POST /api/atlas/v2/types/typedefs HTTP/1.1" 200
2653 "-" "Java/1.8.0_144"
127.0.0.1 - - [14/Oct/2017:03:40:56 +0000] "GET /api/atlas/v2/types/classificationdef/name/fetl
HTTP/1.1" 200 454 "-" "Java/1.8.0_144"
127.0.0.1 - - [14/Oct/2017:03:40:56 +0000] "GET /api/atlas/v2/types/entitydef/name/database
HTTP/1.1" 200 614 "-" "Java/1.8.0_144"
127.0.0.1 - - [14/Oct/2017:03:40:56 +0000] "GET /api/atlas/v2/types/entitydef/name/table HTTP/1.1"
200 1491 "-" "Java/1.8.0_144"
127.0.0.1 - - [14/Oct/2017:03:40:56 +0000] "POST /api/atlas/v2/types/typedefs HTTP/1.1" 200
535 "-" "Java/1.8.0_144"
127.0.0.1 - - [14/Oct/2017:03:40:56 +0000] "POST /api/atlas/v2/types/typedefs HTTP/1.1" 409
86 "-" "Java/1.8.0_144"
127.0.0.1 - - [14/Oct/2017:03:40:56 +0000] "GET /api/atlas/v2/types/enumdef/name/blah HTTP/1.1"
404 81 "-" "Java/1.8.0_144"
127.0.0.1 - - [14/Oct/2017:03:40:56 +0000] "GET /api/atlas/v2/types/enumdef/guid/blah HTTP/1.1"
404 82 "-" "Java/1.8.0_144"
127.0.0.1 - - [14/Oct/2017:03:40:56 +0000] "GET /api/atlas/v2/types/structdef/name/blah HTTP/1.1"
404 81 "-" "Java/1.8.0_144"
127.0.0.1 - - [14/Oct/2017:03:40:56 +0000] "GET /api/atlas/v2/types/structdef/guid/blah HTTP/1.1"
404 82 "-" "Java/1.8.0_144"
127.0.0.1 - - [14/Oct/2017:03:40:56 +0000] "GET /api/atlas/v2/types/classificationdef/name/blah
HTTP/1.1" 404 81 "-" "Java/1.8.0_144"
127.0.0.1 - - [14/Oct/2017:03:40:56 +0000] "GET /api/atlas/v2/types/classificationdef/guid/blah
HTTP/1.1" 404 82 "-" "Java/1.8.0_144"
127.0.0.1 - - [14/Oct/2017:03:40:56 +0000] "GET /api/atlas/v2/types/entitydef/name/blah HTTP/1.1"
404 81 "-" "Java/1.8.0_144"
127.0.0.1 - - [14/Oct/2017:03:40:56 +0000] "GET /api/atlas/v2/types/entitydef/guid/blah HTTP/1.1"
404 82 "-" "Java/1.8.0_144"
127.0.0.1 - - [14/Oct/2017:03:40:56 +0000] "POST /api/atlas/v2/types/typedefs HTTP/1.1" 200
1918 "-" "Java/1.8.0_144"
127.0.0.1 - - [14/Oct/2017:03:40:56 +0000] "GET /api/atlas/v2/types/typedefs?supertype=AyVlB1utlv2&type=CLASS
HTTP/1.1" 200 1026 "-" "Java/1.8.0_144"
127.0.0.1 - - [14/Oct/2017:03:40:56 +0000] "GET /api/atlas/v2/types/typedefs?supertype=AyVlB1utlv2&type=CLASS&notsupertype=BvmeOVw93Cr
HTTP/1.1" 200 553 "-" "Java/1.8.0_144"
127.0.0.1 - - [14/Oct/2017:03:40:56 +0000] "POST /api/atlas/v2/types/typedefs HTTP/1.1" 200
535 "-" "Java/1.8.0_144"
127.0.0.1 - - [14/Oct/2017:03:40:56 +0000] "PUT /api/atlas/v2/types/typedefs HTTP/1.1" 200
711 "-" "Java/1.8.0_144"
127.0.0.1 - - [14/Oct/2017:03:40:57 +0000] "GET /api/atlas/v2/types/typedefs?type=ENTITY HTTP/1.1"
200 5087 "-" "Java/1.8.0_144"
127.0.0.1 - - [14/Oct/2017:03:40:57 +0000] "GET /api/atlas/v2/types/typedef/name/tableType
HTTP/1.1" 404 86 "-" "Java/1.8.0_144"
127.0.0.1 - - [14/Oct/2017:03:40:57 +0000] "GET /api/atlas/v2/types/typedef/name/serdeType
HTTP/1.1" 404 86 "-" "Java/1.8.0_144"
127.0.0.1 - - [14/Oct/2017:03:40:57 +0000] "GET /api/atlas/v2/types/typedef/name/classification
HTTP/1.1" 404 91 "-" "Java/1.8.0_144"
127.0.0.1 - - [14/Oct/2017:03:40:57 +0000] "GET /api/atlas/v2/types/typedef/name/pii HTTP/1.1"
404 80 "-" "Java/1.8.0_144"
127.0.0.1 - - [14/Oct/2017:03:40:57 +0000] "GET /api/atlas/v2/types/typedef/name/phi HTTP/1.1"
404 80 "-" "Java/1.8.0_144"
127.0.0.1 - - [14/Oct/2017:03:40:57 +0000] "GET /api/atlas/v2/types/typedef/name/pci HTTP/1.1"
404 80 "-" "Java/1.8.0_144"
127.0.0.1 - - [14/Oct/2017:03:40:57 +0000] "GET /api/atlas/v2/types/typedef/name/sox HTTP/1.1"
404 80 "-" "Java/1.8.0_144"
127.0.0.1 - - [14/Oct/2017:03:40:57 +0000] "GET /api/atlas/v2/types/typedef/name/sec HTTP/1.1"
404 80 "-" "Java/1.8.0_144"
127.0.0.1 - - [14/Oct/2017:03:40:57 +0000] "GET /api/atlas/v2/types/typedef/name/finance HTTP/1.1"
404 84 "-" "Java/1.8.0_144"
127.0.0.1 - - [14/Oct/2017:03:40:57 +0000] "GET /api/atlas/v2/types/typedef/name/FacthIT8lGTjp8
HTTP/1.1" 404 91 "-" "Java/1.8.0_144"
127.0.0.1 - - [14/Oct/2017:03:40:57 +0000] "GET /api/atlas/v2/types/typedef/name/ETLIk3Gf4Mp7M
HTTP/1.1" 404 90 "-" "Java/1.8.0_144"
127.0.0.1 - - [14/Oct/2017:03:40:57 +0000] "GET /api/atlas/v2/types/typedef/name/Dimensionz93YIkkpAe
HTTP/1.1" 404 96 "-" "Java/1.8.0_144"
127.0.0.1 - - [14/Oct/2017:03:40:57 +0000] "GET /api/atlas/v2/types/typedef/name/MetricOKUxsMF3n7
HTTP/1.1" 404 93 "-" "Java/1.8.0_144"
127.0.0.1 - - [14/Oct/2017:03:40:57 +0000] "GET /api/atlas/v2/types/typedef/name/hive_db_v1
HTTP/1.1" 404 87 "-" "Java/1.8.0_144"
127.0.0.1 - - [14/Oct/2017:03:40:57 +0000] "GET /api/atlas/v2/types/typedef/name/hive_column_v1
HTTP/1.1" 404 91 "-" "Java/1.8.0_144"
127.0.0.1 - - [14/Oct/2017:03:40:57 +0000] "GET /api/atlas/v2/types/typedef/name/hive_table_v1
HTTP/1.1" 404 90 "-" "Java/1.8.0_144"
127.0.0.1 - - [14/Oct/2017:03:40:57 +0000] "GET /api/atlas/v2/types/typedef/name/hive_process_v1
HTTP/1.1" 404 92 "-" "Java/1.8.0_144"
127.0.0.1 - - [14/Oct/2017:03:40:57 +0000] "POST /api/atlas/types HTTP/1.1" 400 46 "-" "Java/1.8.0_144"
127.0.0.1 - - [14/Oct/2017:03:41:01 +0000] "GET /api/atlas/v2/types/classificationdef/name/fetl
HTTP/1.1" 200 454 "-" "Java/1.8.0_144"
127.0.0.1 - - [14/Oct/2017:03:41:01 +0000] "GET /api/atlas/v2/types/entitydef/name/database
HTTP/1.1" 200 614 "-" "Java/1.8.0_144"
127.0.0.1 - - [14/Oct/2017:03:41:01 +0000] "GET /api/atlas/v2/types/entitydef/name/table HTTP/1.1"
200 1491 "-" "Java/1.8.0_144"
127.0.0.1 - - [14/Oct/2017:03:41:01 +0000] "GET /api/atlas/v2/types/typedef/name/tableType
HTTP/1.1" 404 86 "-" "Java/1.8.0_144"
127.0.0.1 - - [14/Oct/2017:03:41:01 +0000] "GET /api/atlas/v2/types/typedef/name/serdeType
HTTP/1.1" 404 86 "-" "Java/1.8.0_144"
127.0.0.1 - - [14/Oct/2017:03:41:01 +0000] "GET /api/atlas/v2/types/typedef/name/classification
HTTP/1.1" 404 91 "-" "Java/1.8.0_144"
127.0.0.1 - - [14/Oct/2017:03:41:01 +0000] "GET /api/atlas/v2/types/typedef/name/pii HTTP/1.1"
404 80 "-" "Java/1.8.0_144"
127.0.0.1 - - [14/Oct/2017:03:41:01 +0000] "GET /api/atlas/v2/types/typedef/name/phi HTTP/1.1"
404 80 "-" "Java/1.8.0_144"
127.0.0.1 - - [14/Oct/2017:03:41:01 +0000] "GET /api/atlas/v2/types/typedef/name/pci HTTP/1.1"
404 80 "-" "Java/1.8.0_144"
127.0.0.1 - - [14/Oct/2017:03:41:01 +0000] "GET /api/atlas/v2/types/typedef/name/sox HTTP/1.1"
404 80 "-" "Java/1.8.0_144"
127.0.0.1 - - [14/Oct/2017:03:41:01 +0000] "GET /api/atlas/v2/types/typedef/name/sec HTTP/1.1"
404 80 "-" "Java/1.8.0_144"
127.0.0.1 - - [14/Oct/2017:03:41:01 +0000] "GET /api/atlas/v2/types/typedef/name/finance HTTP/1.1"
404 84 "-" "Java/1.8.0_144"
127.0.0.1 - - [14/Oct/2017:03:41:01 +0000] "GET /api/atlas/v2/types/typedef/name/FactRBI8lfgJdV
HTTP/1.1" 404 91 "-" "Java/1.8.0_144"
127.0.0.1 - - [14/Oct/2017:03:41:01 +0000] "GET /api/atlas/v2/types/typedef/name/ETLzY91mU47K7
HTTP/1.1" 404 90 "-" "Java/1.8.0_144"
127.0.0.1 - - [14/Oct/2017:03:41:01 +0000] "GET /api/atlas/v2/types/typedef/name/DimensionXrMhPOu14p
HTTP/1.1" 404 96 "-" "Java/1.8.0_144"
127.0.0.1 - - [14/Oct/2017:03:41:01 +0000] "GET /api/atlas/v2/types/typedef/name/MetricRvBOT4vPFf
HTTP/1.1" 404 93 "-" "Java/1.8.0_144"
127.0.0.1 - - [14/Oct/2017:03:41:01 +0000] "GET /api/atlas/v2/types/typedef/name/hive_db_v1
HTTP/1.1" 404 87 "-" "Java/1.8.0_144"
127.0.0.1 - - [14/Oct/2017:03:41:01 +0000] "GET /api/atlas/v2/types/typedef/name/hive_column_v1
HTTP/1.1" 404 91 "-" "Java/1.8.0_144"
127.0.0.1 - - [14/Oct/2017:03:41:01 +0000] "GET /api/atlas/v2/types/typedef/name/hive_table_v1
HTTP/1.1" 404 90 "-" "Java/1.8.0_144"
127.0.0.1 - - [14/Oct/2017:03:41:01 +0000] "GET /api/atlas/v2/types/typedef/name/hive_process_v1
HTTP/1.1" 404 92 "-" "Java/1.8.0_144"
127.0.0.1 - - [14/Oct/2017:03:41:01 +0000] "POST /api/atlas/types HTTP/1.1" 400 46 "-" "Java/1.8.0_144"
127.0.0.1 - - [14/Oct/2017:03:41:01 +0000] "GET /api/atlas/admin/session HTTP/1.1" 401 349
"-" "Java/1.8.0_144"
127.0.0.1 - - [14/Oct/2017:03:41:02 +0000] "GET /api/atlas/v1/taxonomies HTTP/1.1" 403 525
"-" "Java/1.8.0_144"
127.0.0.1 - - [14/Oct/2017:03:41:02 +0000] "GET /api/atlas/admin/session HTTP/1.1" 200 462
"-" "Java/1.8.0_144"
127.0.0.1 - - [14/Oct/2017:03:41:02 +0000] "GET /api/atlas/admin/status HTTP/1.1" 200 19 "-"
"Java/1.8.0_144"
Tests run: 148, Failures: 2, Errors: 0, Skipped: 129, Time elapsed: 10.094 sec <<<
FAILURE! - in TestSuite
setUp(org.apache.atlas.notification.NotificationHookConsumerIT)  Time elapsed: 1.129 sec 
<<< FAILURE!
org.apache.atlas.AtlasServiceException: Metadata service API org.apache.atlas.AtlasClient$API_V1@5ab6d198
failed with status 400 (Bad Request) Response Body ({"error":"Given typename Process was invalid"})
	at org.apache.atlas.AtlasBaseClient.callAPIWithResource(AtlasBaseClient.java:371)
	at org.apache.atlas.AtlasBaseClient.callAPIWithResource(AtlasBaseClient.java:311)
	at org.apache.atlas.AtlasBaseClient.callAPI(AtlasBaseClient.java:199)
	at org.apache.atlas.AtlasClient.callAPIWithBody(AtlasClient.java:942)
	at org.apache.atlas.AtlasClient.createType(AtlasClient.java:261)
	at org.apache.atlas.AtlasClient.createType(AtlasClient.java:279)
	at org.apache.atlas.web.integration.BaseResourceIT.createType(BaseResourceIT.java:204)
	at org.apache.atlas.web.integration.BaseResourceIT.createTypeDefinitionsV1(BaseResourceIT.java:357)
	at org.apache.atlas.notification.NotificationHookConsumerIT.setUp(NotificationHookConsumerIT.java:55)

setUp(org.apache.atlas.web.integration.DataSetLineageJerseyResourceIT)  Time elapsed: 0.341
sec  <<< FAILURE!
org.apache.atlas.AtlasServiceException: Metadata service API org.apache.atlas.AtlasClient$API_V1@5ab6d198
failed with status 400 (Bad Request) Response Body ({"error":"Given typename Process was invalid"})
	at org.apache.atlas.AtlasBaseClient.callAPIWithResource(AtlasBaseClient.java:371)
	at org.apache.atlas.AtlasBaseClient.callAPIWithResource(AtlasBaseClient.java:311)
	at org.apache.atlas.AtlasBaseClient.callAPI(AtlasBaseClient.java:199)
	at org.apache.atlas.AtlasClient.callAPIWithBody(AtlasClient.java:942)
	at org.apache.atlas.AtlasClient.createType(AtlasClient.java:261)
	at org.apache.atlas.AtlasClient.createType(AtlasClient.java:279)
	at org.apache.atlas.web.integration.BaseResourceIT.createType(BaseResourceIT.java:204)
	at org.apache.atlas.web.integration.BaseResourceIT.createTypeDefinitionsV1(BaseResourceIT.java:357)
	at org.apache.atlas.web.integration.DataSetLineageJerseyResourceIT.setUp(DataSetLineageJerseyResourceIT.java:56)


Results :

Failed tests: 
  NotificationHookConsumerIT.setUp:55->BaseResourceIT.createTypeDefinitionsV1:357->BaseResourceIT.createType:204
» AtlasService
  DataSetLineageJerseyResourceIT.setUp:56->BaseResourceIT.createTypeDefinitionsV1:357->BaseResourceIT.createType:204
» AtlasService

Tests run: 147, Failures: 2, Errors: 0, Skipped: 128

[INFO] 
[INFO] --- jetty-maven-plugin:9.4.0.v20161208:stop (stop-jetty) @ atlas-webapp ---
[INFO] Waiting 10 seconds for jetty to stop
[INFO] Stopped ServerConnector@4f22ff7a{HTTP/1.1,[http/1.1]}{0.0.0.0:31000}
[INFO] Stopped scavenging
[INFO] Closing Spring root WebApplicationContext
[INFO] Shutting down log4j
[INFO] Stopped o.e.j.m.p.JettyWebAppContext@62d79bd8{/,file://<https://builds.apache.org/job/Atlas-master-IntegrationTests/ws/webapp/target/atlas-webapp-1.0.0-SNAPSHOT/,UNAVAILABLE}{/home/jenkins/jenkins-slave/workspace/Atlas-master-IntegrationTests/webapp/target/atlas-webapp-1.0.0-SNAPSHOT.war}>
[INFO] Server reports itself as stopped
[INFO] 
[INFO] --- maven-source-plugin:2.4:jar-no-fork (attach-sources) @ atlas-webapp ---
[INFO] Building jar: <https://builds.apache.org/job/Atlas-master-IntegrationTests/ws/webapp/target/atlas-webapp-1.0.0-SNAPSHOT-sources.jar>
log4j:WARN No appenders could be found for logger (org.apache.zookeeper.ClientCnxn).
log4j:WARN Please initialize the log4j system properly.
log4j:WARN See http://logging.apache.org/log4j/1.2/faq.html#noconfig for more info.
[INFO] 
[INFO] --- maven-source-plugin:2.4:test-jar-no-fork (attach-sources) @ atlas-webapp ---
[INFO] Building jar: <https://builds.apache.org/job/Atlas-master-IntegrationTests/ws/webapp/target/atlas-webapp-1.0.0-SNAPSHOT-test-sources.jar>
[INFO] 
[INFO] --- maven-failsafe-plugin:2.18.1:verify (verify) @ atlas-webapp ---
[INFO] Failsafe report directory: <https://builds.apache.org/job/Atlas-master-IntegrationTests/ws/webapp/target/failsafe-reports>
[INFO] ------------------------------------------------------------------------
[INFO] Reactor Summary:
[INFO] 
[INFO] Apache Atlas Server Build Tools .................... SUCCESS [  0.794 s]
[INFO] apache-atlas ....................................... SUCCESS [  3.999 s]
[INFO] Apache Atlas Integration ........................... SUCCESS [ 18.629 s]
[INFO] Apache Atlas Common ................................ SUCCESS [  8.290 s]
[INFO] Apache Atlas Typesystem ............................ SUCCESS [ 41.373 s]
[INFO] Apache Atlas Client ................................ SUCCESS [  0.517 s]
[INFO] atlas-client-common ................................ SUCCESS [  6.532 s]
[INFO] atlas-client-v1 .................................... SUCCESS [  6.628 s]
[INFO] Apache Atlas Server API ............................ SUCCESS [  5.630 s]
[INFO] Apache Atlas Notification .......................... SUCCESS [  9.515 s]
[INFO] atlas-client-v2 .................................... SUCCESS [  5.119 s]
[INFO] Apache Atlas Graph Database Projects ............... SUCCESS [  0.530 s]
[INFO] Apache Atlas Graph Database API .................... SUCCESS [  4.649 s]
[INFO] Graph Database Common Code ......................... SUCCESS [  4.814 s]
[INFO] Apache Atlas Titan 1.0.0 GraphDB Impl .............. SUCCESS [ 34.431 s]
[INFO] Shaded version of Apache hbase client .............. SUCCESS [  7.338 s]
[INFO] Apache Atlas Titan 0.5.4 Graph DB Impl ............. SUCCESS [ 37.184 s]
[INFO] Apache Atlas Graph Database Implementation Dependencies SUCCESS [  0.588 s]
[INFO] Shaded version of Apache hbase server .............. SUCCESS [ 21.165 s]
[INFO] Apache Atlas Repository ............................ SUCCESS [01:13 min]
[INFO] Apache Atlas Authorization ......................... SUCCESS [  6.179 s]
[INFO] Apache Atlas Business Catalog ...................... SUCCESS [  9.938 s]
[INFO] Apache Atlas UI .................................... SUCCESS [01:26 min]
[INFO] Apache Atlas Web Application ....................... FAILURE [01:14 min]
[INFO] Apache Atlas Documentation ......................... SKIPPED
[INFO] Apache Atlas FileSystem Model ...................... SKIPPED
[INFO] Apache Atlas Plugin Classloader .................... SKIPPED
[INFO] Apache Atlas Hive Bridge Shim ...................... SKIPPED
[INFO] Apache Atlas Hive Bridge ........................... SKIPPED
[INFO] Apache Atlas Falcon Bridge Shim .................... SKIPPED
[INFO] Apache Atlas Falcon Bridge ......................... SKIPPED
[INFO] Apache Atlas Sqoop Bridge Shim ..................... SKIPPED
[INFO] Apache Atlas Sqoop Bridge .......................... SKIPPED
[INFO] Apache Atlas Storm Bridge Shim ..................... SKIPPED
[INFO] Apache Atlas Storm Bridge .......................... SKIPPED
[INFO] Apache Atlas Distribution .......................... SKIPPED
[INFO] ------------------------------------------------------------------------
[INFO] BUILD FAILURE
[INFO] ------------------------------------------------------------------------
[INFO] Total time: 07:49 min
[INFO] Finished at: 2017-10-14T03:41:05Z
[INFO] Final Memory: 344M/3126M
[INFO] ------------------------------------------------------------------------
[ERROR] Failed to execute goal org.apache.maven.plugins:maven-failsafe-plugin:2.18.1:verify
(verify) on project atlas-webapp: There are test failures.
[ERROR] 
[ERROR] Please refer to <https://builds.apache.org/job/Atlas-master-IntegrationTests/ws/webapp/target/failsafe-reports>
for the individual test results.
[ERROR] -> [Help 1]
[ERROR] 
[ERROR] To see the full stack trace of the errors, re-run Maven with the -e switch.
[ERROR] Re-run Maven using the -X switch to enable full debug logging.
[ERROR] 
[ERROR] For more information about the errors and possible solutions, please read the following
articles:
[ERROR] [Help 1] http://cwiki.apache.org/confluence/display/MAVEN/MojoFailureException
[ERROR] 
[ERROR] After correcting the problems, you can resume the build with the command
[ERROR]   mvn <goals> -rf :atlas-webapp
Build step 'Execute shell' marked build as failure
[CHECKSTYLE] Collecting checkstyle analysis files...
[CHECKSTYLE] Searching for all files in <https://builds.apache.org/job/Atlas-master-IntegrationTests/ws/>
that match the pattern **/target/checkstyle-result.xml
[CHECKSTYLE] Parsing 22 files in <https://builds.apache.org/job/Atlas-master-IntegrationTests/ws/>
[CHECKSTYLE] Successfully parsed file <https://builds.apache.org/job/Atlas-master-IntegrationTests/ws/authorization/target/checkstyle-result.xml>
with 467 unique warnings and 0 duplicates.
[CHECKSTYLE] Successfully parsed file <https://builds.apache.org/job/Atlas-master-IntegrationTests/ws/catalog/target/checkstyle-result.xml>
with 2604 unique warnings and 0 duplicates.
[CHECKSTYLE] Successfully parsed file <https://builds.apache.org/job/Atlas-master-IntegrationTests/ws/client/client-v1/target/checkstyle-result.xml>
with 3477 unique warnings and 0 duplicates.
[CHECKSTYLE] Successfully parsed file <https://builds.apache.org/job/Atlas-master-IntegrationTests/ws/client/client-v2/target/checkstyle-result.xml>
with 3802 unique warnings and 0 duplicates.
[CHECKSTYLE] Successfully parsed file <https://builds.apache.org/job/Atlas-master-IntegrationTests/ws/client/common/target/checkstyle-result.xml>
with 4262 unique warnings and 0 duplicates.
[CHECKSTYLE] Successfully parsed file <https://builds.apache.org/job/Atlas-master-IntegrationTests/ws/client/target/checkstyle-result.xml>
with 4262 unique warnings and 0 duplicates.
[CHECKSTYLE] Successfully parsed file <https://builds.apache.org/job/Atlas-master-IntegrationTests/ws/common/target/checkstyle-result.xml>
with 5227 unique warnings and 0 duplicates.
[CHECKSTYLE] Successfully parsed file <https://builds.apache.org/job/Atlas-master-IntegrationTests/ws/dashboardv2/target/checkstyle-result.xml>
with 5227 unique warnings and 0 duplicates.
[CHECKSTYLE] Successfully parsed file <https://builds.apache.org/job/Atlas-master-IntegrationTests/ws/graphdb/api/target/checkstyle-result.xml>
with 5500 unique warnings and 0 duplicates.
[CHECKSTYLE] Successfully parsed file <https://builds.apache.org/job/Atlas-master-IntegrationTests/ws/graphdb/common/target/checkstyle-result.xml>
with 5687 unique warnings and 0 duplicates.
[CHECKSTYLE] Successfully parsed file <https://builds.apache.org/job/Atlas-master-IntegrationTests/ws/graphdb/graphdb-impls/target/checkstyle-result.xml>
with 5687 unique warnings and 0 duplicates.
[CHECKSTYLE] Successfully parsed file <https://builds.apache.org/job/Atlas-master-IntegrationTests/ws/graphdb/target/checkstyle-result.xml>
with 5687 unique warnings and 0 duplicates.
[CHECKSTYLE] Successfully parsed file <https://builds.apache.org/job/Atlas-master-IntegrationTests/ws/graphdb/titan0/target/checkstyle-result.xml>
with 8089 unique warnings and 0 duplicates.
[CHECKSTYLE] Successfully parsed file <https://builds.apache.org/job/Atlas-master-IntegrationTests/ws/graphdb/titan1/target/checkstyle-result.xml>
with 9056 unique warnings and 0 duplicates.
[CHECKSTYLE] Successfully parsed file <https://builds.apache.org/job/Atlas-master-IntegrationTests/ws/intg/target/checkstyle-result.xml>
with 17262 unique warnings and 0 duplicates.
[CHECKSTYLE] Successfully parsed file <https://builds.apache.org/job/Atlas-master-IntegrationTests/ws/notification/target/checkstyle-result.xml>
with 18827 unique warnings and 0 duplicates.
[CHECKSTYLE] Successfully parsed file <https://builds.apache.org/job/Atlas-master-IntegrationTests/ws/repository/target/checkstyle-result.xml>
with 39089 unique warnings and 0 duplicates.
[CHECKSTYLE] Successfully parsed file <https://builds.apache.org/job/Atlas-master-IntegrationTests/ws/server-api/target/checkstyle-result.xml>
with 39468 unique warnings and 0 duplicates.
[CHECKSTYLE] Successfully parsed file <https://builds.apache.org/job/Atlas-master-IntegrationTests/ws/shaded/hbase-client-shaded/target/checkstyle-result.xml>
with 39468 unique warnings and 0 duplicates.
[CHECKSTYLE] Successfully parsed file <https://builds.apache.org/job/Atlas-master-IntegrationTests/ws/shaded/hbase-server-shaded/target/checkstyle-result.xml>
with 39468 unique warnings and 0 duplicates.
[CHECKSTYLE] Successfully parsed file <https://builds.apache.org/job/Atlas-master-IntegrationTests/ws/target/checkstyle-result.xml>
with 39468 unique warnings and 0 duplicates.
[CHECKSTYLE] Successfully parsed file <https://builds.apache.org/job/Atlas-master-IntegrationTests/ws/typesystem/target/checkstyle-result.xml>
with 43686 unique warnings and 0 duplicates.
<Git Blamer> Using GitBlamer to create author and commit information for all warnings.
<Git Blamer> GIT_COMMIT=8663eb1dedfc9f3136ea44460055f7e332e3212c, workspace=<https://builds.apache.org/job/Atlas-master-IntegrationTests/ws/>
 > git rev-parse 8663eb1dedfc9f3136ea44460055f7e332e3212c^{commit} # timeout=10
<Git Blamer> Skipping file <https://builds.apache.org/job/Atlas-master-IntegrationTests/ws/typesystem/src/main/java/org/apache/atlas/typesystem/IStruct.java,>
no result found.
[FINDBUGS] Collecting findbugs analysis files...
[FINDBUGS] Searching for all files in <https://builds.apache.org/job/Atlas-master-IntegrationTests/ws/>
that match the pattern **/target/findbugs.xml
[FINDBUGS] Parsing 15 files in <https://builds.apache.org/job/Atlas-master-IntegrationTests/ws/>
[FINDBUGS] Successfully parsed file <https://builds.apache.org/job/Atlas-master-IntegrationTests/ws/authorization/target/findbugs.xml>
with 0 unique warnings and 0 duplicates.
[FINDBUGS] Successfully parsed file <https://builds.apache.org/job/Atlas-master-IntegrationTests/ws/catalog/target/findbugs.xml>
with 0 unique warnings and 0 duplicates.
[FINDBUGS] Successfully parsed file <https://builds.apache.org/job/Atlas-master-IntegrationTests/ws/client/client-v1/target/findbugs.xml>
with 0 unique warnings and 0 duplicates.
[FINDBUGS] Successfully parsed file <https://builds.apache.org/job/Atlas-master-IntegrationTests/ws/client/client-v2/target/findbugs.xml>
with 0 unique warnings and 0 duplicates.
[FINDBUGS] Successfully parsed file <https://builds.apache.org/job/Atlas-master-IntegrationTests/ws/client/common/target/findbugs.xml>
with 0 unique warnings and 0 duplicates.
[FINDBUGS] Successfully parsed file <https://builds.apache.org/job/Atlas-master-IntegrationTests/ws/common/target/findbugs.xml>
with 0 unique warnings and 0 duplicates.
[FINDBUGS] Successfully parsed file <https://builds.apache.org/job/Atlas-master-IntegrationTests/ws/graphdb/api/target/findbugs.xml>
with 0 unique warnings and 0 duplicates.
[FINDBUGS] Successfully parsed file <https://builds.apache.org/job/Atlas-master-IntegrationTests/ws/graphdb/common/target/findbugs.xml>
with 0 unique warnings and 0 duplicates.
[FINDBUGS] Successfully parsed file <https://builds.apache.org/job/Atlas-master-IntegrationTests/ws/graphdb/titan0/target/findbugs.xml>
with 0 unique warnings and 0 duplicates.
[FINDBUGS] Successfully parsed file <https://builds.apache.org/job/Atlas-master-IntegrationTests/ws/graphdb/titan1/target/findbugs.xml>
with 0 unique warnings and 0 duplicates.
[FINDBUGS] Successfully parsed file <https://builds.apache.org/job/Atlas-master-IntegrationTests/ws/intg/target/findbugs.xml>
with 0 unique warnings and 0 duplicates.
[FINDBUGS] Successfully parsed file <https://builds.apache.org/job/Atlas-master-IntegrationTests/ws/notification/target/findbugs.xml>
with 0 unique warnings and 0 duplicates.
[FINDBUGS] Successfully parsed file <https://builds.apache.org/job/Atlas-master-IntegrationTests/ws/repository/target/findbugs.xml>
with 0 unique warnings and 0 duplicates.
[FINDBUGS] Successfully parsed file <https://builds.apache.org/job/Atlas-master-IntegrationTests/ws/server-api/target/findbugs.xml>
with 0 unique warnings and 0 duplicates.
[FINDBUGS] Successfully parsed file <https://builds.apache.org/job/Atlas-master-IntegrationTests/ws/typesystem/target/findbugs.xml>
with 0 unique warnings and 0 duplicates.
<Git Blamer> Using GitBlamer to create author and commit information for all warnings.
<Git Blamer> GIT_COMMIT=8663eb1dedfc9f3136ea44460055f7e332e3212c, workspace=<https://builds.apache.org/job/Atlas-master-IntegrationTests/ws/>
Archiving artifacts
[Fast Archiver] No prior successful build to compare, so performing full copy of artifacts
TestNG Reports Processing: START
Looking for TestNG results report in workspace using pattern: **/target/surefire-reports/testng-results.xml,**/target/failsafe-reports/testng-results.xml
Saving reports...
Processing '/x1/jenkins/jenkins-home/jobs/Atlas-master-IntegrationTests/builds/153/testng/testng-results.xml'
TestNG Reports Processing: FINISH

Mime
View raw message