atlas-dev mailing list archives

Site index · List index
Message view « Date » · « Thread »
Top « Date » · « Thread »
From Apache Jenkins Server <jenk...@builds.apache.org>
Subject Build failed in Jenkins: Atlas-0.8-IntegrationTests #112
Date Mon, 16 Oct 2017 17:00:20 GMT
See <https://builds.apache.org/job/Atlas-0.8-IntegrationTests/112/display/redirect?page=changes>

Changes:

[madhan] ATLAS-2212: UI fix to allow negative number input for tag attributes

------------------------------------------
[...truncated 474.55 KB...]
127.0.0.1 - - [16/Oct/2017:16:56:09 +0000] "GET /api/atlas/entities?type=hive_table_v1&property=qualifiedName&value=sales_fact_monthly_mvKmblmwTCV9
HTTP/1.1" 200 - "-" "Java/1.8.0_144"
127.0.0.1 - - [16/Oct/2017:16:56:09 +0000] "GET /api/atlas/lineage/da775ecd-abc1-445d-aaa1-e717591a4eb8/inputs/graph
HTTP/1.1" 200 - "-" "Java/1.8.0_144"
127.0.0.1 - - [16/Oct/2017:16:56:11 +0000] "GET /api/atlas/lineage/hive/table/sales_factTZG2HxEH7k/outputs/graph
HTTP/1.1" 200 - "-" "Java/1.8.0_144"
127.0.0.1 - - [16/Oct/2017:16:56:13 +0000] "GET /api/atlas/entities?type=hive_table_v1&property=qualifiedName&value=sales_factTZG2HxEH7k
HTTP/1.1" 200 - "-" "Java/1.8.0_144"
127.0.0.1 - - [16/Oct/2017:16:56:13 +0000] "GET /api/atlas/lineage/c0a9e4d7-3174-4534-ae64-7cfd19074841/outputs/graph
HTTP/1.1" 200 - "-" "Java/1.8.0_144"
127.0.0.1 - - [16/Oct/2017:16:56:14 +0000] "GET /api/atlas/lineage/hive/table/sales_factTZG2HxEH7k/schema
HTTP/1.1" 200 - "-" "Java/1.8.0_144"
127.0.0.1 - - [16/Oct/2017:16:56:15 +0000] "GET /api/atlas/lineage/hive/table/SalessFSuZeXvdJ/schema
HTTP/1.1" 404 - "-" "Java/1.8.0_144"
127.0.0.1 - - [16/Oct/2017:16:56:15 +0000] "GET /api/atlas/entities?type=hive_table_v1&property=qualifiedName&value=sales_factTZG2HxEH7k
HTTP/1.1" 200 - "-" "Java/1.8.0_144"
127.0.0.1 - - [16/Oct/2017:16:56:15 +0000] "GET /api/atlas/lineage/c0a9e4d7-3174-4534-ae64-7cfd19074841/schema
HTTP/1.1" 200 - "-" "Java/1.8.0_144"
127.0.0.1 - - [16/Oct/2017:16:56:15 +0000] "GET /api/atlas/lineage/hive/table/blah/schema
HTTP/1.1" 404 - "-" "Java/1.8.0_144"
127.0.0.1 - - [16/Oct/2017:16:56:16 +0000] "POST /api/atlas/v2/types/typedefs HTTP/1.1" 409
- "-" "Java/1.8.0_144"
127.0.0.1 - - [16/Oct/2017:16:56:16 +0000] "GET /api/atlas/v2/types/typedef/name/tableType
HTTP/1.1" 200 - "-" "Java/1.8.0_144"
127.0.0.1 - - [16/Oct/2017:16:56:16 +0000] "GET /api/atlas/v2/types/typedef/name/serdeType
HTTP/1.1" 200 - "-" "Java/1.8.0_144"
127.0.0.1 - - [16/Oct/2017:16:56:16 +0000] "GET /api/atlas/v2/types/typedef/name/hive_db_v2
HTTP/1.1" 404 - "-" "Java/1.8.0_144"
127.0.0.1 - - [16/Oct/2017:16:56:16 +0000] "GET /api/atlas/v2/types/typedef/name/hive_column_v2
HTTP/1.1" 404 - "-" "Java/1.8.0_144"
127.0.0.1 - - [16/Oct/2017:16:56:16 +0000] "GET /api/atlas/v2/types/typedef/name/hive_table_v2
HTTP/1.1" 404 - "-" "Java/1.8.0_144"
127.0.0.1 - - [16/Oct/2017:16:56:16 +0000] "GET /api/atlas/v2/types/typedef/name/hive_process_v2
HTTP/1.1" 404 - "-" "Java/1.8.0_144"
127.0.0.1 - - [16/Oct/2017:16:56:16 +0000] "GET /api/atlas/v2/types/typedef/name/classification
HTTP/1.1" 200 - "-" "Java/1.8.0_144"
127.0.0.1 - - [16/Oct/2017:16:56:16 +0000] "GET /api/atlas/v2/types/typedef/name/pii HTTP/1.1"
200 - "-" "Java/1.8.0_144"
127.0.0.1 - - [16/Oct/2017:16:56:16 +0000] "GET /api/atlas/v2/types/typedef/name/phi HTTP/1.1"
200 - "-" "Java/1.8.0_144"
127.0.0.1 - - [16/Oct/2017:16:56:16 +0000] "GET /api/atlas/v2/types/typedef/name/pci HTTP/1.1"
200 - "-" "Java/1.8.0_144"
127.0.0.1 - - [16/Oct/2017:16:56:16 +0000] "GET /api/atlas/v2/types/typedef/name/sox HTTP/1.1"
200 - "-" "Java/1.8.0_144"
127.0.0.1 - - [16/Oct/2017:16:56:16 +0000] "GET /api/atlas/v2/types/typedef/name/sec HTTP/1.1"
200 - "-" "Java/1.8.0_144"
127.0.0.1 - - [16/Oct/2017:16:56:16 +0000] "GET /api/atlas/v2/types/typedef/name/finance HTTP/1.1"
200 - "-" "Java/1.8.0_144"
127.0.0.1 - - [16/Oct/2017:16:56:16 +0000] "POST /api/atlas/v2/types/typedefs HTTP/1.1" 200
- "-" "Java/1.8.0_144"
127.0.0.1 - - [16/Oct/2017:16:56:17 +0000] "POST /api/atlas/v2/entity HTTP/1.1" 200 - "-"
"Java/1.8.0_144"
127.0.0.1 - - [16/Oct/2017:16:56:17 +0000] "POST /api/atlas/v2/entity HTTP/1.1" 200 - "-"
"Java/1.8.0_144"
127.0.0.1 - - [16/Oct/2017:16:56:17 +0000] "GET /api/atlas/v2/entity/guid/692dc358-2610-45bd-9538-39fc16c2cde7
HTTP/1.1" 200 - "-" "Java/1.8.0_144"
127.0.0.1 - - [16/Oct/2017:16:56:17 +0000] "POST /api/atlas/v2/entity HTTP/1.1" 200 - "-"
"Java/1.8.0_144"
127.0.0.1 - - [16/Oct/2017:16:56:17 +0000] "POST /api/atlas/v2/entity/guid/random/classifications
HTTP/1.1" 404 - "-" "Java/1.8.0_144"
127.0.0.1 - - [16/Oct/2017:16:56:17 +0000] "POST /api/atlas/v2/entity/bulk HTTP/1.1" 200 -
"-" "Java/1.8.0_144"
127.0.0.1 - - [16/Oct/2017:16:56:18 +0000] "POST /api/atlas/v2/entity HTTP/1.1" 200 - "-"
"Java/1.8.0_144"
127.0.0.1 - - [16/Oct/2017:16:56:18 +0000] "POST /api/atlas/v2/entity HTTP/1.1" 200 - "-"
"Java/1.8.0_144"
127.0.0.1 - - [16/Oct/2017:16:56:18 +0000] "DELETE /api/atlas/v2/entity/bulk?guid=19248ba4-8c46-4029-95c2-6cafef80c706&guid=9f116500-d0e5-4720-9678-37813ca02c00
HTTP/1.1" 200 - "-" "Java/1.8.0_144"
127.0.0.1 - - [16/Oct/2017:16:56:18 +0000] "POST /api/atlas/v2/entity HTTP/1.1" 200 - "-"
"Java/1.8.0_144"
127.0.0.1 - - [16/Oct/2017:16:56:18 +0000] "DELETE /api/atlas/v2/entity/uniqueAttribute/type/hive_db_v2?attr:name=dbqblrGboGVu%E6%A9%B0%EC%B4%AA%E6%A3%BA%E5%A4%92%E5%BB%AC%E3%9B%87%E8%AC%BE%E1%B2%81%EA%82%87%E2%8B%8B
HTTP/1.1" 200 - "-" "Java/1.8.0_144"
127.0.0.1 - - [16/Oct/2017:16:56:18 +0000] "DELETE /api/atlas/v2/entity/guid/random/classification/blah_trait
HTTP/1.1" 400 - "-" "Java/1.8.0_144"
127.0.0.1 - - [16/Oct/2017:16:56:18 +0000] "GET /api/atlas/discovery/search/dsl?query=hive_db_v2+where+name%3D'dbqblrGboGVu'&limit=10&offset=0
HTTP/1.1" 200 - "-" "Java/1.8.0_144"
127.0.0.1 - - [16/Oct/2017:16:56:19 +0000] "GET /api/atlas/discovery/search/dsl?query=hive_db_v2+where+name%3D'dbqblrGboGVu'&limit=10&offset=0
HTTP/1.1" 200 - "-" "Java/1.8.0_144"
127.0.0.1 - - [16/Oct/2017:16:56:19 +0000] "POST /api/atlas/v2/entity HTTP/1.1" 200 - "-"
"Java/1.8.0_144"
127.0.0.1 - - [16/Oct/2017:16:56:19 +0000] "GET /api/atlas/discovery/search/dsl?query=hive_db_v2+where+name%3D'dbqblrGboGVu'&limit=10&offset=0
HTTP/1.1" 200 - "-" "Java/1.8.0_144"
127.0.0.1 - - [16/Oct/2017:16:56:20 +0000] "POST /api/atlas/v2/types/typedefs HTTP/1.1" 200
- "-" "Java/1.8.0_144"
127.0.0.1 - - [16/Oct/2017:16:56:20 +0000] "POST /api/atlas/v2/entity HTTP/1.1" 200 - "-"
"Java/1.8.0_144"
127.0.0.1 - - [16/Oct/2017:16:56:20 +0000] "PUT /api/atlas/v2/types/typedefs HTTP/1.1" 200
- "-" "Java/1.8.0_144"
127.0.0.1 - - [16/Oct/2017:16:56:20 +0000] "GET /api/atlas/v2/entity/guid/c45c6680-e128-4d24-9fde-c4e181aa389c
HTTP/1.1" 200 - "-" "Java/1.8.0_144"
127.0.0.1 - - [16/Oct/2017:16:56:20 +0000] "POST /api/atlas/v2/entity HTTP/1.1" 404 - "-"
"Java/1.8.0_144"
127.0.0.1 - - [16/Oct/2017:16:56:20 +0000] "POST /api/atlas/v2/entity HTTP/1.1" 200 - "-"
"Java/1.8.0_144"
127.0.0.1 - - [16/Oct/2017:16:56:20 +0000] "POST /api/atlas/v2/entity HTTP/1.1" 200 - "-"
"Java/1.8.0_144"
127.0.0.1 - - [16/Oct/2017:16:56:21 +0000] "GET /api/atlas/v2/entity/uniqueAttribute/type/hive_db_v2?attr:name=dbqblrGboGVu
HTTP/1.1" 200 - "-" "Java/1.8.0_144"
127.0.0.1 - - [16/Oct/2017:16:56:21 +0000] "GET /api/atlas/v2/entity/guid/blah HTTP/1.1" 404
- "-" "Java/1.8.0_144"
127.0.0.1 - - [16/Oct/2017:16:56:21 +0000] "POST /api/atlas/v2/entity HTTP/1.1" 200 - "-"
"Java/1.8.0_144"
127.0.0.1 - - [16/Oct/2017:16:56:21 +0000] "GET /api/atlas/entities/7da173da-e71d-4306-af7a-7126fccc19da/audit?count=10
HTTP/1.1" 200 - "-" "Java/1.8.0_144"
127.0.0.1 - - [16/Oct/2017:16:56:21 +0000] "POST /api/atlas/v2/entity HTTP/1.1" 200 - "-"
"Java/1.8.0_144"
127.0.0.1 - - [16/Oct/2017:16:56:21 +0000] "POST /api/atlas/v2/entity HTTP/1.1" 200 - "-"
"Java/1.8.0_144"
127.0.0.1 - - [16/Oct/2017:16:56:21 +0000] "GET /api/atlas/v2/types/typedef/name/GpxxyGWkS4
HTTP/1.1" 404 - "-" "Java/1.8.0_144"
127.0.0.1 - - [16/Oct/2017:16:56:21 +0000] "POST /api/atlas/v2/types/typedefs HTTP/1.1" 200
- "-" "Java/1.8.0_144"
127.0.0.1 - - [16/Oct/2017:16:56:21 +0000] "POST /api/atlas/v2/entity HTTP/1.1" 200 - "-"
"Java/1.8.0_144"
127.0.0.1 - - [16/Oct/2017:16:56:21 +0000] "GET /api/atlas/v2/entity/guid/d9270ce3-8bb8-47f1-8aa3-5a176371f444
HTTP/1.1" 200 - "-" "Java/1.8.0_144"
127.0.0.1 - - [16/Oct/2017:16:56:21 +0000] "GET /api/atlas/v2/types/typedef/name/tableType
HTTP/1.1" 200 - "-" "Java/1.8.0_144"
127.0.0.1 - - [16/Oct/2017:16:56:21 +0000] "GET /api/atlas/v2/types/typedef/name/serdeType
HTTP/1.1" 200 - "-" "Java/1.8.0_144"
127.0.0.1 - - [16/Oct/2017:16:56:21 +0000] "GET /api/atlas/v2/types/typedef/name/classification
HTTP/1.1" 200 - "-" "Java/1.8.0_144"
127.0.0.1 - - [16/Oct/2017:16:56:21 +0000] "GET /api/atlas/v2/types/typedef/name/pii HTTP/1.1"
200 - "-" "Java/1.8.0_144"
127.0.0.1 - - [16/Oct/2017:16:56:21 +0000] "GET /api/atlas/v2/types/typedef/name/phi HTTP/1.1"
200 - "-" "Java/1.8.0_144"
127.0.0.1 - - [16/Oct/2017:16:56:21 +0000] "GET /api/atlas/v2/types/typedef/name/pci HTTP/1.1"
200 - "-" "Java/1.8.0_144"
127.0.0.1 - - [16/Oct/2017:16:56:21 +0000] "GET /api/atlas/v2/types/typedef/name/sox HTTP/1.1"
200 - "-" "Java/1.8.0_144"
127.0.0.1 - - [16/Oct/2017:16:56:21 +0000] "GET /api/atlas/v2/types/typedef/name/sec HTTP/1.1"
200 - "-" "Java/1.8.0_144"
127.0.0.1 - - [16/Oct/2017:16:56:21 +0000] "GET /api/atlas/v2/types/typedef/name/finance HTTP/1.1"
200 - "-" "Java/1.8.0_144"
127.0.0.1 - - [16/Oct/2017:16:56:21 +0000] "GET /api/atlas/v2/types/typedef/name/FactXRWA4nXR0u
HTTP/1.1" 404 - "-" "Java/1.8.0_144"
127.0.0.1 - - [16/Oct/2017:16:56:21 +0000] "GET /api/atlas/v2/types/typedef/name/ETLWpU3U6fNRG
HTTP/1.1" 404 - "-" "Java/1.8.0_144"
127.0.0.1 - - [16/Oct/2017:16:56:21 +0000] "GET /api/atlas/v2/types/typedef/name/DimensionYT03FbJrlr
HTTP/1.1" 404 - "-" "Java/1.8.0_144"
127.0.0.1 - - [16/Oct/2017:16:56:21 +0000] "GET /api/atlas/v2/types/typedef/name/MetricgV6hNctlUT
HTTP/1.1" 404 - "-" "Java/1.8.0_144"
127.0.0.1 - - [16/Oct/2017:16:56:21 +0000] "GET /api/atlas/v2/types/typedef/name/hive_db_v1
HTTP/1.1" 200 - "-" "Java/1.8.0_144"
127.0.0.1 - - [16/Oct/2017:16:56:21 +0000] "GET /api/atlas/v2/types/typedef/name/hive_column_v1
HTTP/1.1" 200 - "-" "Java/1.8.0_144"
127.0.0.1 - - [16/Oct/2017:16:56:21 +0000] "GET /api/atlas/v2/types/typedef/name/hive_table_v1
HTTP/1.1" 200 - "-" "Java/1.8.0_144"
127.0.0.1 - - [16/Oct/2017:16:56:21 +0000] "GET /api/atlas/v2/types/typedef/name/hive_process_v1
HTTP/1.1" 200 - "-" "Java/1.8.0_144"
127.0.0.1 - - [16/Oct/2017:16:56:21 +0000] "POST /api/atlas/types HTTP/1.1" 201 - "-" "Java/1.8.0_144"
127.0.0.1 - - [16/Oct/2017:16:56:21 +0000] "GET /api/atlas/v2/types/typedef/name/Classification
HTTP/1.1" 404 - "-" "Java/1.8.0_144"
127.0.0.1 - - [16/Oct/2017:16:56:21 +0000] "GET /api/atlas/v2/types/typedef/name/dsl_test_type
HTTP/1.1" 404 - "-" "Java/1.8.0_144"
127.0.0.1 - - [16/Oct/2017:16:56:21 +0000] "POST /api/atlas/types HTTP/1.1" 201 - "-" "Java/1.8.0_144"
127.0.0.1 - - [16/Oct/2017:16:56:22 +0000] "POST /api/atlas/entities HTTP/1.1" 201 - "-" "Java/1.8.0_144"
127.0.0.1 - - [16/Oct/2017:16:56:22 +0000] "GET /api/atlas/discovery/search/dsl?query=from+hive_db_v1+name%3D%22dbKx1VSPWq43%22
HTTP/1.1" 200 - "-" "Java/1.8.0_144"
127.0.0.1 - - [16/Oct/2017:16:56:22 +0000] "GET /api/atlas/discovery/search/dsl?query=from+blah
HTTP/1.1" 400 - "-" "Java/1.8.0_144"
127.0.0.1 - - [16/Oct/2017:16:56:22 +0000] "GET /api/atlas/discovery/search/dsl?query=from+hive_db_v1+name%3D%22dbKx1VSPWq43%22
HTTP/1.1" 200 - "-" "Java/1.8.0_144"
127.0.0.1 - - [16/Oct/2017:16:56:23 +0000] "GET /api/atlas/discovery/search/dsl?query=from+hive_db_v1+name%3D%22dbKx1VSPWq43%22&limit=10&offset=0
HTTP/1.1" 200 - "-" "Java/1.8.0_144"
127.0.0.1 - - [16/Oct/2017:16:56:24 +0000] "GET /api/atlas/discovery/search/dsl?query=from+hive_db_v1+name%3D%22dbKx1VSPWq43%22&limit=-1&offset=-1
HTTP/1.1" 200 - "-" "Java/1.8.0_144"
127.0.0.1 - - [16/Oct/2017:16:56:25 +0000] "GET /api/atlas/discovery/search/dsl?query=from+hive_db_v1+name%3D%22dbKx1VSPWq43%22&limit=1&offset=0
HTTP/1.1" 200 - "-" "Java/1.8.0_144"
127.0.0.1 - - [16/Oct/2017:16:56:25 +0000] "GET /api/atlas/discovery/search/dsl?query=from+hive_db_v1+name%3D%22dbKx1VSPWq43%22&limit=10&offset=1
HTTP/1.1" 200 - "-" "Java/1.8.0_144"
127.0.0.1 - - [16/Oct/2017:16:56:26 +0000] "GET /api/atlas/discovery/search/dsl?query=from+hive_db_v1+name%3D%22dbKx1VSPWq43%22&limit=0&offset=10
HTTP/1.1" 400 - "-" "Java/1.8.0_144"
127.0.0.1 - - [16/Oct/2017:16:56:26 +0000] "GET /api/atlas/discovery/search/dsl?query=from+hive_db_v1+name%3D%22dbKx1VSPWq43%22&limit=2147483647&offset=10
HTTP/1.1" 400 - "-" "Java/1.8.0_144"
127.0.0.1 - - [16/Oct/2017:16:56:26 +0000] "GET /api/atlas/discovery/search/dsl?query=from+hive_db_v1+name%3D%22dbKx1VSPWq43%22&limit=10&offset=-2
HTTP/1.1" 400 - "-" "Java/1.8.0_144"
127.0.0.1 - - [16/Oct/2017:16:56:26 +0000] "GET /api/atlas/discovery/search?query=* HTTP/1.1"
200 - "-" "Java/1.8.0_144"
127.0.0.1 - - [16/Oct/2017:16:56:26 +0000] "GET /api/atlas/discovery/search?query=from+hive_db_v1+name%3D%22dbKx1VSPWq43%22
HTTP/1.1" 200 - "-" "Java/1.8.0_144"
127.0.0.1 - - [16/Oct/2017:16:56:27 +0000] "GET /api/atlas/discovery/search/gremlin?query=g.V.has('type',+'hive_table_v1').toList()
HTTP/1.1" 200 - "-" "Java/1.8.0_144"
Tests run: 142, Failures: 1, Errors: 0, Skipped: 89, Time elapsed: 44.914 sec <<<
FAILURE! - in TestSuite
runQuickStart(org.apache.atlas.examples.QuickStartV2IT)  Time elapsed: 0.545 sec  <<<
FAILURE!
org.apache.atlas.AtlasServiceException: Metadata service API org.apache.atlas.AtlasClientV2$API_V2@6d91bb8a
failed with status 409 (Conflict) Response Body ({"errorCode":"ATLAS-409-00-001","errorMessage":"Given
type Dimension already exists"})
	at org.apache.atlas.AtlasBaseClient.callAPIWithResource(AtlasBaseClient.java:371)
	at org.apache.atlas.AtlasBaseClient.callAPIWithResource(AtlasBaseClient.java:311)
	at org.apache.atlas.AtlasBaseClient.callAPI(AtlasBaseClient.java:199)
	at org.apache.atlas.AtlasClientV2.createAtlasTypeDefs(AtlasClientV2.java:219)
	at org.apache.atlas.examples.QuickStartV2.createTypes(QuickStartV2.java:191)
	at org.apache.atlas.examples.QuickStartV2.runQuickstart(QuickStartV2.java:147)
	at org.apache.atlas.examples.QuickStartV2IT.runQuickStart(QuickStartV2IT.java:49)


Results :

Failed tests: 
  QuickStartV2IT.runQuickStart:49 » AtlasService Metadata service API org.apache...

Tests run: 141, Failures: 1, Errors: 0, Skipped: 88

[INFO] 
[INFO] --- jetty-maven-plugin:9.2.12.v20150709:stop (stop-jetty) @ atlas-webapp ---
[INFO] Waiting 10 seconds for jetty to stop
[INFO] Stopped ServerConnector@a3a04c1{HTTP/1.1}{0.0.0.0:31000}
[INFO] Closing Spring root WebApplicationContext
[INFO] Shutting down log4j
[INFO] Not cleaning cached beans: no such field javax.el.BeanELResolver.properties
[INFO] Stopped o.e.j.m.p.JettyWebAppContext@4025ea2a{/,<https://builds.apache.org/job/Atlas-0.8-IntegrationTests/ws/webapp/target/atlas-webapp-0.8.2-SNAPSHOT/,UNAVAILABLE}{/home/jenkins/jenkins-slave/workspace/Atlas-0.8-IntegrationTests/webapp/target/atlas-webapp-0.8.2-SNAPSHOT.war}>
[INFO] Server reports itself as stopped
[INFO] 
[INFO] --- maven-source-plugin:2.4:jar-no-fork (attach-sources) @ atlas-webapp ---
[INFO] Building jar: <https://builds.apache.org/job/Atlas-0.8-IntegrationTests/ws/webapp/target/atlas-webapp-0.8.2-SNAPSHOT-sources.jar>
log4j:WARN No appenders could be found for logger (org.apache.zookeeper.ClientCnxn).
log4j:WARN Please initialize the log4j system properly.
log4j:WARN See http://logging.apache.org/log4j/1.2/faq.html#noconfig for more info.
[INFO] 
[INFO] --- maven-source-plugin:2.4:test-jar-no-fork (attach-sources) @ atlas-webapp ---
[INFO] Building jar: <https://builds.apache.org/job/Atlas-0.8-IntegrationTests/ws/webapp/target/atlas-webapp-0.8.2-SNAPSHOT-test-sources.jar>
[INFO] 
[INFO] --- maven-failsafe-plugin:2.18.1:verify (verify) @ atlas-webapp ---
[INFO] Failsafe report directory: <https://builds.apache.org/job/Atlas-0.8-IntegrationTests/ws/webapp/target/failsafe-reports>
[INFO] ------------------------------------------------------------------------
[INFO] Reactor Summary:
[INFO] 
[INFO] Apache Atlas Server Build Tools .................... SUCCESS [  0.813 s]
[INFO] apache-atlas ....................................... SUCCESS [  3.995 s]
[INFO] Apache Atlas Integration ........................... SUCCESS [ 18.737 s]
[INFO] Apache Atlas Common ................................ SUCCESS [  8.080 s]
[INFO] Apache Atlas Typesystem ............................ SUCCESS [ 43.107 s]
[INFO] Apache Atlas Client ................................ SUCCESS [  0.627 s]
[INFO] atlas-client-common ................................ SUCCESS [  7.194 s]
[INFO] atlas-client-v1 .................................... SUCCESS [  7.878 s]
[INFO] Apache Atlas Server API ............................ SUCCESS [  6.089 s]
[INFO] Apache Atlas Notification .......................... SUCCESS [  9.852 s]
[INFO] atlas-client-v2 .................................... SUCCESS [  5.590 s]
[INFO] Apache Atlas Graph Database Projects ............... SUCCESS [  0.479 s]
[INFO] Apache Atlas Graph Database API .................... SUCCESS [  5.089 s]
[INFO] Graph Database Common Code ......................... SUCCESS [  5.138 s]
[INFO] Apache Atlas Titan 1.0.0 GraphDB Impl .............. SUCCESS [ 36.350 s]
[INFO] Shaded version of Apache hbase client .............. SUCCESS [  7.284 s]
[INFO] Apache Atlas Titan 0.5.4 Graph DB Impl ............. SUCCESS [ 37.697 s]
[INFO] Apache Atlas Graph Database Implementation Dependencies SUCCESS [  0.674 s]
[INFO] Shaded version of Apache hbase server .............. SUCCESS [ 23.631 s]
[INFO] Apache Atlas Repository ............................ SUCCESS [01:15 min]
[INFO] Apache Atlas Authorization ......................... SUCCESS [  6.428 s]
[INFO] Apache Atlas Business Catalog ...................... SUCCESS [ 10.744 s]
[INFO] Apache Atlas UI .................................... SUCCESS [01:32 min]
[INFO] Apache Atlas Web Application ....................... FAILURE [02:07 min]
[INFO] Apache Atlas Documentation ......................... SKIPPED
[INFO] Apache Atlas FileSystem Model ...................... SKIPPED
[INFO] Apache Atlas Plugin Classloader .................... SKIPPED
[INFO] Apache Atlas Hive Bridge Shim ...................... SKIPPED
[INFO] Apache Atlas Hive Bridge ........................... SKIPPED
[INFO] Apache Atlas Falcon Bridge Shim .................... SKIPPED
[INFO] Apache Atlas Falcon Bridge ......................... SKIPPED
[INFO] Apache Atlas Sqoop Bridge Shim ..................... SKIPPED
[INFO] Apache Atlas Sqoop Bridge .......................... SKIPPED
[INFO] Apache Atlas Storm Bridge Shim ..................... SKIPPED
[INFO] Apache Atlas Storm Bridge .......................... SKIPPED
[INFO] Apache Atlas Distribution .......................... SKIPPED
[INFO] ------------------------------------------------------------------------
[INFO] BUILD FAILURE
[INFO] ------------------------------------------------------------------------
[INFO] Total time: 09:02 min
[INFO] Finished at: 2017-10-16T16:56:32Z
[INFO] Final Memory: 349M/2413M
[INFO] ------------------------------------------------------------------------
[ERROR] Failed to execute goal org.apache.maven.plugins:maven-failsafe-plugin:2.18.1:verify
(verify) on project atlas-webapp: There are test failures.
[ERROR] 
[ERROR] Please refer to <https://builds.apache.org/job/Atlas-0.8-IntegrationTests/ws/webapp/target/failsafe-reports>
for the individual test results.
[ERROR] -> [Help 1]
[ERROR] 
[ERROR] To see the full stack trace of the errors, re-run Maven with the -e switch.
[ERROR] Re-run Maven using the -X switch to enable full debug logging.
[ERROR] 
[ERROR] For more information about the errors and possible solutions, please read the following
articles:
[ERROR] [Help 1] http://cwiki.apache.org/confluence/display/MAVEN/MojoFailureException
[ERROR] 
[ERROR] After correcting the problems, you can resume the build with the command
[ERROR]   mvn <goals> -rf :atlas-webapp
Build step 'Execute shell' marked build as failure
[CHECKSTYLE] Collecting checkstyle analysis files...
[CHECKSTYLE] Searching for all files in <https://builds.apache.org/job/Atlas-0.8-IntegrationTests/ws/>
that match the pattern **/target/checkstyle-result.xml
[CHECKSTYLE] Parsing 22 files in <https://builds.apache.org/job/Atlas-0.8-IntegrationTests/ws/>
[CHECKSTYLE] Successfully parsed file <https://builds.apache.org/job/Atlas-0.8-IntegrationTests/ws/authorization/target/checkstyle-result.xml>
with 467 unique warnings and 0 duplicates.
[CHECKSTYLE] Successfully parsed file <https://builds.apache.org/job/Atlas-0.8-IntegrationTests/ws/catalog/target/checkstyle-result.xml>
with 2604 unique warnings and 0 duplicates.
[CHECKSTYLE] Successfully parsed file <https://builds.apache.org/job/Atlas-0.8-IntegrationTests/ws/client/client-v1/target/checkstyle-result.xml>
with 3478 unique warnings and 0 duplicates.
[CHECKSTYLE] Successfully parsed file <https://builds.apache.org/job/Atlas-0.8-IntegrationTests/ws/client/client-v2/target/checkstyle-result.xml>
with 3803 unique warnings and 0 duplicates.
[CHECKSTYLE] Successfully parsed file <https://builds.apache.org/job/Atlas-0.8-IntegrationTests/ws/client/common/target/checkstyle-result.xml>
with 4263 unique warnings and 0 duplicates.
[CHECKSTYLE] Successfully parsed file <https://builds.apache.org/job/Atlas-0.8-IntegrationTests/ws/client/target/checkstyle-result.xml>
with 4263 unique warnings and 0 duplicates.
[CHECKSTYLE] Successfully parsed file <https://builds.apache.org/job/Atlas-0.8-IntegrationTests/ws/common/target/checkstyle-result.xml>
with 5222 unique warnings and 0 duplicates.
[CHECKSTYLE] Successfully parsed file <https://builds.apache.org/job/Atlas-0.8-IntegrationTests/ws/dashboardv2/target/checkstyle-result.xml>
with 5222 unique warnings and 0 duplicates.
[CHECKSTYLE] Successfully parsed file <https://builds.apache.org/job/Atlas-0.8-IntegrationTests/ws/graphdb/api/target/checkstyle-result.xml>
with 5495 unique warnings and 0 duplicates.
[CHECKSTYLE] Successfully parsed file <https://builds.apache.org/job/Atlas-0.8-IntegrationTests/ws/graphdb/common/target/checkstyle-result.xml>
with 5682 unique warnings and 0 duplicates.
[CHECKSTYLE] Successfully parsed file <https://builds.apache.org/job/Atlas-0.8-IntegrationTests/ws/graphdb/graphdb-impls/target/checkstyle-result.xml>
with 5682 unique warnings and 0 duplicates.
[CHECKSTYLE] Successfully parsed file <https://builds.apache.org/job/Atlas-0.8-IntegrationTests/ws/graphdb/target/checkstyle-result.xml>
with 5682 unique warnings and 0 duplicates.
[CHECKSTYLE] Successfully parsed file <https://builds.apache.org/job/Atlas-0.8-IntegrationTests/ws/graphdb/titan0/target/checkstyle-result.xml>
with 8084 unique warnings and 0 duplicates.
[CHECKSTYLE] Successfully parsed file <https://builds.apache.org/job/Atlas-0.8-IntegrationTests/ws/graphdb/titan1/target/checkstyle-result.xml>
with 9051 unique warnings and 0 duplicates.
[CHECKSTYLE] Successfully parsed file <https://builds.apache.org/job/Atlas-0.8-IntegrationTests/ws/intg/target/checkstyle-result.xml>
with 15765 unique warnings and 0 duplicates.
[CHECKSTYLE] Successfully parsed file <https://builds.apache.org/job/Atlas-0.8-IntegrationTests/ws/notification/target/checkstyle-result.xml>
with 17330 unique warnings and 0 duplicates.
[CHECKSTYLE] Successfully parsed file <https://builds.apache.org/job/Atlas-0.8-IntegrationTests/ws/repository/target/checkstyle-result.xml>
with 36217 unique warnings and 0 duplicates.
[CHECKSTYLE] Successfully parsed file <https://builds.apache.org/job/Atlas-0.8-IntegrationTests/ws/server-api/target/checkstyle-result.xml>
with 36596 unique warnings and 0 duplicates.
[CHECKSTYLE] Successfully parsed file <https://builds.apache.org/job/Atlas-0.8-IntegrationTests/ws/shaded/hbase-client-shaded/target/checkstyle-result.xml>
with 36596 unique warnings and 0 duplicates.
[CHECKSTYLE] Successfully parsed file <https://builds.apache.org/job/Atlas-0.8-IntegrationTests/ws/shaded/hbase-server-shaded/target/checkstyle-result.xml>
with 36596 unique warnings and 0 duplicates.
[CHECKSTYLE] Successfully parsed file <https://builds.apache.org/job/Atlas-0.8-IntegrationTests/ws/target/checkstyle-result.xml>
with 36596 unique warnings and 0 duplicates.
[CHECKSTYLE] Successfully parsed file <https://builds.apache.org/job/Atlas-0.8-IntegrationTests/ws/typesystem/target/checkstyle-result.xml>
with 40814 unique warnings and 0 duplicates.
<Git Blamer> Using GitBlamer to create author and commit information for all warnings.
<Git Blamer> GIT_COMMIT=35579161dea12de62fa71075c3a33a69bbba4a6e, workspace=<https://builds.apache.org/job/Atlas-0.8-IntegrationTests/ws/>
 > git rev-parse 35579161dea12de62fa71075c3a33a69bbba4a6e^{commit} # timeout=10
<Git Blamer> Skipping file <https://builds.apache.org/job/Atlas-0.8-IntegrationTests/ws/typesystem/src/main/java/org/apache/atlas/typesystem/IStruct.java,>
no result found.
[FINDBUGS] Collecting findbugs analysis files...
[FINDBUGS] Searching for all files in <https://builds.apache.org/job/Atlas-0.8-IntegrationTests/ws/>
that match the pattern **/target/findbugs.xml
[FINDBUGS] Parsing 15 files in <https://builds.apache.org/job/Atlas-0.8-IntegrationTests/ws/>
[FINDBUGS] Successfully parsed file <https://builds.apache.org/job/Atlas-0.8-IntegrationTests/ws/authorization/target/findbugs.xml>
with 0 unique warnings and 0 duplicates.
[FINDBUGS] Successfully parsed file <https://builds.apache.org/job/Atlas-0.8-IntegrationTests/ws/catalog/target/findbugs.xml>
with 0 unique warnings and 0 duplicates.
[FINDBUGS] Successfully parsed file <https://builds.apache.org/job/Atlas-0.8-IntegrationTests/ws/client/client-v1/target/findbugs.xml>
with 0 unique warnings and 0 duplicates.
[FINDBUGS] Successfully parsed file <https://builds.apache.org/job/Atlas-0.8-IntegrationTests/ws/client/client-v2/target/findbugs.xml>
with 0 unique warnings and 0 duplicates.
[FINDBUGS] Successfully parsed file <https://builds.apache.org/job/Atlas-0.8-IntegrationTests/ws/client/common/target/findbugs.xml>
with 0 unique warnings and 0 duplicates.
[FINDBUGS] Successfully parsed file <https://builds.apache.org/job/Atlas-0.8-IntegrationTests/ws/common/target/findbugs.xml>
with 0 unique warnings and 0 duplicates.
[FINDBUGS] Successfully parsed file <https://builds.apache.org/job/Atlas-0.8-IntegrationTests/ws/graphdb/api/target/findbugs.xml>
with 0 unique warnings and 0 duplicates.
[FINDBUGS] Successfully parsed file <https://builds.apache.org/job/Atlas-0.8-IntegrationTests/ws/graphdb/common/target/findbugs.xml>
with 0 unique warnings and 0 duplicates.
[FINDBUGS] Successfully parsed file <https://builds.apache.org/job/Atlas-0.8-IntegrationTests/ws/graphdb/titan0/target/findbugs.xml>
with 0 unique warnings and 0 duplicates.
[FINDBUGS] Successfully parsed file <https://builds.apache.org/job/Atlas-0.8-IntegrationTests/ws/graphdb/titan1/target/findbugs.xml>
with 0 unique warnings and 0 duplicates.
[FINDBUGS] Successfully parsed file <https://builds.apache.org/job/Atlas-0.8-IntegrationTests/ws/intg/target/findbugs.xml>
with 0 unique warnings and 0 duplicates.
[FINDBUGS] Successfully parsed file <https://builds.apache.org/job/Atlas-0.8-IntegrationTests/ws/notification/target/findbugs.xml>
with 0 unique warnings and 0 duplicates.
[FINDBUGS] Successfully parsed file <https://builds.apache.org/job/Atlas-0.8-IntegrationTests/ws/repository/target/findbugs.xml>
with 0 unique warnings and 0 duplicates.
[FINDBUGS] Successfully parsed file <https://builds.apache.org/job/Atlas-0.8-IntegrationTests/ws/server-api/target/findbugs.xml>
with 0 unique warnings and 0 duplicates.
[FINDBUGS] Successfully parsed file <https://builds.apache.org/job/Atlas-0.8-IntegrationTests/ws/typesystem/target/findbugs.xml>
with 0 unique warnings and 0 duplicates.
<Git Blamer> Using GitBlamer to create author and commit information for all warnings.
<Git Blamer> GIT_COMMIT=35579161dea12de62fa71075c3a33a69bbba4a6e, workspace=<https://builds.apache.org/job/Atlas-0.8-IntegrationTests/ws/>
Archiving artifacts
[Fast Archiver] No prior successful build to compare, so performing full copy of artifacts
TestNG Reports Processing: START
Looking for TestNG results report in workspace using pattern: **/target/surefire-reports/testng-results.xml,**/target/failsafe-reports/testng-results.xml
Saving reports...
Processing '/x1/jenkins/jenkins-home/jobs/Atlas-0.8-IntegrationTests/builds/112/testng/testng-results.xml'
TestNG Reports Processing: FINISH

Mime
View raw message