atlas-dev mailing list archives

Site index · List index
Message view « Date » · « Thread »
Top « Date » · « Thread »
From Apache Jenkins Server <jenk...@builds.apache.org>
Subject Build failed in Jenkins: Atlas-0.8-IntegrationTests #122
Date Fri, 27 Oct 2017 06:21:25 GMT
See <https://builds.apache.org/job/Atlas-0.8-IntegrationTests/122/display/redirect>

------------------------------------------
[...truncated 548.24 KB...]
127.0.0.1 - - [27/Oct/2017:06:15:43 +0000] "POST /api/atlas/entities HTTP/1.1" 201 - "-" "Java/1.8.0_144"
127.0.0.1 - - [27/Oct/2017:06:15:43 +0000] "GET /api/atlas/entities/a0bca5f0-aac0-4798-bece-ae04dde52728/traits
HTTP/1.1" 200 - "-" "Java/1.8.0_144"
127.0.0.1 - - [27/Oct/2017:06:15:43 +0000] "POST /api/atlas/entities HTTP/1.1" 201 - "-" "Java/1.8.0_144"
127.0.0.1 - - [27/Oct/2017:06:15:43 +0000] "POST /api/atlas/entities HTTP/1.1" 201 - "-" "Java/1.8.0_144"
127.0.0.1 - - [27/Oct/2017:06:15:43 +0000] "POST /api/atlas/entities/987e7b8b-eb5c-4c33-b8fa-e2b24cac3001
HTTP/1.1" 200 - "-" "Java/1.8.0_144"
127.0.0.1 - - [27/Oct/2017:06:15:43 +0000] "GET /api/atlas/entities/987e7b8b-eb5c-4c33-b8fa-e2b24cac3001
HTTP/1.1" 200 - "-" "Java/1.8.0_144"
127.0.0.1 - - [27/Oct/2017:06:15:43 +0000] "POST /api/atlas/entities HTTP/1.1" 201 - "-" "Java/1.8.0_144"
127.0.0.1 - - [27/Oct/2017:06:15:43 +0000] "POST /api/atlas/entities HTTP/1.1" 201 - "-" "Java/1.8.0_144"
127.0.0.1 - - [27/Oct/2017:06:15:43 +0000] "POST /api/atlas/entities/qualifiedName?type=hive_table&property=qualifiedName&value=tableRw519yE8yZ
HTTP/1.1" 200 - "-" "Java/1.8.0_144"
127.0.0.1 - - [27/Oct/2017:06:15:43 +0000] "GET /api/atlas/entities/639ad81f-e1ad-4f0c-93c2-c02b90a5ff61
HTTP/1.1" 200 - "-" "Java/1.8.0_144"
127.0.0.1 - - [27/Oct/2017:06:15:43 +0000] "POST /api/atlas/entities HTTP/1.1" 201 - "-" "Java/1.8.0_144"
127.0.0.1 - - [27/Oct/2017:06:15:43 +0000] "GET /api/atlas/entities/136e510f-26a3-4240-99e8-5f2909fc251a/audit?count=10
HTTP/1.1" 200 - "-" "Java/1.8.0_144"
127.0.0.1 - - [27/Oct/2017:06:15:43 +0000] "POST /api/atlas/entities HTTP/1.1" 201 - "-" "Java/1.8.0_144"
127.0.0.1 - - [27/Oct/2017:06:15:43 +0000] "POST /api/atlas/entities HTTP/1.1" 201 - "-" "Java/1.8.0_144"
127.0.0.1 - - [27/Oct/2017:06:15:43 +0000] "POST /api/atlas/entities HTTP/1.1" 201 - "-" "Java/1.8.0_144"
127.0.0.1 - - [27/Oct/2017:06:15:43 +0000] "POST /api/atlas/entities HTTP/1.1" 400 - "-" "Java/1.8.0_144"
127.0.0.1 - - [27/Oct/2017:06:15:43 +0000] "POST /api/atlas/entities HTTP/1.1" 201 - "-" "Java/1.8.0_144"
127.0.0.1 - - [27/Oct/2017:06:15:43 +0000] "GET /api/atlas/v2/types/typedef/name/w1cRlnIoLr
HTTP/1.1" 404 - "-" "Java/1.8.0_144"
127.0.0.1 - - [27/Oct/2017:06:15:43 +0000] "POST /api/atlas/types HTTP/1.1" 201 - "-" "Java/1.8.0_144"
127.0.0.1 - - [27/Oct/2017:06:15:43 +0000] "POST /api/atlas/entities HTTP/1.1" 201 - "-" "Java/1.8.0_144"
127.0.0.1 - - [27/Oct/2017:06:15:43 +0000] "GET /api/atlas/entities/d2a2984f-677e-4640-84e0-22723561db15
HTTP/1.1" 200 - "-" "Java/1.8.0_144"
127.0.0.1 - - [27/Oct/2017:06:15:47 +0000] "GET /api/atlas/admin/version HTTP/1.1" 200 - "-"
"Java/1.8.0_144"
127.0.0.1 - - [27/Oct/2017:06:15:47 +0000] "GET /api/atlas/admin/status HTTP/1.1" 200 - "-"
"Java/1.8.0_144"
127.0.0.1 - - [27/Oct/2017:06:15:48 +0000] "GET /api/atlas/v1/taxonomies HTTP/1.1" 403 493
"-" "Java/1.8.0_144"
127.0.0.1 - - [27/Oct/2017:06:15:48 +0000] "GET /api/atlas/admin/session HTTP/1.1" 200 - "-"
"Java/1.8.0_144"
127.0.0.1 - - [27/Oct/2017:06:15:48 +0000] "GET /api/atlas/admin/session HTTP/1.1" 401 317
"-" "Java/1.8.0_144"
127.0.0.1 - - [27/Oct/2017:06:15:48 +0000] "GET /api/atlas/v2/types/typedef/name/database
HTTP/1.1" 200 - "-" "Java/1.8.0_144"
127.0.0.1 - - [27/Oct/2017:06:15:48 +0000] "GET /api/atlas/v2/types/typedef/name/table HTTP/1.1"
404 - "-" "Java/1.8.0_144"
127.0.0.1 - - [27/Oct/2017:06:15:48 +0000] "GET /api/atlas/v2/types/typedef/name/fetl HTTP/1.1"
404 - "-" "Java/1.8.0_144"
127.0.0.1 - - [27/Oct/2017:06:15:48 +0000] "POST /api/atlas/v2/types/typedefs HTTP/1.1" 200
- "-" "Java/1.8.0_144"
127.0.0.1 - - [27/Oct/2017:06:15:48 +0000] "GET /api/atlas/v2/types/classificationdef/name/fetl
HTTP/1.1" 200 - "-" "Java/1.8.0_144"
127.0.0.1 - - [27/Oct/2017:06:15:48 +0000] "GET /api/atlas/v2/types/entitydef/name/database
HTTP/1.1" 200 - "-" "Java/1.8.0_144"
127.0.0.1 - - [27/Oct/2017:06:15:48 +0000] "GET /api/atlas/v2/types/entitydef/name/table HTTP/1.1"
200 - "-" "Java/1.8.0_144"
127.0.0.1 - - [27/Oct/2017:06:15:48 +0000] "POST /api/atlas/v2/types/typedefs HTTP/1.1" 200
- "-" "Java/1.8.0_144"
127.0.0.1 - - [27/Oct/2017:06:15:48 +0000] "POST /api/atlas/v2/types/typedefs HTTP/1.1" 409
- "-" "Java/1.8.0_144"
127.0.0.1 - - [27/Oct/2017:06:15:48 +0000] "GET /api/atlas/v2/types/enumdef/name/blah HTTP/1.1"
404 - "-" "Java/1.8.0_144"
127.0.0.1 - - [27/Oct/2017:06:15:48 +0000] "GET /api/atlas/v2/types/enumdef/guid/blah HTTP/1.1"
404 - "-" "Java/1.8.0_144"
127.0.0.1 - - [27/Oct/2017:06:15:48 +0000] "GET /api/atlas/v2/types/structdef/name/blah HTTP/1.1"
404 - "-" "Java/1.8.0_144"
127.0.0.1 - - [27/Oct/2017:06:15:48 +0000] "GET /api/atlas/v2/types/structdef/guid/blah HTTP/1.1"
404 - "-" "Java/1.8.0_144"
127.0.0.1 - - [27/Oct/2017:06:15:48 +0000] "GET /api/atlas/v2/types/classificationdef/name/blah
HTTP/1.1" 404 - "-" "Java/1.8.0_144"
127.0.0.1 - - [27/Oct/2017:06:15:48 +0000] "GET /api/atlas/v2/types/classificationdef/guid/blah
HTTP/1.1" 404 - "-" "Java/1.8.0_144"
127.0.0.1 - - [27/Oct/2017:06:15:48 +0000] "GET /api/atlas/v2/types/entitydef/name/blah HTTP/1.1"
404 - "-" "Java/1.8.0_144"
127.0.0.1 - - [27/Oct/2017:06:15:48 +0000] "GET /api/atlas/v2/types/entitydef/guid/blah HTTP/1.1"
404 - "-" "Java/1.8.0_144"
127.0.0.1 - - [27/Oct/2017:06:15:48 +0000] "POST /api/atlas/v2/types/typedefs HTTP/1.1" 200
- "-" "Java/1.8.0_144"
127.0.0.1 - - [27/Oct/2017:06:15:48 +0000] "GET /api/atlas/v2/types/typedefs?supertype=APwUSwi71Rm&type=CLASS
HTTP/1.1" 200 - "-" "Java/1.8.0_144"
127.0.0.1 - - [27/Oct/2017:06:15:48 +0000] "GET /api/atlas/v2/types/typedefs?supertype=APwUSwi71Rm&type=CLASS&notsupertype=BlcmNghJfYs
HTTP/1.1" 200 - "-" "Java/1.8.0_144"
127.0.0.1 - - [27/Oct/2017:06:15:48 +0000] "POST /api/atlas/v2/types/typedefs HTTP/1.1" 200
- "-" "Java/1.8.0_144"
127.0.0.1 - - [27/Oct/2017:06:15:49 +0000] "PUT /api/atlas/v2/types/typedefs HTTP/1.1" 200
- "-" "Java/1.8.0_144"
127.0.0.1 - - [27/Oct/2017:06:15:49 +0000] "GET /api/atlas/v2/types/typedefs?type=ENTITY HTTP/1.1"
200 - "-" "Java/1.8.0_144"
127.0.0.1 - - [27/Oct/2017:06:15:49 +0000] "GET /api/atlas/v2/types/classificationdef/name/fetl
HTTP/1.1" 200 - "-" "Java/1.8.0_144"
127.0.0.1 - - [27/Oct/2017:06:15:49 +0000] "GET /api/atlas/v2/types/entitydef/name/database
HTTP/1.1" 200 - "-" "Java/1.8.0_144"
127.0.0.1 - - [27/Oct/2017:06:15:49 +0000] "GET /api/atlas/v2/types/entitydef/name/table HTTP/1.1"
200 - "-" "Java/1.8.0_144"
127.0.0.1 - - [27/Oct/2017:06:15:49 +0000] "GET /api/atlas/v2/types/typedef/name/tableType
HTTP/1.1" 200 - "-" "Java/1.8.0_144"
127.0.0.1 - - [27/Oct/2017:06:15:49 +0000] "GET /api/atlas/v2/types/typedef/name/serdeType
HTTP/1.1" 200 - "-" "Java/1.8.0_144"
127.0.0.1 - - [27/Oct/2017:06:15:49 +0000] "GET /api/atlas/v2/types/typedef/name/classification
HTTP/1.1" 200 - "-" "Java/1.8.0_144"
127.0.0.1 - - [27/Oct/2017:06:15:49 +0000] "GET /api/atlas/v2/types/typedef/name/pii HTTP/1.1"
200 - "-" "Java/1.8.0_144"
127.0.0.1 - - [27/Oct/2017:06:15:49 +0000] "GET /api/atlas/v2/types/typedef/name/phi HTTP/1.1"
200 - "-" "Java/1.8.0_144"
127.0.0.1 - - [27/Oct/2017:06:15:49 +0000] "GET /api/atlas/v2/types/typedef/name/pci HTTP/1.1"
200 - "-" "Java/1.8.0_144"
127.0.0.1 - - [27/Oct/2017:06:15:49 +0000] "GET /api/atlas/v2/types/typedef/name/sox HTTP/1.1"
200 - "-" "Java/1.8.0_144"
127.0.0.1 - - [27/Oct/2017:06:15:49 +0000] "GET /api/atlas/v2/types/typedef/name/sec HTTP/1.1"
200 - "-" "Java/1.8.0_144"
127.0.0.1 - - [27/Oct/2017:06:15:49 +0000] "GET /api/atlas/v2/types/typedef/name/finance HTTP/1.1"
200 - "-" "Java/1.8.0_144"
127.0.0.1 - - [27/Oct/2017:06:15:49 +0000] "GET /api/atlas/v2/types/typedef/name/FactpV2tvjxv63
HTTP/1.1" 404 - "-" "Java/1.8.0_144"
127.0.0.1 - - [27/Oct/2017:06:15:49 +0000] "GET /api/atlas/v2/types/typedef/name/ETLvXGVuRGp6y
HTTP/1.1" 404 - "-" "Java/1.8.0_144"
127.0.0.1 - - [27/Oct/2017:06:15:49 +0000] "GET /api/atlas/v2/types/typedef/name/DimensionQ28ixnRQez
HTTP/1.1" 404 - "-" "Java/1.8.0_144"
127.0.0.1 - - [27/Oct/2017:06:15:49 +0000] "GET /api/atlas/v2/types/typedef/name/MetricKr9HM93JyH
HTTP/1.1" 404 - "-" "Java/1.8.0_144"
127.0.0.1 - - [27/Oct/2017:06:15:49 +0000] "GET /api/atlas/v2/types/typedef/name/hive_db_v1
HTTP/1.1" 200 - "-" "Java/1.8.0_144"
127.0.0.1 - - [27/Oct/2017:06:15:49 +0000] "GET /api/atlas/v2/types/typedef/name/hive_column_v1
HTTP/1.1" 200 - "-" "Java/1.8.0_144"
127.0.0.1 - - [27/Oct/2017:06:15:49 +0000] "GET /api/atlas/v2/types/typedef/name/hive_table_v1
HTTP/1.1" 200 - "-" "Java/1.8.0_144"
127.0.0.1 - - [27/Oct/2017:06:15:49 +0000] "GET /api/atlas/v2/types/typedef/name/hive_process_v1
HTTP/1.1" 200 - "-" "Java/1.8.0_144"
127.0.0.1 - - [27/Oct/2017:06:15:49 +0000] "POST /api/atlas/types HTTP/1.1" 201 - "-" "Java/1.8.0_144"
127.0.0.1 - - [27/Oct/2017:06:15:51 +0000] "GET /api/atlas/discovery/search/dsl?query=hive_db+where+qualifiedName%3D'dbT3Cc5mjL1Z'&limit=10&offset=0
HTTP/1.1" 200 - "-" "Java/1.8.0_144"
127.0.0.1 - - [27/Oct/2017:06:15:52 +0000] "GET /api/atlas/entities?type=hive_db&property=qualifiedName&value=dbT3Cc5mjL1Z
HTTP/1.1" 200 - "-" "Java/1.8.0_144"
127.0.0.1 - - [27/Oct/2017:06:15:52 +0000] "GET /api/atlas/entities/fab572de-f419-4d8f-9144-8971be6425a6/audit?count=1
HTTP/1.1" 200 - "-" "Java/1.8.0_144"
127.0.0.1 - - [27/Oct/2017:06:15:52 +0000] "POST /api/atlas/entities HTTP/1.1" 201 - "-" "Java/1.8.0_144"
127.0.0.1 - - [27/Oct/2017:06:15:53 +0000] "GET /api/atlas/entities/5ed857c8-fc53-4790-be16-5bdf5b067855
HTTP/1.1" 200 - "-" "Java/1.8.0_144"
127.0.0.1 - - [27/Oct/2017:06:15:55 +0000] "GET /api/atlas/discovery/search/dsl?query=hive_db+where+name%3D'dbTjBUv1qHqK'&limit=10&offset=0
HTTP/1.1" 200 - "-" "Java/1.8.0_144"
127.0.0.1 - - [27/Oct/2017:06:15:55 +0000] "POST /api/atlas/entities HTTP/1.1" 201 - "-" "Java/1.8.0_144"
127.0.0.1 - - [27/Oct/2017:06:15:57 +0000] "GET /api/atlas/discovery/search/dsl?query=hive_db+where+qualifiedName%3D'dbnThNHF09rx'&limit=10&offset=0
HTTP/1.1" 200 - "-" "Java/1.8.0_144"
127.0.0.1 - - [27/Oct/2017:06:15:57 +0000] "GET /api/atlas/entities?type=hive_db&property=qualifiedName&value=dbnThNHF09rx
HTTP/1.1" 200 - "-" "Java/1.8.0_144"
127.0.0.1 - - [27/Oct/2017:06:15:57 +0000] "POST /api/atlas/entities HTTP/1.1" 201 - "-" "Java/1.8.0_144"
127.0.0.1 - - [27/Oct/2017:06:15:58 +0000] "GET /api/atlas/entities?type=hive_db&property=qualifiedName&value=dbAdIBgh0Cmv
HTTP/1.1" 200 - "-" "Java/1.8.0_144"
127.0.0.1 - - [27/Oct/2017:06:15:58 +0000] "GET /api/atlas/entities?type=hive_db&property=qualifiedName&value=dbAdIBgh0Cmv
HTTP/1.1" 200 - "-" "Java/1.8.0_144"
127.0.0.1 - - [27/Oct/2017:06:15:58 +0000] "POST /api/atlas/entities HTTP/1.1" 201 - "-" "Java/1.8.0_144"
127.0.0.1 - - [27/Oct/2017:06:15:59 +0000] "GET /api/atlas/discovery/search/dsl?query=hive_db+where+qualifiedName%3D'dbBumeFGVdEx'&limit=10&offset=0
HTTP/1.1" 200 - "-" "Java/1.8.0_144"
127.0.0.1 - - [27/Oct/2017:06:16:00 +0000] "GET /api/atlas/discovery/search/dsl?query=hive_db+where+qualifiedName%3D'dbYiH2vuHAjy'&limit=10&offset=0
HTTP/1.1" 200 - "-" "Java/1.8.0_144"
Tests run: 136, Failures: 2, Errors: 0, Skipped: 2, Time elapsed: 160.328 sec <<<
FAILURE! - in TestSuite
testLineageIsMaintained(org.apache.atlas.examples.QuickStartIT)  Time elapsed: 2.232 sec 
<<< FAILURE!
java.lang.AssertionError: 
	at org.testng.AssertJUnit.fail(AssertJUnit.java:59)
	at org.testng.AssertJUnit.assertTrue(AssertJUnit.java:24)
	at org.testng.AssertJUnit.assertTrue(AssertJUnit.java:33)
	at org.apache.atlas.examples.QuickStartIT.testLineageIsMaintained(QuickStartIT.java:130)

testSubmit(org.apache.atlas.web.integration.TypesJerseyResourceIT)  Time elapsed: 0.165 sec
 <<< FAILURE!
org.apache.atlas.AtlasServiceException: Metadata service API org.apache.atlas.AtlasClient$API_V1@46d6e954
failed with status 400 (Bad Request) Response Body ({"error":"table.database: invalid inverseRef
constraint. Inverse attribute database.database does not exist"})
	at org.apache.atlas.AtlasBaseClient.callAPIWithResource(AtlasBaseClient.java:387)
	at org.apache.atlas.AtlasBaseClient.callAPIWithResource(AtlasBaseClient.java:320)
	at org.apache.atlas.AtlasBaseClient.callAPI(AtlasBaseClient.java:208)
	at org.apache.atlas.AtlasClient.callAPIWithBody(AtlasClient.java:942)
	at org.apache.atlas.web.integration.TypesJerseyResourceIT.testSubmit(TypesJerseyResourceIT.java:84)


Results :

Failed tests: 
  QuickStartIT.testLineageIsMaintained:130 
  TypesJerseyResourceIT.testSubmit:84 » AtlasService Metadata service API org.ap...

Tests run: 136, Failures: 2, Errors: 0, Skipped: 2

[INFO] 
[INFO] --- jetty-maven-plugin:9.2.12.v20150709:stop (stop-jetty) @ atlas-webapp ---
[INFO] Waiting 10 seconds for jetty to stop
[INFO] Stopped ServerConnector@2608b8e1{HTTP/1.1}{0.0.0.0:31000}
[INFO] Closing Spring root WebApplicationContext
[INFO] Shutting down log4j
log4j:WARN No appenders could be found for logger (org.apache.zookeeper.ClientCnxn).
log4j:WARN Please initialize the log4j system properly.
log4j:WARN See http://logging.apache.org/log4j/1.2/faq.html#noconfig for more info.
[INFO] Not cleaning cached beans: no such field javax.el.BeanELResolver.properties
[INFO] Stopped o.e.j.m.p.JettyWebAppContext@1db574fb{/,<https://builds.apache.org/job/Atlas-0.8-IntegrationTests/ws/webapp/target/atlas-webapp-0.8.2-SNAPSHOT/,UNAVAILABLE}{/home/jenkins/jenkins-slave/workspace/Atlas-0.8-IntegrationTests/webapp/target/atlas-webapp-0.8.2-SNAPSHOT.war}>
[INFO] Server reports itself as stopped
[INFO] 
[INFO] --- maven-source-plugin:2.4:jar-no-fork (attach-sources) @ atlas-webapp ---
[INFO] Building jar: <https://builds.apache.org/job/Atlas-0.8-IntegrationTests/ws/webapp/target/atlas-webapp-0.8.2-SNAPSHOT-sources.jar>
[INFO] 
[INFO] --- maven-source-plugin:2.4:test-jar-no-fork (attach-sources) @ atlas-webapp ---
[INFO] Building jar: <https://builds.apache.org/job/Atlas-0.8-IntegrationTests/ws/webapp/target/atlas-webapp-0.8.2-SNAPSHOT-test-sources.jar>
[INFO] 
[INFO] --- maven-failsafe-plugin:2.18.1:verify (verify) @ atlas-webapp ---
[INFO] Failsafe report directory: <https://builds.apache.org/job/Atlas-0.8-IntegrationTests/ws/webapp/target/failsafe-reports>
[INFO] ------------------------------------------------------------------------
[INFO] Reactor Summary:
[INFO] 
[INFO] Apache Atlas Server Build Tools .................... SUCCESS [  1.154 s]
[INFO] apache-atlas ....................................... SUCCESS [  7.205 s]
[INFO] Apache Atlas Integration ........................... SUCCESS [ 22.343 s]
[INFO] Apache Atlas Common ................................ SUCCESS [  7.894 s]
[INFO] Apache Atlas Typesystem ............................ SUCCESS [ 49.972 s]
[INFO] Apache Atlas Client ................................ SUCCESS [  0.774 s]
[INFO] atlas-client-common ................................ SUCCESS [  7.102 s]
[INFO] atlas-client-v1 .................................... SUCCESS [  7.304 s]
[INFO] Apache Atlas Server API ............................ SUCCESS [  5.998 s]
[INFO] Apache Atlas Notification .......................... SUCCESS [ 10.835 s]
[INFO] atlas-client-v2 .................................... SUCCESS [  5.745 s]
[INFO] Apache Atlas Graph Database Projects ............... SUCCESS [  0.550 s]
[INFO] Apache Atlas Graph Database API .................... SUCCESS [  5.114 s]
[INFO] Graph Database Common Code ......................... SUCCESS [  5.196 s]
[INFO] Apache Atlas Titan 1.0.0 GraphDB Impl .............. SUCCESS [ 37.938 s]
[INFO] Shaded version of Apache hbase client .............. SUCCESS [  7.951 s]
[INFO] Apache Atlas Titan 0.5.4 Graph DB Impl ............. SUCCESS [ 36.962 s]
[INFO] Apache Atlas Graph Database Implementation Dependencies SUCCESS [  0.835 s]
[INFO] Shaded version of Apache hbase server .............. SUCCESS [ 22.645 s]
[INFO] Apache Atlas Repository ............................ SUCCESS [01:20 min]
[INFO] Apache Atlas Authorization ......................... SUCCESS [  6.498 s]
[INFO] Apache Atlas Business Catalog ...................... SUCCESS [ 10.252 s]
[INFO] Apache Atlas UI .................................... SUCCESS [01:36 min]
[INFO] Apache Atlas Web Application ....................... FAILURE [04:19 min]
[INFO] Apache Atlas Documentation ......................... SKIPPED
[INFO] Apache Atlas FileSystem Model ...................... SKIPPED
[INFO] Apache Atlas Plugin Classloader .................... SKIPPED
[INFO] Apache Atlas Hive Bridge Shim ...................... SKIPPED
[INFO] Apache Atlas Hive Bridge ........................... SKIPPED
[INFO] Apache Atlas Falcon Bridge Shim .................... SKIPPED
[INFO] Apache Atlas Falcon Bridge ......................... SKIPPED
[INFO] Apache Atlas Sqoop Bridge Shim ..................... SKIPPED
[INFO] Apache Atlas Sqoop Bridge .......................... SKIPPED
[INFO] Apache Atlas Storm Bridge Shim ..................... SKIPPED
[INFO] Apache Atlas Storm Bridge .......................... SKIPPED
[INFO] Apache Atlas Hbase Bridge Shim ..................... SKIPPED
[INFO] Apache Atlas Hbase Bridge .......................... SKIPPED
[INFO] Apache Atlas Distribution .......................... SKIPPED
[INFO] ------------------------------------------------------------------------
[INFO] BUILD FAILURE
[INFO] ------------------------------------------------------------------------
[INFO] Total time: 11:38 min
[INFO] Finished at: 2017-10-27T06:16:05Z
[INFO] Final Memory: 376M/2625M
[INFO] ------------------------------------------------------------------------
[ERROR] Failed to execute goal org.apache.maven.plugins:maven-failsafe-plugin:2.18.1:verify
(verify) on project atlas-webapp: There are test failures.
[ERROR] 
[ERROR] Please refer to <https://builds.apache.org/job/Atlas-0.8-IntegrationTests/ws/webapp/target/failsafe-reports>
for the individual test results.
[ERROR] -> [Help 1]
[ERROR] 
[ERROR] To see the full stack trace of the errors, re-run Maven with the -e switch.
[ERROR] Re-run Maven using the -X switch to enable full debug logging.
[ERROR] 
[ERROR] For more information about the errors and possible solutions, please read the following
articles:
[ERROR] [Help 1] http://cwiki.apache.org/confluence/display/MAVEN/MojoFailureException
[ERROR] 
[ERROR] After correcting the problems, you can resume the build with the command
[ERROR]   mvn <goals> -rf :atlas-webapp
Build step 'Execute shell' marked build as failure
[CHECKSTYLE] Collecting checkstyle analysis files...
[CHECKSTYLE] Searching for all files in <https://builds.apache.org/job/Atlas-0.8-IntegrationTests/ws/>
that match the pattern **/target/checkstyle-result.xml
[CHECKSTYLE] Parsing 22 files in <https://builds.apache.org/job/Atlas-0.8-IntegrationTests/ws/>
[CHECKSTYLE] Successfully parsed file <https://builds.apache.org/job/Atlas-0.8-IntegrationTests/ws/authorization/target/checkstyle-result.xml>
with 467 unique warnings and 0 duplicates.
[CHECKSTYLE] Successfully parsed file <https://builds.apache.org/job/Atlas-0.8-IntegrationTests/ws/catalog/target/checkstyle-result.xml>
with 2604 unique warnings and 0 duplicates.
[CHECKSTYLE] Successfully parsed file <https://builds.apache.org/job/Atlas-0.8-IntegrationTests/ws/client/client-v1/target/checkstyle-result.xml>
with 3480 unique warnings and 0 duplicates.
[CHECKSTYLE] Successfully parsed file <https://builds.apache.org/job/Atlas-0.8-IntegrationTests/ws/client/client-v2/target/checkstyle-result.xml>
with 3805 unique warnings and 0 duplicates.
[CHECKSTYLE] Successfully parsed file <https://builds.apache.org/job/Atlas-0.8-IntegrationTests/ws/client/common/target/checkstyle-result.xml>
with 4295 unique warnings and 0 duplicates.
[CHECKSTYLE] Successfully parsed file <https://builds.apache.org/job/Atlas-0.8-IntegrationTests/ws/client/target/checkstyle-result.xml>
with 4295 unique warnings and 0 duplicates.
[CHECKSTYLE] Successfully parsed file <https://builds.apache.org/job/Atlas-0.8-IntegrationTests/ws/common/target/checkstyle-result.xml>
with 5254 unique warnings and 0 duplicates.
[CHECKSTYLE] Successfully parsed file <https://builds.apache.org/job/Atlas-0.8-IntegrationTests/ws/dashboardv2/target/checkstyle-result.xml>
with 5254 unique warnings and 0 duplicates.
[CHECKSTYLE] Successfully parsed file <https://builds.apache.org/job/Atlas-0.8-IntegrationTests/ws/graphdb/api/target/checkstyle-result.xml>
with 5527 unique warnings and 0 duplicates.
[CHECKSTYLE] Successfully parsed file <https://builds.apache.org/job/Atlas-0.8-IntegrationTests/ws/graphdb/common/target/checkstyle-result.xml>
with 5714 unique warnings and 0 duplicates.
[CHECKSTYLE] Successfully parsed file <https://builds.apache.org/job/Atlas-0.8-IntegrationTests/ws/graphdb/graphdb-impls/target/checkstyle-result.xml>
with 5714 unique warnings and 0 duplicates.
[CHECKSTYLE] Successfully parsed file <https://builds.apache.org/job/Atlas-0.8-IntegrationTests/ws/graphdb/target/checkstyle-result.xml>
with 5714 unique warnings and 0 duplicates.
[CHECKSTYLE] Successfully parsed file <https://builds.apache.org/job/Atlas-0.8-IntegrationTests/ws/graphdb/titan0/target/checkstyle-result.xml>
with 8169 unique warnings and 0 duplicates.
[CHECKSTYLE] Successfully parsed file <https://builds.apache.org/job/Atlas-0.8-IntegrationTests/ws/graphdb/titan1/target/checkstyle-result.xml>
with 9136 unique warnings and 0 duplicates.
[CHECKSTYLE] Successfully parsed file <https://builds.apache.org/job/Atlas-0.8-IntegrationTests/ws/intg/target/checkstyle-result.xml>
with 15850 unique warnings and 0 duplicates.
[CHECKSTYLE] Successfully parsed file <https://builds.apache.org/job/Atlas-0.8-IntegrationTests/ws/notification/target/checkstyle-result.xml>
with 17415 unique warnings and 0 duplicates.
[CHECKSTYLE] Successfully parsed file <https://builds.apache.org/job/Atlas-0.8-IntegrationTests/ws/repository/target/checkstyle-result.xml>
with 36354 unique warnings and 0 duplicates.
[CHECKSTYLE] Successfully parsed file <https://builds.apache.org/job/Atlas-0.8-IntegrationTests/ws/server-api/target/checkstyle-result.xml>
with 36747 unique warnings and 0 duplicates.
[CHECKSTYLE] Successfully parsed file <https://builds.apache.org/job/Atlas-0.8-IntegrationTests/ws/shaded/hbase-client-shaded/target/checkstyle-result.xml>
with 36747 unique warnings and 0 duplicates.
[CHECKSTYLE] Successfully parsed file <https://builds.apache.org/job/Atlas-0.8-IntegrationTests/ws/shaded/hbase-server-shaded/target/checkstyle-result.xml>
with 36747 unique warnings and 0 duplicates.
[CHECKSTYLE] Successfully parsed file <https://builds.apache.org/job/Atlas-0.8-IntegrationTests/ws/target/checkstyle-result.xml>
with 36747 unique warnings and 0 duplicates.
[CHECKSTYLE] Successfully parsed file <https://builds.apache.org/job/Atlas-0.8-IntegrationTests/ws/typesystem/target/checkstyle-result.xml>
with 40965 unique warnings and 0 duplicates.
<Git Blamer> Using GitBlamer to create author and commit information for all warnings.
<Git Blamer> GIT_COMMIT=8db1c77b3d693ccffbd96cb498d03aede54d3459, workspace=<https://builds.apache.org/job/Atlas-0.8-IntegrationTests/ws/>
 > git rev-parse 8db1c77b3d693ccffbd96cb498d03aede54d3459^{commit} # timeout=10
[FINDBUGS] Collecting findbugs analysis files...
[FINDBUGS] Searching for all files in <https://builds.apache.org/job/Atlas-0.8-IntegrationTests/ws/>
that match the pattern **/target/findbugs.xml
[FINDBUGS] Parsing 15 files in <https://builds.apache.org/job/Atlas-0.8-IntegrationTests/ws/>
[FINDBUGS] Successfully parsed file <https://builds.apache.org/job/Atlas-0.8-IntegrationTests/ws/authorization/target/findbugs.xml>
with 0 unique warnings and 0 duplicates.
[FINDBUGS] Successfully parsed file <https://builds.apache.org/job/Atlas-0.8-IntegrationTests/ws/catalog/target/findbugs.xml>
with 0 unique warnings and 0 duplicates.
[FINDBUGS] Successfully parsed file <https://builds.apache.org/job/Atlas-0.8-IntegrationTests/ws/client/client-v1/target/findbugs.xml>
with 0 unique warnings and 0 duplicates.
[FINDBUGS] Successfully parsed file <https://builds.apache.org/job/Atlas-0.8-IntegrationTests/ws/client/client-v2/target/findbugs.xml>
with 0 unique warnings and 0 duplicates.
[FINDBUGS] Successfully parsed file <https://builds.apache.org/job/Atlas-0.8-IntegrationTests/ws/client/common/target/findbugs.xml>
with 0 unique warnings and 0 duplicates.
[FINDBUGS] Successfully parsed file <https://builds.apache.org/job/Atlas-0.8-IntegrationTests/ws/common/target/findbugs.xml>
with 0 unique warnings and 0 duplicates.
[FINDBUGS] Successfully parsed file <https://builds.apache.org/job/Atlas-0.8-IntegrationTests/ws/graphdb/api/target/findbugs.xml>
with 0 unique warnings and 0 duplicates.
[FINDBUGS] Successfully parsed file <https://builds.apache.org/job/Atlas-0.8-IntegrationTests/ws/graphdb/common/target/findbugs.xml>
with 0 unique warnings and 0 duplicates.
[FINDBUGS] Successfully parsed file <https://builds.apache.org/job/Atlas-0.8-IntegrationTests/ws/graphdb/titan0/target/findbugs.xml>
with 0 unique warnings and 0 duplicates.
[FINDBUGS] Successfully parsed file <https://builds.apache.org/job/Atlas-0.8-IntegrationTests/ws/graphdb/titan1/target/findbugs.xml>
with 0 unique warnings and 0 duplicates.
[FINDBUGS] Successfully parsed file <https://builds.apache.org/job/Atlas-0.8-IntegrationTests/ws/intg/target/findbugs.xml>
with 0 unique warnings and 0 duplicates.
[FINDBUGS] Successfully parsed file <https://builds.apache.org/job/Atlas-0.8-IntegrationTests/ws/notification/target/findbugs.xml>
with 0 unique warnings and 0 duplicates.
[FINDBUGS] Successfully parsed file <https://builds.apache.org/job/Atlas-0.8-IntegrationTests/ws/repository/target/findbugs.xml>
with 0 unique warnings and 0 duplicates.
[FINDBUGS] Successfully parsed file <https://builds.apache.org/job/Atlas-0.8-IntegrationTests/ws/server-api/target/findbugs.xml>
with 0 unique warnings and 0 duplicates.
[FINDBUGS] Successfully parsed file <https://builds.apache.org/job/Atlas-0.8-IntegrationTests/ws/typesystem/target/findbugs.xml>
with 0 unique warnings and 0 duplicates.
<Git Blamer> Using GitBlamer to create author and commit information for all warnings.
<Git Blamer> GIT_COMMIT=8db1c77b3d693ccffbd96cb498d03aede54d3459, workspace=<https://builds.apache.org/job/Atlas-0.8-IntegrationTests/ws/>
Archiving artifacts
[Fast Archiver] No prior successful build to compare, so performing full copy of artifacts
TestNG Reports Processing: START
Looking for TestNG results report in workspace using pattern: **/target/surefire-reports/testng-results.xml,**/target/failsafe-reports/testng-results.xml
Saving reports...
Processing '/x1/jenkins/jenkins-home/jobs/Atlas-0.8-IntegrationTests/builds/122/testng/testng-results.xml'
1.470588% of tests failed, which exceeded threshold of 0%. Marking build as UNSTABLE
TestNG Reports Processing: FINISH

Mime
View raw message