atlas-dev mailing list archives

Site index · List index
Message view « Date » · « Thread »
Top « Date » · « Thread »
From Apache Jenkins Server <jenk...@builds.apache.org>
Subject Build failed in Jenkins: Atlas-0.8-IntegrationTests #114
Date Tue, 17 Oct 2017 22:55:50 GMT
See <https://builds.apache.org/job/Atlas-0.8-IntegrationTests/114/display/redirect?page=changes>

Changes:

[madhan] ATLAS-2214: fix for NPE during notNull condition

------------------------------------------
[...truncated 544.30 KB...]
127.0.0.1 - - [17/Oct/2017:22:50:37 +0000] "GET /api/atlas/v2/types/typedef/name/ETL HTTP/1.1"
200 - "-" "Java/1.8.0_144"
127.0.0.1 - - [17/Oct/2017:22:50:37 +0000] "GET /api/atlas/v2/types/typedef/name/Dimension
HTTP/1.1" 200 - "-" "Java/1.8.0_144"
127.0.0.1 - - [17/Oct/2017:22:50:37 +0000] "GET /api/atlas/v2/types/typedef/name/Metric HTTP/1.1"
200 - "-" "Java/1.8.0_144"
127.0.0.1 - - [17/Oct/2017:22:50:37 +0000] "POST /api/atlas/types HTTP/1.1" 201 - "-" "Java/1.8.0_144"
127.0.0.1 - - [17/Oct/2017:22:50:37 +0000] "POST /api/atlas/entities HTTP/1.1" 201 - "-" "Java/1.8.0_144"
127.0.0.1 - - [17/Oct/2017:22:50:37 +0000] "POST /api/atlas/entities HTTP/1.1" 201 - "-" "Java/1.8.0_144"
127.0.0.1 - - [17/Oct/2017:22:50:37 +0000] "POST /api/atlas/entities HTTP/1.1" 201 - "-" "Java/1.8.0_144"
127.0.0.1 - - [17/Oct/2017:22:50:37 +0000] "POST /api/atlas/entities HTTP/1.1" 201 - "-" "Java/1.8.0_144"
127.0.0.1 - - [17/Oct/2017:22:50:37 +0000] "POST /api/atlas/entities HTTP/1.1" 201 - "-" "Java/1.8.0_144"
127.0.0.1 - - [17/Oct/2017:22:50:37 +0000] "POST /api/atlas/entities HTTP/1.1" 201 - "-" "Java/1.8.0_144"
127.0.0.1 - - [17/Oct/2017:22:50:37 +0000] "POST /api/atlas/entities HTTP/1.1" 201 - "-" "Java/1.8.0_144"
127.0.0.1 - - [17/Oct/2017:22:50:37 +0000] "POST /api/atlas/entities HTTP/1.1" 201 - "-" "Java/1.8.0_144"
127.0.0.1 - - [17/Oct/2017:22:50:37 +0000] "GET /api/atlas/lineage/hive/table/sales_fact_monthly_mvHXNndttHVV/inputs/graph
HTTP/1.1" 200 - "-" "Java/1.8.0_144"
127.0.0.1 - - [17/Oct/2017:22:50:39 +0000] "GET /api/atlas/entities?type=hive_table_v1&property=qualifiedName&value=sales_fact_monthly_mvHXNndttHVV
HTTP/1.1" 200 - "-" "Java/1.8.0_144"
127.0.0.1 - - [17/Oct/2017:22:50:39 +0000] "GET /api/atlas/lineage/fb70fc53-a135-4f31-a790-ac8633e54e73/inputs/graph
HTTP/1.1" 200 - "-" "Java/1.8.0_144"
127.0.0.1 - - [17/Oct/2017:22:50:40 +0000] "GET /api/atlas/lineage/hive/table/sales_factgLqcb62yWm/outputs/graph
HTTP/1.1" 200 - "-" "Java/1.8.0_144"
127.0.0.1 - - [17/Oct/2017:22:50:42 +0000] "GET /api/atlas/entities?type=hive_table_v1&property=qualifiedName&value=sales_factgLqcb62yWm
HTTP/1.1" 200 - "-" "Java/1.8.0_144"
127.0.0.1 - - [17/Oct/2017:22:50:42 +0000] "GET /api/atlas/lineage/dfe5c0b2-8f34-46d0-ac26-490b1e8ecf55/outputs/graph
HTTP/1.1" 200 - "-" "Java/1.8.0_144"
127.0.0.1 - - [17/Oct/2017:22:50:43 +0000] "GET /api/atlas/lineage/hive/table/sales_factgLqcb62yWm/schema
HTTP/1.1" 200 - "-" "Java/1.8.0_144"
127.0.0.1 - - [17/Oct/2017:22:50:44 +0000] "GET /api/atlas/lineage/hive/table/Saleswi1bGkN4MG/schema
HTTP/1.1" 404 - "-" "Java/1.8.0_144"
127.0.0.1 - - [17/Oct/2017:22:50:44 +0000] "GET /api/atlas/entities?type=hive_table_v1&property=qualifiedName&value=sales_factgLqcb62yWm
HTTP/1.1" 200 - "-" "Java/1.8.0_144"
127.0.0.1 - - [17/Oct/2017:22:50:44 +0000] "GET /api/atlas/lineage/dfe5c0b2-8f34-46d0-ac26-490b1e8ecf55/schema
HTTP/1.1" 200 - "-" "Java/1.8.0_144"
127.0.0.1 - - [17/Oct/2017:22:50:45 +0000] "GET /api/atlas/lineage/hive/table/blah/schema
HTTP/1.1" 404 - "-" "Java/1.8.0_144"
127.0.0.1 - - [17/Oct/2017:22:50:49 +0000] "GET /api/atlas/admin/version HTTP/1.1" 200 - "-"
"Java/1.8.0_144"
127.0.0.1 - - [17/Oct/2017:22:50:49 +0000] "GET /api/atlas/admin/status HTTP/1.1" 200 - "-"
"Java/1.8.0_144"
127.0.0.1 - - [17/Oct/2017:22:50:49 +0000] "GET /api/atlas/v1/taxonomies HTTP/1.1" 403 493
"-" "Java/1.8.0_144"
127.0.0.1 - - [17/Oct/2017:22:50:49 +0000] "GET /api/atlas/admin/session HTTP/1.1" 200 - "-"
"Java/1.8.0_144"
127.0.0.1 - - [17/Oct/2017:22:50:49 +0000] "GET /api/atlas/admin/session HTTP/1.1" 401 317
"-" "Java/1.8.0_144"
127.0.0.1 - - [17/Oct/2017:22:50:50 +0000] "GET /api/atlas/v2/types/typedef/name/database
HTTP/1.1" 200 - "-" "Java/1.8.0_144"
127.0.0.1 - - [17/Oct/2017:22:50:50 +0000] "GET /api/atlas/v2/types/typedef/name/table HTTP/1.1"
404 - "-" "Java/1.8.0_144"
127.0.0.1 - - [17/Oct/2017:22:50:50 +0000] "GET /api/atlas/v2/types/typedef/name/fetl HTTP/1.1"
404 - "-" "Java/1.8.0_144"
127.0.0.1 - - [17/Oct/2017:22:50:50 +0000] "POST /api/atlas/v2/types/typedefs HTTP/1.1" 200
- "-" "Java/1.8.0_144"
127.0.0.1 - - [17/Oct/2017:22:50:50 +0000] "GET /api/atlas/v2/types/classificationdef/name/fetl
HTTP/1.1" 200 - "-" "Java/1.8.0_144"
127.0.0.1 - - [17/Oct/2017:22:50:50 +0000] "GET /api/atlas/v2/types/entitydef/name/database
HTTP/1.1" 200 - "-" "Java/1.8.0_144"
127.0.0.1 - - [17/Oct/2017:22:50:50 +0000] "GET /api/atlas/v2/types/entitydef/name/table HTTP/1.1"
200 - "-" "Java/1.8.0_144"
127.0.0.1 - - [17/Oct/2017:22:50:50 +0000] "POST /api/atlas/v2/types/typedefs HTTP/1.1" 200
- "-" "Java/1.8.0_144"
127.0.0.1 - - [17/Oct/2017:22:50:50 +0000] "POST /api/atlas/v2/types/typedefs HTTP/1.1" 409
- "-" "Java/1.8.0_144"
127.0.0.1 - - [17/Oct/2017:22:50:50 +0000] "GET /api/atlas/v2/types/enumdef/name/blah HTTP/1.1"
404 - "-" "Java/1.8.0_144"
127.0.0.1 - - [17/Oct/2017:22:50:50 +0000] "GET /api/atlas/v2/types/enumdef/guid/blah HTTP/1.1"
404 - "-" "Java/1.8.0_144"
127.0.0.1 - - [17/Oct/2017:22:50:50 +0000] "GET /api/atlas/v2/types/structdef/name/blah HTTP/1.1"
404 - "-" "Java/1.8.0_144"
127.0.0.1 - - [17/Oct/2017:22:50:50 +0000] "GET /api/atlas/v2/types/structdef/guid/blah HTTP/1.1"
404 - "-" "Java/1.8.0_144"
127.0.0.1 - - [17/Oct/2017:22:50:50 +0000] "GET /api/atlas/v2/types/classificationdef/name/blah
HTTP/1.1" 404 - "-" "Java/1.8.0_144"
127.0.0.1 - - [17/Oct/2017:22:50:50 +0000] "GET /api/atlas/v2/types/classificationdef/guid/blah
HTTP/1.1" 404 - "-" "Java/1.8.0_144"
127.0.0.1 - - [17/Oct/2017:22:50:50 +0000] "GET /api/atlas/v2/types/entitydef/name/blah HTTP/1.1"
404 - "-" "Java/1.8.0_144"
127.0.0.1 - - [17/Oct/2017:22:50:50 +0000] "GET /api/atlas/v2/types/entitydef/guid/blah HTTP/1.1"
404 - "-" "Java/1.8.0_144"
127.0.0.1 - - [17/Oct/2017:22:50:50 +0000] "POST /api/atlas/v2/types/typedefs HTTP/1.1" 200
- "-" "Java/1.8.0_144"
127.0.0.1 - - [17/Oct/2017:22:50:50 +0000] "GET /api/atlas/v2/types/typedefs?supertype=ACjZPX67cud&type=CLASS
HTTP/1.1" 200 - "-" "Java/1.8.0_144"
127.0.0.1 - - [17/Oct/2017:22:50:50 +0000] "GET /api/atlas/v2/types/typedefs?supertype=ACjZPX67cud&type=CLASS&notsupertype=ByO0rteyYmp
HTTP/1.1" 200 - "-" "Java/1.8.0_144"
127.0.0.1 - - [17/Oct/2017:22:50:50 +0000] "POST /api/atlas/v2/types/typedefs HTTP/1.1" 200
- "-" "Java/1.8.0_144"
127.0.0.1 - - [17/Oct/2017:22:50:50 +0000] "PUT /api/atlas/v2/types/typedefs HTTP/1.1" 200
- "-" "Java/1.8.0_144"
127.0.0.1 - - [17/Oct/2017:22:50:50 +0000] "GET /api/atlas/v2/types/typedefs?type=ENTITY HTTP/1.1"
200 - "-" "Java/1.8.0_144"
127.0.0.1 - - [17/Oct/2017:22:50:50 +0000] "GET /api/atlas/v2/types/classificationdef/name/fetl
HTTP/1.1" 200 - "-" "Java/1.8.0_144"
127.0.0.1 - - [17/Oct/2017:22:50:50 +0000] "GET /api/atlas/v2/types/entitydef/name/database
HTTP/1.1" 200 - "-" "Java/1.8.0_144"
127.0.0.1 - - [17/Oct/2017:22:50:50 +0000] "GET /api/atlas/v2/types/entitydef/name/table HTTP/1.1"
200 - "-" "Java/1.8.0_144"
127.0.0.1 - - [17/Oct/2017:22:50:51 +0000] "GET /api/atlas/v2/types/typedef/name/tableType
HTTP/1.1" 200 - "-" "Java/1.8.0_144"
127.0.0.1 - - [17/Oct/2017:22:50:51 +0000] "GET /api/atlas/v2/types/typedef/name/serdeType
HTTP/1.1" 200 - "-" "Java/1.8.0_144"
127.0.0.1 - - [17/Oct/2017:22:50:51 +0000] "GET /api/atlas/v2/types/typedef/name/classification
HTTP/1.1" 200 - "-" "Java/1.8.0_144"
127.0.0.1 - - [17/Oct/2017:22:50:51 +0000] "GET /api/atlas/v2/types/typedef/name/pii HTTP/1.1"
200 - "-" "Java/1.8.0_144"
127.0.0.1 - - [17/Oct/2017:22:50:51 +0000] "GET /api/atlas/v2/types/typedef/name/phi HTTP/1.1"
200 - "-" "Java/1.8.0_144"
127.0.0.1 - - [17/Oct/2017:22:50:51 +0000] "GET /api/atlas/v2/types/typedef/name/pci HTTP/1.1"
200 - "-" "Java/1.8.0_144"
127.0.0.1 - - [17/Oct/2017:22:50:51 +0000] "GET /api/atlas/v2/types/typedef/name/sox HTTP/1.1"
200 - "-" "Java/1.8.0_144"
127.0.0.1 - - [17/Oct/2017:22:50:51 +0000] "GET /api/atlas/v2/types/typedef/name/sec HTTP/1.1"
200 - "-" "Java/1.8.0_144"
127.0.0.1 - - [17/Oct/2017:22:50:51 +0000] "GET /api/atlas/v2/types/typedef/name/finance HTTP/1.1"
200 - "-" "Java/1.8.0_144"
127.0.0.1 - - [17/Oct/2017:22:50:51 +0000] "GET /api/atlas/v2/types/typedef/name/FactcoJ8VZL1Mc
HTTP/1.1" 404 - "-" "Java/1.8.0_144"
127.0.0.1 - - [17/Oct/2017:22:50:51 +0000] "GET /api/atlas/v2/types/typedef/name/ETLLYZrJ3MjKT
HTTP/1.1" 404 - "-" "Java/1.8.0_144"
127.0.0.1 - - [17/Oct/2017:22:50:51 +0000] "GET /api/atlas/v2/types/typedef/name/Dimensionn0qBVCM382
HTTP/1.1" 404 - "-" "Java/1.8.0_144"
127.0.0.1 - - [17/Oct/2017:22:50:51 +0000] "GET /api/atlas/v2/types/typedef/name/Metricf7kB4p6qpW
HTTP/1.1" 404 - "-" "Java/1.8.0_144"
127.0.0.1 - - [17/Oct/2017:22:50:51 +0000] "GET /api/atlas/v2/types/typedef/name/hive_db_v1
HTTP/1.1" 200 - "-" "Java/1.8.0_144"
127.0.0.1 - - [17/Oct/2017:22:50:51 +0000] "GET /api/atlas/v2/types/typedef/name/hive_column_v1
HTTP/1.1" 200 - "-" "Java/1.8.0_144"
127.0.0.1 - - [17/Oct/2017:22:50:51 +0000] "GET /api/atlas/v2/types/typedef/name/hive_table_v1
HTTP/1.1" 200 - "-" "Java/1.8.0_144"
127.0.0.1 - - [17/Oct/2017:22:50:51 +0000] "GET /api/atlas/v2/types/typedef/name/hive_process_v1
HTTP/1.1" 200 - "-" "Java/1.8.0_144"
127.0.0.1 - - [17/Oct/2017:22:50:51 +0000] "POST /api/atlas/types HTTP/1.1" 201 - "-" "Java/1.8.0_144"
127.0.0.1 - - [17/Oct/2017:22:50:52 +0000] "GET /api/atlas/discovery/search/dsl?query=hive_db+where+qualifiedName%3D'dbmTypo1YfXj'&limit=10&offset=0
HTTP/1.1" 200 - "-" "Java/1.8.0_144"
127.0.0.1 - - [17/Oct/2017:22:50:53 +0000] "GET /api/atlas/entities?type=hive_db&property=qualifiedName&value=dbmTypo1YfXj
HTTP/1.1" 200 - "-" "Java/1.8.0_144"
127.0.0.1 - - [17/Oct/2017:22:50:53 +0000] "GET /api/atlas/entities/6a35ccc9-ec76-467d-873b-fd03c65935e4/audit?count=1
HTTP/1.1" 200 - "-" "Java/1.8.0_144"
127.0.0.1 - - [17/Oct/2017:22:50:53 +0000] "POST /api/atlas/entities HTTP/1.1" 201 - "-" "Java/1.8.0_144"
127.0.0.1 - - [17/Oct/2017:22:50:54 +0000] "GET /api/atlas/entities/23f639cd-5a0b-4d7d-9f90-7ad059506350
HTTP/1.1" 200 - "-" "Java/1.8.0_144"
127.0.0.1 - - [17/Oct/2017:22:50:56 +0000] "GET /api/atlas/discovery/search/dsl?query=hive_db+where+name%3D'dbuQoE4Ypngm'&limit=10&offset=0
HTTP/1.1" 200 - "-" "Java/1.8.0_144"
127.0.0.1 - - [17/Oct/2017:22:50:57 +0000] "POST /api/atlas/entities HTTP/1.1" 201 - "-" "Java/1.8.0_144"
127.0.0.1 - - [17/Oct/2017:22:50:58 +0000] "GET /api/atlas/discovery/search/dsl?query=hive_db+where+qualifiedName%3D'dbA8SDE2XtsS'&limit=10&offset=0
HTTP/1.1" 200 - "-" "Java/1.8.0_144"
127.0.0.1 - - [17/Oct/2017:22:50:58 +0000] "GET /api/atlas/entities?type=hive_db&property=qualifiedName&value=dbA8SDE2XtsS
HTTP/1.1" 200 - "-" "Java/1.8.0_144"
127.0.0.1 - - [17/Oct/2017:22:50:58 +0000] "POST /api/atlas/entities HTTP/1.1" 201 - "-" "Java/1.8.0_144"
127.0.0.1 - - [17/Oct/2017:22:50:59 +0000] "GET /api/atlas/entities?type=hive_db&property=qualifiedName&value=dblc5RgjQXiP
HTTP/1.1" 200 - "-" "Java/1.8.0_144"
127.0.0.1 - - [17/Oct/2017:22:50:59 +0000] "GET /api/atlas/entities?type=hive_db&property=qualifiedName&value=dblc5RgjQXiP
HTTP/1.1" 200 - "-" "Java/1.8.0_144"
127.0.0.1 - - [17/Oct/2017:22:50:59 +0000] "POST /api/atlas/entities HTTP/1.1" 201 - "-" "Java/1.8.0_144"
127.0.0.1 - - [17/Oct/2017:22:51:00 +0000] "GET /api/atlas/discovery/search/dsl?query=hive_db+where+qualifiedName%3D'dbqfVHROKVRY'&limit=10&offset=0
HTTP/1.1" 200 - "-" "Java/1.8.0_144"
127.0.0.1 - - [17/Oct/2017:22:51:01 +0000] "GET /api/atlas/discovery/search/dsl?query=hive_db+where+qualifiedName%3D'dbT5NNhIJw8Z'&limit=10&offset=0
HTTP/1.1" 200 - "-" "Java/1.8.0_144"
Tests run: 133, Failures: 2, Errors: 0, Skipped: 2, Time elapsed: 155.32 sec <<<
FAILURE! - in TestSuite
testLineageIsMaintained(org.apache.atlas.examples.QuickStartIT)  Time elapsed: 2.242 sec 
<<< FAILURE!
java.lang.AssertionError: 
	at org.testng.AssertJUnit.fail(AssertJUnit.java:59)
	at org.testng.AssertJUnit.assertTrue(AssertJUnit.java:24)
	at org.testng.AssertJUnit.assertTrue(AssertJUnit.java:33)
	at org.apache.atlas.examples.QuickStartIT.testLineageIsMaintained(QuickStartIT.java:130)

testSubmit(org.apache.atlas.web.integration.TypesJerseyResourceIT)  Time elapsed: 0.14 sec
 <<< FAILURE!
org.apache.atlas.AtlasServiceException: Metadata service API org.apache.atlas.AtlasClient$API_V1@3d45cc70
failed with status 400 (Bad Request) Response Body ({"error":"table.database: invalid inverseRef
constraint. Inverse attribute database.database does not exist"})
	at org.apache.atlas.AtlasBaseClient.callAPIWithResource(AtlasBaseClient.java:371)
	at org.apache.atlas.AtlasBaseClient.callAPIWithResource(AtlasBaseClient.java:311)
	at org.apache.atlas.AtlasBaseClient.callAPI(AtlasBaseClient.java:199)
	at org.apache.atlas.AtlasClient.callAPIWithBody(AtlasClient.java:942)
	at org.apache.atlas.web.integration.TypesJerseyResourceIT.testSubmit(TypesJerseyResourceIT.java:84)


Results :

Failed tests: 
  QuickStartIT.testLineageIsMaintained:130 
  TypesJerseyResourceIT.testSubmit:84 » AtlasService Metadata service API org.ap...

Tests run: 133, Failures: 2, Errors: 0, Skipped: 2

[INFO] 
[INFO] --- jetty-maven-plugin:9.2.12.v20150709:stop (stop-jetty) @ atlas-webapp ---
[INFO] Waiting 10 seconds for jetty to stop
[INFO] Stopped ServerConnector@3db9989f{HTTP/1.1}{0.0.0.0:31000}
[INFO] Closing Spring root WebApplicationContext
[INFO] Shutting down log4j
[INFO] Not cleaning cached beans: no such field javax.el.BeanELResolver.properties
[INFO] Stopped o.e.j.m.p.JettyWebAppContext@6c685e79{/,<https://builds.apache.org/job/Atlas-0.8-IntegrationTests/ws/webapp/target/atlas-webapp-0.8.2-SNAPSHOT/,UNAVAILABLE}{/home/jenkins/jenkins-slave/workspace/Atlas-0.8-IntegrationTests/webapp/target/atlas-webapp-0.8.2-SNAPSHOT.war}>
[INFO] Server reports itself as stopped
[INFO] 
[INFO] --- maven-source-plugin:2.4:jar-no-fork (attach-sources) @ atlas-webapp ---
[INFO] Building jar: <https://builds.apache.org/job/Atlas-0.8-IntegrationTests/ws/webapp/target/atlas-webapp-0.8.2-SNAPSHOT-sources.jar>
log4j:WARN No appenders could be found for logger (org.apache.zookeeper.ClientCnxn).
log4j:WARN Please initialize the log4j system properly.
log4j:WARN See http://logging.apache.org/log4j/1.2/faq.html#noconfig for more info.
[INFO] 
[INFO] --- maven-source-plugin:2.4:test-jar-no-fork (attach-sources) @ atlas-webapp ---
[INFO] Building jar: <https://builds.apache.org/job/Atlas-0.8-IntegrationTests/ws/webapp/target/atlas-webapp-0.8.2-SNAPSHOT-test-sources.jar>
[INFO] 
[INFO] --- maven-failsafe-plugin:2.18.1:verify (verify) @ atlas-webapp ---
[INFO] Failsafe report directory: <https://builds.apache.org/job/Atlas-0.8-IntegrationTests/ws/webapp/target/failsafe-reports>
[INFO] ------------------------------------------------------------------------
[INFO] Reactor Summary:
[INFO] 
[INFO] Apache Atlas Server Build Tools .................... SUCCESS [  0.786 s]
[INFO] apache-atlas ....................................... SUCCESS [  6.647 s]
[INFO] Apache Atlas Integration ........................... SUCCESS [ 20.687 s]
[INFO] Apache Atlas Common ................................ SUCCESS [  9.130 s]
[INFO] Apache Atlas Typesystem ............................ SUCCESS [ 52.705 s]
[INFO] Apache Atlas Client ................................ SUCCESS [  0.807 s]
[INFO] atlas-client-common ................................ SUCCESS [  7.747 s]
[INFO] atlas-client-v1 .................................... SUCCESS [  7.361 s]
[INFO] Apache Atlas Server API ............................ SUCCESS [  6.208 s]
[INFO] Apache Atlas Notification .......................... SUCCESS [ 11.222 s]
[INFO] atlas-client-v2 .................................... SUCCESS [  5.894 s]
[INFO] Apache Atlas Graph Database Projects ............... SUCCESS [  0.600 s]
[INFO] Apache Atlas Graph Database API .................... SUCCESS [  4.901 s]
[INFO] Graph Database Common Code ......................... SUCCESS [  5.326 s]
[INFO] Apache Atlas Titan 1.0.0 GraphDB Impl .............. SUCCESS [ 43.235 s]
[INFO] Shaded version of Apache hbase client .............. SUCCESS [  7.912 s]
[INFO] Apache Atlas Titan 0.5.4 Graph DB Impl ............. SUCCESS [ 37.035 s]
[INFO] Apache Atlas Graph Database Implementation Dependencies SUCCESS [  0.746 s]
[INFO] Shaded version of Apache hbase server .............. SUCCESS [ 22.373 s]
[INFO] Apache Atlas Repository ............................ SUCCESS [01:24 min]
[INFO] Apache Atlas Authorization ......................... SUCCESS [  6.825 s]
[INFO] Apache Atlas Business Catalog ...................... SUCCESS [ 10.910 s]
[INFO] Apache Atlas UI .................................... SUCCESS [01:28 min]
[INFO] Apache Atlas Web Application ....................... FAILURE [04:11 min]
[INFO] Apache Atlas Documentation ......................... SKIPPED
[INFO] Apache Atlas FileSystem Model ...................... SKIPPED
[INFO] Apache Atlas Plugin Classloader .................... SKIPPED
[INFO] Apache Atlas Hive Bridge Shim ...................... SKIPPED
[INFO] Apache Atlas Hive Bridge ........................... SKIPPED
[INFO] Apache Atlas Falcon Bridge Shim .................... SKIPPED
[INFO] Apache Atlas Falcon Bridge ......................... SKIPPED
[INFO] Apache Atlas Sqoop Bridge Shim ..................... SKIPPED
[INFO] Apache Atlas Sqoop Bridge .......................... SKIPPED
[INFO] Apache Atlas Storm Bridge Shim ..................... SKIPPED
[INFO] Apache Atlas Storm Bridge .......................... SKIPPED
[INFO] Apache Atlas Distribution .......................... SKIPPED
[INFO] ------------------------------------------------------------------------
[INFO] BUILD FAILURE
[INFO] ------------------------------------------------------------------------
[INFO] Total time: 11:34 min
[INFO] Finished at: 2017-10-17T22:51:06Z
[INFO] Final Memory: 375M/2842M
[INFO] ------------------------------------------------------------------------
[ERROR] Failed to execute goal org.apache.maven.plugins:maven-failsafe-plugin:2.18.1:verify
(verify) on project atlas-webapp: There are test failures.
[ERROR] 
[ERROR] Please refer to <https://builds.apache.org/job/Atlas-0.8-IntegrationTests/ws/webapp/target/failsafe-reports>
for the individual test results.
[ERROR] -> [Help 1]
[ERROR] 
[ERROR] To see the full stack trace of the errors, re-run Maven with the -e switch.
[ERROR] Re-run Maven using the -X switch to enable full debug logging.
[ERROR] 
[ERROR] For more information about the errors and possible solutions, please read the following
articles:
[ERROR] [Help 1] http://cwiki.apache.org/confluence/display/MAVEN/MojoFailureException
[ERROR] 
[ERROR] After correcting the problems, you can resume the build with the command
[ERROR]   mvn <goals> -rf :atlas-webapp
Build step 'Execute shell' marked build as failure
[CHECKSTYLE] Collecting checkstyle analysis files...
[CHECKSTYLE] Searching for all files in <https://builds.apache.org/job/Atlas-0.8-IntegrationTests/ws/>
that match the pattern **/target/checkstyle-result.xml
[CHECKSTYLE] Parsing 22 files in <https://builds.apache.org/job/Atlas-0.8-IntegrationTests/ws/>
[CHECKSTYLE] Successfully parsed file <https://builds.apache.org/job/Atlas-0.8-IntegrationTests/ws/authorization/target/checkstyle-result.xml>
with 467 unique warnings and 0 duplicates.
[CHECKSTYLE] Successfully parsed file <https://builds.apache.org/job/Atlas-0.8-IntegrationTests/ws/catalog/target/checkstyle-result.xml>
with 2604 unique warnings and 0 duplicates.
[CHECKSTYLE] Successfully parsed file <https://builds.apache.org/job/Atlas-0.8-IntegrationTests/ws/client/client-v1/target/checkstyle-result.xml>
with 3478 unique warnings and 0 duplicates.
[CHECKSTYLE] Successfully parsed file <https://builds.apache.org/job/Atlas-0.8-IntegrationTests/ws/client/client-v2/target/checkstyle-result.xml>
with 3803 unique warnings and 0 duplicates.
[CHECKSTYLE] Successfully parsed file <https://builds.apache.org/job/Atlas-0.8-IntegrationTests/ws/client/common/target/checkstyle-result.xml>
with 4263 unique warnings and 0 duplicates.
[CHECKSTYLE] Successfully parsed file <https://builds.apache.org/job/Atlas-0.8-IntegrationTests/ws/client/target/checkstyle-result.xml>
with 4263 unique warnings and 0 duplicates.
[CHECKSTYLE] Successfully parsed file <https://builds.apache.org/job/Atlas-0.8-IntegrationTests/ws/common/target/checkstyle-result.xml>
with 5222 unique warnings and 0 duplicates.
[CHECKSTYLE] Successfully parsed file <https://builds.apache.org/job/Atlas-0.8-IntegrationTests/ws/dashboardv2/target/checkstyle-result.xml>
with 5222 unique warnings and 0 duplicates.
[CHECKSTYLE] Successfully parsed file <https://builds.apache.org/job/Atlas-0.8-IntegrationTests/ws/graphdb/api/target/checkstyle-result.xml>
with 5495 unique warnings and 0 duplicates.
[CHECKSTYLE] Successfully parsed file <https://builds.apache.org/job/Atlas-0.8-IntegrationTests/ws/graphdb/common/target/checkstyle-result.xml>
with 5682 unique warnings and 0 duplicates.
[CHECKSTYLE] Successfully parsed file <https://builds.apache.org/job/Atlas-0.8-IntegrationTests/ws/graphdb/graphdb-impls/target/checkstyle-result.xml>
with 5682 unique warnings and 0 duplicates.
[CHECKSTYLE] Successfully parsed file <https://builds.apache.org/job/Atlas-0.8-IntegrationTests/ws/graphdb/target/checkstyle-result.xml>
with 5682 unique warnings and 0 duplicates.
[CHECKSTYLE] Successfully parsed file <https://builds.apache.org/job/Atlas-0.8-IntegrationTests/ws/graphdb/titan0/target/checkstyle-result.xml>
with 8137 unique warnings and 0 duplicates.
[CHECKSTYLE] Successfully parsed file <https://builds.apache.org/job/Atlas-0.8-IntegrationTests/ws/graphdb/titan1/target/checkstyle-result.xml>
with 9104 unique warnings and 0 duplicates.
[CHECKSTYLE] Successfully parsed file <https://builds.apache.org/job/Atlas-0.8-IntegrationTests/ws/intg/target/checkstyle-result.xml>
with 15818 unique warnings and 0 duplicates.
[CHECKSTYLE] Successfully parsed file <https://builds.apache.org/job/Atlas-0.8-IntegrationTests/ws/notification/target/checkstyle-result.xml>
with 17383 unique warnings and 0 duplicates.
[CHECKSTYLE] Successfully parsed file <https://builds.apache.org/job/Atlas-0.8-IntegrationTests/ws/repository/target/checkstyle-result.xml>
with 36270 unique warnings and 0 duplicates.
[CHECKSTYLE] Successfully parsed file <https://builds.apache.org/job/Atlas-0.8-IntegrationTests/ws/server-api/target/checkstyle-result.xml>
with 36649 unique warnings and 0 duplicates.
[CHECKSTYLE] Successfully parsed file <https://builds.apache.org/job/Atlas-0.8-IntegrationTests/ws/shaded/hbase-client-shaded/target/checkstyle-result.xml>
with 36649 unique warnings and 0 duplicates.
[CHECKSTYLE] Successfully parsed file <https://builds.apache.org/job/Atlas-0.8-IntegrationTests/ws/shaded/hbase-server-shaded/target/checkstyle-result.xml>
with 36649 unique warnings and 0 duplicates.
[CHECKSTYLE] Successfully parsed file <https://builds.apache.org/job/Atlas-0.8-IntegrationTests/ws/target/checkstyle-result.xml>
with 36649 unique warnings and 0 duplicates.
[CHECKSTYLE] Successfully parsed file <https://builds.apache.org/job/Atlas-0.8-IntegrationTests/ws/typesystem/target/checkstyle-result.xml>
with 40867 unique warnings and 0 duplicates.
<Git Blamer> Using GitBlamer to create author and commit information for all warnings.
<Git Blamer> GIT_COMMIT=de592f7d13d1faaabde31b87e68ae053861f759b, workspace=<https://builds.apache.org/job/Atlas-0.8-IntegrationTests/ws/>
 > git rev-parse de592f7d13d1faaabde31b87e68ae053861f759b^{commit} # timeout=10
[FINDBUGS] Collecting findbugs analysis files...
[FINDBUGS] Searching for all files in <https://builds.apache.org/job/Atlas-0.8-IntegrationTests/ws/>
that match the pattern **/target/findbugs.xml
[FINDBUGS] Parsing 15 files in <https://builds.apache.org/job/Atlas-0.8-IntegrationTests/ws/>
[FINDBUGS] Successfully parsed file <https://builds.apache.org/job/Atlas-0.8-IntegrationTests/ws/authorization/target/findbugs.xml>
with 0 unique warnings and 0 duplicates.
[FINDBUGS] Successfully parsed file <https://builds.apache.org/job/Atlas-0.8-IntegrationTests/ws/catalog/target/findbugs.xml>
with 0 unique warnings and 0 duplicates.
[FINDBUGS] Successfully parsed file <https://builds.apache.org/job/Atlas-0.8-IntegrationTests/ws/client/client-v1/target/findbugs.xml>
with 0 unique warnings and 0 duplicates.
[FINDBUGS] Successfully parsed file <https://builds.apache.org/job/Atlas-0.8-IntegrationTests/ws/client/client-v2/target/findbugs.xml>
with 0 unique warnings and 0 duplicates.
[FINDBUGS] Successfully parsed file <https://builds.apache.org/job/Atlas-0.8-IntegrationTests/ws/client/common/target/findbugs.xml>
with 0 unique warnings and 0 duplicates.
[FINDBUGS] Successfully parsed file <https://builds.apache.org/job/Atlas-0.8-IntegrationTests/ws/common/target/findbugs.xml>
with 0 unique warnings and 0 duplicates.
[FINDBUGS] Successfully parsed file <https://builds.apache.org/job/Atlas-0.8-IntegrationTests/ws/graphdb/api/target/findbugs.xml>
with 0 unique warnings and 0 duplicates.
[FINDBUGS] Successfully parsed file <https://builds.apache.org/job/Atlas-0.8-IntegrationTests/ws/graphdb/common/target/findbugs.xml>
with 0 unique warnings and 0 duplicates.
[FINDBUGS] Successfully parsed file <https://builds.apache.org/job/Atlas-0.8-IntegrationTests/ws/graphdb/titan0/target/findbugs.xml>
with 0 unique warnings and 0 duplicates.
[FINDBUGS] Successfully parsed file <https://builds.apache.org/job/Atlas-0.8-IntegrationTests/ws/graphdb/titan1/target/findbugs.xml>
with 0 unique warnings and 0 duplicates.
[FINDBUGS] Successfully parsed file <https://builds.apache.org/job/Atlas-0.8-IntegrationTests/ws/intg/target/findbugs.xml>
with 0 unique warnings and 0 duplicates.
[FINDBUGS] Successfully parsed file <https://builds.apache.org/job/Atlas-0.8-IntegrationTests/ws/notification/target/findbugs.xml>
with 0 unique warnings and 0 duplicates.
[FINDBUGS] Successfully parsed file <https://builds.apache.org/job/Atlas-0.8-IntegrationTests/ws/repository/target/findbugs.xml>
with 0 unique warnings and 0 duplicates.
[FINDBUGS] Successfully parsed file <https://builds.apache.org/job/Atlas-0.8-IntegrationTests/ws/server-api/target/findbugs.xml>
with 0 unique warnings and 0 duplicates.
[FINDBUGS] Successfully parsed file <https://builds.apache.org/job/Atlas-0.8-IntegrationTests/ws/typesystem/target/findbugs.xml>
with 0 unique warnings and 0 duplicates.
<Git Blamer> Using GitBlamer to create author and commit information for all warnings.
<Git Blamer> GIT_COMMIT=de592f7d13d1faaabde31b87e68ae053861f759b, workspace=<https://builds.apache.org/job/Atlas-0.8-IntegrationTests/ws/>
Archiving artifacts
[Fast Archiver] No prior successful build to compare, so performing full copy of artifacts
TestNG Reports Processing: START
Looking for TestNG results report in workspace using pattern: **/target/surefire-reports/testng-results.xml,**/target/failsafe-reports/testng-results.xml
Saving reports...
Processing '/x1/jenkins/jenkins-home/jobs/Atlas-0.8-IntegrationTests/builds/114/testng/testng-results.xml'
1.503759% of tests failed, which exceeded threshold of 0%. Marking build as UNSTABLE
TestNG Reports Processing: FINISH

Mime
View raw message