atlas-dev mailing list archives

Site index · List index
Message view « Date » · « Thread »
Top « Date » · « Thread »
From Apache Jenkins Server <jenk...@builds.apache.org>
Subject Build failed in Jenkins: Atlas-master-IntegrationTests #171
Date Mon, 30 Oct 2017 20:26:07 GMT
See <https://builds.apache.org/job/Atlas-master-IntegrationTests/171/display/redirect>

------------------------------------------
[...truncated 494.15 KB...]
127.0.0.1 - - [30/Oct/2017:20:21:23 +0000] "GET /api/atlas/lineage/hive/table/sales_factDwTiKqz31j/outputs/graph
HTTP/1.1" 200 2015 "-" "Java/1.8.0_152"
127.0.0.1 - - [30/Oct/2017:20:21:25 +0000] "GET /api/atlas/entities?type=hive_table_v1&property=qualifiedName&value=sales_factDwTiKqz31j
HTTP/1.1" 200 4372 "-" "Java/1.8.0_152"
127.0.0.1 - - [30/Oct/2017:20:21:25 +0000] "GET /api/atlas/lineage/9e4a3363-399d-4aa4-ac83-c32848779bd6/outputs/graph
HTTP/1.1" 200 1944 "-" "Java/1.8.0_152"
127.0.0.1 - - [30/Oct/2017:20:21:26 +0000] "GET /api/atlas/lineage/hive/table/sales_factDwTiKqz31j/schema
HTTP/1.1" 200 2503 "-" "Java/1.8.0_152"
127.0.0.1 - - [30/Oct/2017:20:21:27 +0000] "GET /api/atlas/lineage/hive/table/SalesRQlfROBCEr/schema
HTTP/1.1" 404 62 "-" "Java/1.8.0_152"
127.0.0.1 - - [30/Oct/2017:20:21:27 +0000] "GET /api/atlas/entities?type=hive_table_v1&property=qualifiedName&value=sales_factDwTiKqz31j
HTTP/1.1" 200 4372 "-" "Java/1.8.0_152"
127.0.0.1 - - [30/Oct/2017:20:21:27 +0000] "GET /api/atlas/lineage/9e4a3363-399d-4aa4-ac83-c32848779bd6/schema
HTTP/1.1" 200 2468 "-" "Java/1.8.0_152"
127.0.0.1 - - [30/Oct/2017:20:21:28 +0000] "GET /api/atlas/lineage/hive/table/blah/schema
HTTP/1.1" 404 51 "-" "Java/1.8.0_152"
127.0.0.1 - - [30/Oct/2017:20:21:28 +0000] "GET /api/atlas/entities?type=hive_table_v1&property=qualifiedName&value=sales_fact_monthly_mvhPl7HDYTt1
HTTP/1.1" 200 4063 "-" "Java/1.8.0_152"
127.0.0.1 - - [30/Oct/2017:20:21:28 +0000] "GET /api/atlas/v2/lineage/e63d2646-d85f-4090-884b-640e345f4421?depth=5&direction=INPUT
HTTP/1.1" 200 2879 "-" "Java/1.8.0_152"
127.0.0.1 - - [30/Oct/2017:20:21:29 +0000] "GET /api/atlas/entities?type=hive_table_v1&property=qualifiedName&value=sales_fact_monthly_mvhPl7HDYTt1
HTTP/1.1" 200 4063 "-" "Java/1.8.0_152"
127.0.0.1 - - [30/Oct/2017:20:21:29 +0000] "GET /api/atlas/v2/lineage/e63d2646-d85f-4090-884b-640e345f4421?depth=5&direction=BOTH
HTTP/1.1" 200 2878 "-" "Java/1.8.0_152"
127.0.0.1 - - [30/Oct/2017:20:21:31 +0000] "GET /api/atlas/entities?type=hive_table_v1&property=qualifiedName&value=sales_factsYXY6NjGWM
HTTP/1.1" 200 4006 "-" "Java/1.8.0_152"
127.0.0.1 - - [30/Oct/2017:20:21:31 +0000] "GET /api/atlas/v2/lineage/c8ecf598-f1f3-4871-80a4-e3b7300db554?depth=5&direction=OUTPUT
HTTP/1.1" 200 2417 "-" "Java/1.8.0_152"
127.0.0.1 - - [30/Oct/2017:20:21:32 +0000] "GET /api/atlas/v2/types/typedef/name/database
HTTP/1.1" 200 794 "-" "Java/1.8.0_152"
127.0.0.1 - - [30/Oct/2017:20:21:32 +0000] "GET /api/atlas/v2/types/typedef/name/table HTTP/1.1"
404 82 "-" "Java/1.8.0_152"
127.0.0.1 - - [30/Oct/2017:20:21:32 +0000] "GET /api/atlas/v2/types/typedef/name/fetl HTTP/1.1"
404 81 "-" "Java/1.8.0_152"
127.0.0.1 - - [30/Oct/2017:20:21:32 +0000] "POST /api/atlas/v2/types/typedefs HTTP/1.1" 200
2038 "-" "Java/1.8.0_152"
127.0.0.1 - - [30/Oct/2017:20:21:33 +0000] "GET /api/atlas/v2/types/classificationdef/name/fetl
HTTP/1.1" 200 454 "-" "Java/1.8.0_152"
127.0.0.1 - - [30/Oct/2017:20:21:33 +0000] "GET /api/atlas/v2/types/entitydef/name/database
HTTP/1.1" 200 794 "-" "Java/1.8.0_152"
127.0.0.1 - - [30/Oct/2017:20:21:33 +0000] "GET /api/atlas/v2/types/entitydef/name/table HTTP/1.1"
200 1491 "-" "Java/1.8.0_152"
127.0.0.1 - - [30/Oct/2017:20:21:33 +0000] "POST /api/atlas/v2/types/typedefs HTTP/1.1" 200
535 "-" "Java/1.8.0_152"
127.0.0.1 - - [30/Oct/2017:20:21:33 +0000] "POST /api/atlas/v2/types/typedefs HTTP/1.1" 409
86 "-" "Java/1.8.0_152"
127.0.0.1 - - [30/Oct/2017:20:21:33 +0000] "GET /api/atlas/v2/types/enumdef/name/blah HTTP/1.1"
404 81 "-" "Java/1.8.0_152"
127.0.0.1 - - [30/Oct/2017:20:21:33 +0000] "GET /api/atlas/v2/types/enumdef/guid/blah HTTP/1.1"
404 82 "-" "Java/1.8.0_152"
127.0.0.1 - - [30/Oct/2017:20:21:33 +0000] "GET /api/atlas/v2/types/structdef/name/blah HTTP/1.1"
404 81 "-" "Java/1.8.0_152"
127.0.0.1 - - [30/Oct/2017:20:21:33 +0000] "GET /api/atlas/v2/types/structdef/guid/blah HTTP/1.1"
404 82 "-" "Java/1.8.0_152"
127.0.0.1 - - [30/Oct/2017:20:21:33 +0000] "GET /api/atlas/v2/types/classificationdef/name/blah
HTTP/1.1" 404 81 "-" "Java/1.8.0_152"
127.0.0.1 - - [30/Oct/2017:20:21:33 +0000] "GET /api/atlas/v2/types/classificationdef/guid/blah
HTTP/1.1" 404 82 "-" "Java/1.8.0_152"
127.0.0.1 - - [30/Oct/2017:20:21:33 +0000] "GET /api/atlas/v2/types/entitydef/name/blah HTTP/1.1"
404 81 "-" "Java/1.8.0_152"
127.0.0.1 - - [30/Oct/2017:20:21:33 +0000] "GET /api/atlas/v2/types/entitydef/guid/blah HTTP/1.1"
404 82 "-" "Java/1.8.0_152"
127.0.0.1 - - [30/Oct/2017:20:21:33 +0000] "POST /api/atlas/v2/types/typedefs HTTP/1.1" 200
1918 "-" "Java/1.8.0_152"
127.0.0.1 - - [30/Oct/2017:20:21:34 +0000] "GET /api/atlas/v2/types/typedefs?supertype=Argptf8ZGSf&type=CLASS
HTTP/1.1" 200 1026 "-" "Java/1.8.0_152"
127.0.0.1 - - [30/Oct/2017:20:21:34 +0000] "GET /api/atlas/v2/types/typedefs?supertype=Argptf8ZGSf&type=CLASS&notsupertype=Br8UohplLGs
HTTP/1.1" 200 553 "-" "Java/1.8.0_152"
127.0.0.1 - - [30/Oct/2017:20:21:34 +0000] "POST /api/atlas/v2/types/typedefs HTTP/1.1" 200
535 "-" "Java/1.8.0_152"
127.0.0.1 - - [30/Oct/2017:20:21:34 +0000] "PUT /api/atlas/v2/types/typedefs HTTP/1.1" 200
711 "-" "Java/1.8.0_152"
127.0.0.1 - - [30/Oct/2017:20:21:35 +0000] "GET /api/atlas/v2/types/typedefs?type=ENTITY HTTP/1.1"
200 70987 "-" "Java/1.8.0_152"
127.0.0.1 - - [30/Oct/2017:20:21:35 +0000] "GET /api/atlas/v2/types/classificationdef/name/fetl
HTTP/1.1" 200 454 "-" "Java/1.8.0_152"
127.0.0.1 - - [30/Oct/2017:20:21:35 +0000] "GET /api/atlas/v2/types/entitydef/name/database
HTTP/1.1" 200 794 "-" "Java/1.8.0_152"
127.0.0.1 - - [30/Oct/2017:20:21:35 +0000] "GET /api/atlas/v2/types/entitydef/name/table HTTP/1.1"
200 1491 "-" "Java/1.8.0_152"
127.0.0.1 - - [30/Oct/2017:20:21:35 +0000] "GET /api/atlas/v2/types/typedef/name/Classification
HTTP/1.1" 200 476 "-" "Java/1.8.0_152"
127.0.0.1 - - [30/Oct/2017:20:21:35 +0000] "GET /api/atlas/v2/types/typedef/name/dsl_test_type
HTTP/1.1" 200 625 "-" "Java/1.8.0_152"
127.0.0.1 - - [30/Oct/2017:20:21:35 +0000] "POST /api/atlas/types HTTP/1.1" 201 83 "-" "Java/1.8.0_152"
127.0.0.1 - - [30/Oct/2017:20:21:35 +0000] "POST /api/atlas/entities HTTP/1.1" 201 862 "-"
"Java/1.8.0_152"
127.0.0.1 - - [30/Oct/2017:20:21:35 +0000] "GET /api/atlas/v2/search/dsl?query=from+hive_db+qualifiedName%3D%22dbnHNXGXWEdT%22
HTTP/1.1" 200 359 "-" "Java/1.8.0_152"
127.0.0.1 - - [30/Oct/2017:20:21:36 +0000] "GET /api/atlas/v2/search/dsl?query=from+blah HTTP/1.1"
500 85 "-" "Java/1.8.0_152"
127.0.0.1 - - [30/Oct/2017:20:21:36 +0000] "GET /api/atlas/v2/search/dsl?query=from+hive_db+qualifiedName%3D%22dbnHNXGXWEdT%22
HTTP/1.1" 200 359 "-" "Java/1.8.0_152"
127.0.0.1 - - [30/Oct/2017:20:21:37 +0000] "GET /api/atlas/v2/search/dsl?offset=0&query=from+hive_db+qualifiedName%3D%22dbnHNXGXWEdT%22&limit=10
HTTP/1.1" 200 359 "-" "Java/1.8.0_152"
127.0.0.1 - - [30/Oct/2017:20:21:38 +0000] "GET /api/atlas/v2/search/dsl?offset=-1&query=from+hive_db+qualifiedName%3D%22dbnHNXGXWEdT%22&limit=-1
HTTP/1.1" 200 359 "-" "Java/1.8.0_152"
127.0.0.1 - - [30/Oct/2017:20:21:38 +0000] "GET /api/atlas/v2/search/dsl?offset=0&query=from+hive_db+qualifiedName%3D%22dbnHNXGXWEdT%22&limit=1
HTTP/1.1" 200 359 "-" "Java/1.8.0_152"
127.0.0.1 - - [30/Oct/2017:20:21:39 +0000] "GET /api/atlas/v2/search/dsl?offset=1&query=from+hive_db+qualifiedName%3D%22dbnHNXGXWEdT%22&limit=10
HTTP/1.1" 200 77 "-" "Java/1.8.0_152"
127.0.0.1 - - [30/Oct/2017:20:21:40 +0000] "GET /api/atlas/v2/search/dsl?offset=10&query=from+hive_db+qualifiedName%3D%22dbnHNXGXWEdT%22&limit=0
HTTP/1.1" 200 77 "-" "Java/1.8.0_152"
127.0.0.1 - - [30/Oct/2017:20:21:41 +0000] "GET /api/atlas/v2/search/dsl?offset=10&query=from+hive_db+qualifiedName%3D%22dbnHNXGXWEdT%22&limit=2147483647
HTTP/1.1" 200 77 "-" "Java/1.8.0_152"
127.0.0.1 - - [30/Oct/2017:20:21:42 +0000] "GET /api/atlas/v2/search/dsl?offset=-2&query=from+hive_db+qualifiedName%3D%22dbnHNXGXWEdT%22&limit=10
HTTP/1.1" 200 359 "-" "Java/1.8.0_152"
127.0.0.1 - - [30/Oct/2017:20:21:42 +0000] "GET /api/atlas/v2/search/fulltext?query=* HTTP/1.1"
200 29753 "-" "Java/1.8.0_152"
127.0.0.1 - - [30/Oct/2017:20:21:42 +0000] "GET /api/atlas/v2/search/dsl?query=from+hive_db+qualifiedName%3D%22dbnHNXGXWEdT%22
HTTP/1.1" 200 359 "-" "Java/1.8.0_152"
127.0.0.1 - - [30/Oct/2017:20:21:43 +0000] "GET /api/atlas/v2/search/fulltext?offset=0&query=dbnHNXGXWEdT&limit=10
HTTP/1.1" 200 378 "-" "Java/1.8.0_152"
127.0.0.1 - - [30/Oct/2017:20:21:43 +0000] "GET /api/atlas/v2/search/fulltext?query=dbnHNXGXWEdT
HTTP/1.1" 200 378 "-" "Java/1.8.0_152"
127.0.0.1 - - [30/Oct/2017:20:21:43 +0000] "GET /api/atlas/v2/search/fulltext?offset=0&query=dbnHNXGXWEdT&limit=10
HTTP/1.1" 200 378 "-" "Java/1.8.0_152"
127.0.0.1 - - [30/Oct/2017:20:21:43 +0000] "GET /api/atlas/v2/search/fulltext?offset=1&query=dbnHNXGXWEdT&limit=10
HTTP/1.1" 200 378 "-" "Java/1.8.0_152"
127.0.0.1 - - [30/Oct/2017:20:21:43 +0000] "GET /api/atlas/v2/search/fulltext?offset=0&query=dbnHNXGXWEdT&limit=1
HTTP/1.1" 200 378 "-" "Java/1.8.0_152"
127.0.0.1 - - [30/Oct/2017:20:21:43 +0000] "GET /api/atlas/v2/search/fulltext?offset=2&query=dbnHNXGXWEdT&limit=1
HTTP/1.1" 200 378 "-" "Java/1.8.0_152"
127.0.0.1 - - [30/Oct/2017:20:22:07 +0000] "GET /api/atlas/admin/status HTTP/1.1" 200 19 "-"
"Java/1.8.0_152"
127.0.0.1 - - [30/Oct/2017:20:22:07 +0000] "GET /api/atlas/v1/taxonomies HTTP/1.1" 500 85
"-" "Java/1.8.0_152"
127.0.0.1 - - [30/Oct/2017:20:22:07 +0000] "GET /api/atlas/admin/session HTTP/1.1" 200 424
"-" "Java/1.8.0_152"
127.0.0.1 - - [30/Oct/2017:20:22:07 +0000] "GET /api/atlas/admin/session HTTP/1.1" 401 349
"-" "Java/1.8.0_152"
127.0.0.1 - - [30/Oct/2017:20:22:07 +0000] "POST /api/atlas/v2/types/typedefs HTTP/1.1" 409
85 "-" "Java/1.8.0_152"
Tests run: 139, Failures: 4, Errors: 0, Skipped: 14, Time elapsed: 142.805 sec <<<
FAILURE! - in TestSuite
testSubmit(org.apache.atlas.web.integration.TypesJerseyResourceIT)  Time elapsed: 0.45 sec
 <<< FAILURE!
org.apache.atlas.AtlasServiceException: Metadata service API org.apache.atlas.AtlasClient$API_V1@35da67b8
failed with status 400 (Bad Request) Response Body ({"error":"table.database: invalid inverseRef
constraint. Inverse attribute database.database does not exist"})
	at org.apache.atlas.AtlasBaseClient.callAPIWithResource(AtlasBaseClient.java:387)
	at org.apache.atlas.AtlasBaseClient.callAPIWithResource(AtlasBaseClient.java:320)
	at org.apache.atlas.AtlasBaseClient.callAPI(AtlasBaseClient.java:208)
	at org.apache.atlas.AtlasClient.callAPIWithBody(AtlasClient.java:942)
	at org.apache.atlas.web.integration.TypesJerseyResourceIT.testSubmit(TypesJerseyResourceIT.java:84)

testDiscoveryWithSearchParameters(org.apache.atlas.web.integration.BasicSearchIT)  Time elapsed:
0.313 sec  <<< FAILURE!
java.lang.AssertionError: expected [3] but found [21]
	at org.testng.Assert.fail(Assert.java:94)
	at org.testng.Assert.failNotEquals(Assert.java:496)
	at org.testng.Assert.assertEquals(Assert.java:125)
	at org.testng.Assert.assertEquals(Assert.java:372)
	at org.testng.Assert.assertEquals(Assert.java:382)
	at org.apache.atlas.web.integration.BasicSearchIT.testDiscoveryWithSearchParameters(BasicSearchIT.java:127)

testSimpleLoginAndAuthorizationWithValidCrendentialsAndInvalidAccessToResource(org.apache.atlas.web.filters.AtlasAuthenticationSimpleFilterIT)
 Time elapsed: 0.014 sec  <<< FAILURE!
java.lang.AssertionError: expected [403] but found [500]
	at org.testng.Assert.fail(Assert.java:94)
	at org.testng.Assert.failNotEquals(Assert.java:496)
	at org.testng.Assert.assertEquals(Assert.java:125)
	at org.testng.Assert.assertEquals(Assert.java:372)
	at org.testng.Assert.assertEquals(Assert.java:382)
	at org.apache.atlas.web.filters.AtlasAuthenticationSimpleFilterIT.testSimpleLoginAndAuthorizationWithValidCrendentialsAndInvalidAccessToResource(AtlasAuthenticationSimpleFilterIT.java:74)

runQuickStart(org.apache.atlas.examples.QuickStartV2IT)  Time elapsed: 0.509 sec  <<<
FAILURE!
org.apache.atlas.AtlasServiceException: Metadata service API org.apache.atlas.AtlasClientV2$API_V2@8f452d5
failed with status 409 (Conflict) Response Body ({"errorCode":"ATLAS-409-00-001","errorMessage":"Given
type Dimension already exists"})
	at org.apache.atlas.AtlasBaseClient.callAPIWithResource(AtlasBaseClient.java:387)
	at org.apache.atlas.AtlasBaseClient.callAPIWithResource(AtlasBaseClient.java:320)
	at org.apache.atlas.AtlasBaseClient.callAPI(AtlasBaseClient.java:208)
	at org.apache.atlas.AtlasClientV2.createAtlasTypeDefs(AtlasClientV2.java:223)
	at org.apache.atlas.examples.QuickStartV2.createTypes(QuickStartV2.java:191)
	at org.apache.atlas.examples.QuickStartV2.runQuickstart(QuickStartV2.java:147)
	at org.apache.atlas.examples.QuickStartV2IT.runQuickStart(QuickStartV2IT.java:49)


Results :

Failed tests: 
  QuickStartV2IT.runQuickStart:49 » AtlasService Metadata service API org.apache...
  AtlasAuthenticationSimpleFilterIT.testSimpleLoginAndAuthorizationWithValidCrendentialsAndInvalidAccessToResource:74
expected [403] but found [500]
org.apache.atlas.web.integration.BasicSearchIT.testDiscoveryWithSearchParameters(org.apache.atlas.web.integration.BasicSearchIT)
  Run 1: BasicSearchIT.testDiscoveryWithSearchParameters:127 expected [3] but found [21]
  Run 2: PASS
  Run 3: PASS

  TypesJerseyResourceIT.testSubmit:84 » AtlasService Metadata service API org.ap...

Tests run: 137, Failures: 4, Errors: 0, Skipped: 14

[INFO] 
[INFO] --- jetty-maven-plugin:9.4.0.v20161208:stop (stop-jetty) @ atlas-webapp ---
[INFO] Waiting 10 seconds for jetty to stop
[INFO] Stopped ServerConnector@6155cb69{HTTP/1.1,[http/1.1]}{0.0.0.0:31000}
[INFO] Stopped scavenging
[INFO] Closing Spring root WebApplicationContext
[INFO] Shutting down log4j
[INFO] Stopped o.e.j.m.p.JettyWebAppContext@4d0238b0{/,file://<https://builds.apache.org/job/Atlas-master-IntegrationTests/ws/webapp/target/atlas-webapp-1.0.0-SNAPSHOT/,UNAVAILABLE}{/home/jenkins/jenkins-slave/workspace/Atlas-master-IntegrationTests/webapp/target/atlas-webapp-1.0.0-SNAPSHOT.war}>
[INFO] Server reports itself as stopped
[INFO] 
[INFO] --- maven-source-plugin:2.4:jar-no-fork (attach-sources) @ atlas-webapp ---
[INFO] Building jar: <https://builds.apache.org/job/Atlas-master-IntegrationTests/ws/webapp/target/atlas-webapp-1.0.0-SNAPSHOT-sources.jar>
[INFO] 
[INFO] --- maven-source-plugin:2.4:test-jar-no-fork (attach-sources) @ atlas-webapp ---
[INFO] Building jar: <https://builds.apache.org/job/Atlas-master-IntegrationTests/ws/webapp/target/atlas-webapp-1.0.0-SNAPSHOT-test-sources.jar>
[INFO] 
[INFO] --- maven-failsafe-plugin:2.18.1:verify (verify) @ atlas-webapp ---
[INFO] Failsafe report directory: <https://builds.apache.org/job/Atlas-master-IntegrationTests/ws/webapp/target/failsafe-reports>
[INFO] ------------------------------------------------------------------------
[INFO] Reactor Summary:
[INFO] 
[INFO] Apache Atlas Server Build Tools .................... SUCCESS [  1.185 s]
[INFO] apache-atlas ....................................... SUCCESS [  6.143 s]
[INFO] Apache Atlas Integration ........................... SUCCESS [ 23.946 s]
[INFO] Apache Atlas Common ................................ SUCCESS [  9.098 s]
[INFO] Apache Atlas Typesystem ............................ SUCCESS [ 52.327 s]
[INFO] Apache Atlas Client ................................ SUCCESS [  0.839 s]
[INFO] atlas-client-common ................................ SUCCESS [  7.656 s]
[INFO] atlas-client-v1 .................................... SUCCESS [  7.728 s]
[INFO] Apache Atlas Server API ............................ SUCCESS [  6.498 s]
[INFO] Apache Atlas Notification .......................... SUCCESS [ 11.859 s]
[INFO] atlas-client-v2 .................................... SUCCESS [  6.488 s]
[INFO] Apache Atlas Graph Database Projects ............... SUCCESS [  0.607 s]
[INFO] Apache Atlas Graph Database API .................... SUCCESS [  5.579 s]
[INFO] Graph Database Common Code ......................... SUCCESS [  5.642 s]
[INFO] Shaded version of Apache hbase client .............. SUCCESS [  9.710 s]
[INFO] Apache Atlas Titan 0.5.4 Graph DB Impl ............. SUCCESS [ 46.495 s]
[INFO] Apache Atlas Graph Database Implementation Dependencies SUCCESS [  0.713 s]
[INFO] Shaded version of Apache hbase server .............. SUCCESS [ 23.843 s]
[INFO] Apache Atlas Repository ............................ SUCCESS [01:28 min]
[INFO] Apache Atlas Authorization ......................... SUCCESS [  7.180 s]
[INFO] Apache Atlas UI .................................... SUCCESS [01:41 min]
[INFO] Apache Atlas Web Application ....................... FAILURE [04:09 min]
[INFO] Apache Atlas Documentation ......................... SKIPPED
[INFO] Apache Atlas FileSystem Model ...................... SKIPPED
[INFO] Apache Atlas Plugin Classloader .................... SKIPPED
[INFO] Apache Atlas Hive Bridge Shim ...................... SKIPPED
[INFO] Apache Atlas Hive Bridge ........................... SKIPPED
[INFO] Apache Atlas Falcon Bridge Shim .................... SKIPPED
[INFO] Apache Atlas Falcon Bridge ......................... SKIPPED
[INFO] Apache Atlas Sqoop Bridge Shim ..................... SKIPPED
[INFO] Apache Atlas Sqoop Bridge .......................... SKIPPED
[INFO] Apache Atlas Storm Bridge Shim ..................... SKIPPED
[INFO] Apache Atlas Storm Bridge .......................... SKIPPED
[INFO] Apache Atlas Hbase Bridge Shim ..................... SKIPPED
[INFO] Apache Atlas Hbase Bridge .......................... SKIPPED
[INFO] Apache Atlas Distribution .......................... SKIPPED
[INFO] ------------------------------------------------------------------------
[INFO] BUILD FAILURE
[INFO] ------------------------------------------------------------------------
[INFO] Total time: 11:14 min
[INFO] Finished at: 2017-10-30T20:22:17Z
[INFO] Final Memory: 360M/2740M
[INFO] ------------------------------------------------------------------------
[ERROR] Failed to execute goal org.apache.maven.plugins:maven-failsafe-plugin:2.18.1:verify
(verify) on project atlas-webapp: There are test failures.
[ERROR] 
[ERROR] Please refer to <https://builds.apache.org/job/Atlas-master-IntegrationTests/ws/webapp/target/failsafe-reports>
for the individual test results.
[ERROR] -> [Help 1]
[ERROR] 
[ERROR] To see the full stack trace of the errors, re-run Maven with the -e switch.
[ERROR] Re-run Maven using the -X switch to enable full debug logging.
[ERROR] 
[ERROR] For more information about the errors and possible solutions, please read the following
articles:
[ERROR] [Help 1] http://cwiki.apache.org/confluence/display/MAVEN/MojoFailureException
[ERROR] 
[ERROR] After correcting the problems, you can resume the build with the command
[ERROR]   mvn <goals> -rf :atlas-webapp
Build step 'Execute shell' marked build as failure
[CHECKSTYLE] Collecting checkstyle analysis files...
[CHECKSTYLE] Searching for all files in <https://builds.apache.org/job/Atlas-master-IntegrationTests/ws/>
that match the pattern **/target/checkstyle-result.xml
[CHECKSTYLE] Parsing 20 files in <https://builds.apache.org/job/Atlas-master-IntegrationTests/ws/>
[CHECKSTYLE] Successfully parsed file <https://builds.apache.org/job/Atlas-master-IntegrationTests/ws/authorization/target/checkstyle-result.xml>
with 461 unique warnings and 0 duplicates.
[CHECKSTYLE] Successfully parsed file <https://builds.apache.org/job/Atlas-master-IntegrationTests/ws/client/client-v1/target/checkstyle-result.xml>
with 1336 unique warnings and 0 duplicates.
[CHECKSTYLE] Successfully parsed file <https://builds.apache.org/job/Atlas-master-IntegrationTests/ws/client/client-v2/target/checkstyle-result.xml>
with 1676 unique warnings and 0 duplicates.
[CHECKSTYLE] Successfully parsed file <https://builds.apache.org/job/Atlas-master-IntegrationTests/ws/client/common/target/checkstyle-result.xml>
with 2166 unique warnings and 0 duplicates.
[CHECKSTYLE] Successfully parsed file <https://builds.apache.org/job/Atlas-master-IntegrationTests/ws/client/target/checkstyle-result.xml>
with 2166 unique warnings and 0 duplicates.
[CHECKSTYLE] Successfully parsed file <https://builds.apache.org/job/Atlas-master-IntegrationTests/ws/common/target/checkstyle-result.xml>
with 3131 unique warnings and 0 duplicates.
[CHECKSTYLE] Successfully parsed file <https://builds.apache.org/job/Atlas-master-IntegrationTests/ws/dashboardv2/target/checkstyle-result.xml>
with 3131 unique warnings and 0 duplicates.
[CHECKSTYLE] Successfully parsed file <https://builds.apache.org/job/Atlas-master-IntegrationTests/ws/graphdb/api/target/checkstyle-result.xml>
with 3404 unique warnings and 0 duplicates.
[CHECKSTYLE] Successfully parsed file <https://builds.apache.org/job/Atlas-master-IntegrationTests/ws/graphdb/common/target/checkstyle-result.xml>
with 3597 unique warnings and 0 duplicates.
[CHECKSTYLE] Successfully parsed file <https://builds.apache.org/job/Atlas-master-IntegrationTests/ws/graphdb/graphdb-impls/target/checkstyle-result.xml>
with 3597 unique warnings and 0 duplicates.
[CHECKSTYLE] Successfully parsed file <https://builds.apache.org/job/Atlas-master-IntegrationTests/ws/graphdb/target/checkstyle-result.xml>
with 3597 unique warnings and 0 duplicates.
[CHECKSTYLE] Successfully parsed file <https://builds.apache.org/job/Atlas-master-IntegrationTests/ws/graphdb/titan0/target/checkstyle-result.xml>
with 6056 unique warnings and 0 duplicates.
[CHECKSTYLE] Successfully parsed file <https://builds.apache.org/job/Atlas-master-IntegrationTests/ws/intg/target/checkstyle-result.xml>
with 14262 unique warnings and 0 duplicates.
[CHECKSTYLE] Successfully parsed file <https://builds.apache.org/job/Atlas-master-IntegrationTests/ws/notification/target/checkstyle-result.xml>
with 15827 unique warnings and 0 duplicates.
[CHECKSTYLE] Successfully parsed file <https://builds.apache.org/job/Atlas-master-IntegrationTests/ws/repository/target/checkstyle-result.xml>
with 36163 unique warnings and 0 duplicates.
[CHECKSTYLE] Successfully parsed file <https://builds.apache.org/job/Atlas-master-IntegrationTests/ws/server-api/target/checkstyle-result.xml>
with 36556 unique warnings and 0 duplicates.
[CHECKSTYLE] Successfully parsed file <https://builds.apache.org/job/Atlas-master-IntegrationTests/ws/shaded/hbase-client-shaded/target/checkstyle-result.xml>
with 36556 unique warnings and 0 duplicates.
[CHECKSTYLE] Successfully parsed file <https://builds.apache.org/job/Atlas-master-IntegrationTests/ws/shaded/hbase-server-shaded/target/checkstyle-result.xml>
with 36556 unique warnings and 0 duplicates.
[CHECKSTYLE] Successfully parsed file <https://builds.apache.org/job/Atlas-master-IntegrationTests/ws/target/checkstyle-result.xml>
with 36556 unique warnings and 0 duplicates.
[CHECKSTYLE] Successfully parsed file <https://builds.apache.org/job/Atlas-master-IntegrationTests/ws/typesystem/target/checkstyle-result.xml>
with 40774 unique warnings and 0 duplicates.
<Git Blamer> Using GitBlamer to create author and commit information for all warnings.
<Git Blamer> GIT_COMMIT=1e01c01afc8281e5b3f2abacd590c546e169a753, workspace=<https://builds.apache.org/job/Atlas-master-IntegrationTests/ws/>
 > git rev-parse 1e01c01afc8281e5b3f2abacd590c546e169a753^{commit} # timeout=10
[FINDBUGS] Collecting findbugs analysis files...
[FINDBUGS] Searching for all files in <https://builds.apache.org/job/Atlas-master-IntegrationTests/ws/>
that match the pattern **/target/findbugs.xml
[FINDBUGS] Parsing 13 files in <https://builds.apache.org/job/Atlas-master-IntegrationTests/ws/>
[FINDBUGS] Successfully parsed file <https://builds.apache.org/job/Atlas-master-IntegrationTests/ws/authorization/target/findbugs.xml>
with 0 unique warnings and 0 duplicates.
[FINDBUGS] Successfully parsed file <https://builds.apache.org/job/Atlas-master-IntegrationTests/ws/client/client-v1/target/findbugs.xml>
with 0 unique warnings and 0 duplicates.
[FINDBUGS] Successfully parsed file <https://builds.apache.org/job/Atlas-master-IntegrationTests/ws/client/client-v2/target/findbugs.xml>
with 0 unique warnings and 0 duplicates.
[FINDBUGS] Successfully parsed file <https://builds.apache.org/job/Atlas-master-IntegrationTests/ws/client/common/target/findbugs.xml>
with 0 unique warnings and 0 duplicates.
[FINDBUGS] Successfully parsed file <https://builds.apache.org/job/Atlas-master-IntegrationTests/ws/common/target/findbugs.xml>
with 0 unique warnings and 0 duplicates.
[FINDBUGS] Successfully parsed file <https://builds.apache.org/job/Atlas-master-IntegrationTests/ws/graphdb/api/target/findbugs.xml>
with 0 unique warnings and 0 duplicates.
[FINDBUGS] Successfully parsed file <https://builds.apache.org/job/Atlas-master-IntegrationTests/ws/graphdb/common/target/findbugs.xml>
with 0 unique warnings and 0 duplicates.
[FINDBUGS] Successfully parsed file <https://builds.apache.org/job/Atlas-master-IntegrationTests/ws/graphdb/titan0/target/findbugs.xml>
with 0 unique warnings and 0 duplicates.
[FINDBUGS] Successfully parsed file <https://builds.apache.org/job/Atlas-master-IntegrationTests/ws/intg/target/findbugs.xml>
with 0 unique warnings and 0 duplicates.
[FINDBUGS] Successfully parsed file <https://builds.apache.org/job/Atlas-master-IntegrationTests/ws/notification/target/findbugs.xml>
with 0 unique warnings and 0 duplicates.
[FINDBUGS] Successfully parsed file <https://builds.apache.org/job/Atlas-master-IntegrationTests/ws/repository/target/findbugs.xml>
with 0 unique warnings and 0 duplicates.
[FINDBUGS] Successfully parsed file <https://builds.apache.org/job/Atlas-master-IntegrationTests/ws/server-api/target/findbugs.xml>
with 0 unique warnings and 0 duplicates.
[FINDBUGS] Successfully parsed file <https://builds.apache.org/job/Atlas-master-IntegrationTests/ws/typesystem/target/findbugs.xml>
with 0 unique warnings and 0 duplicates.
<Git Blamer> Using GitBlamer to create author and commit information for all warnings.
<Git Blamer> GIT_COMMIT=1e01c01afc8281e5b3f2abacd590c546e169a753, workspace=<https://builds.apache.org/job/Atlas-master-IntegrationTests/ws/>
Archiving artifacts
[Fast Archiver] No prior successful build to compare, so performing full copy of artifacts
TestNG Reports Processing: START
Looking for TestNG results report in workspace using pattern: **/target/surefire-reports/testng-results.xml,**/target/failsafe-reports/testng-results.xml
Saving reports...
Processing '/x1/jenkins/jenkins-home/jobs/Atlas-master-IntegrationTests/builds/171/testng/testng-results.xml'
2.205882% of tests failed, which exceeded threshold of 0%. Marking build as UNSTABLE
TestNG Reports Processing: FINISH

Mime
View raw message