atlas-dev mailing list archives

Site index · List index
Message view « Date » · « Thread »
Top « Date » · « Thread »
From Apache Jenkins Server <jenk...@builds.apache.org>
Subject Build failed in Jenkins: Atlas-master-IntegrationTests #166
Date Thu, 26 Oct 2017 16:48:49 GMT
See <https://builds.apache.org/job/Atlas-master-IntegrationTests/166/display/redirect?page=changes>

Changes:

[madhan] ATLAS-2227: UI fix to allow "." in float/double values for tag

------------------------------------------
[...truncated 466.11 KB...]
127.0.0.1 - - [26/Oct/2017:16:42:39 +0000] "GET /api/atlas/v2/types/typedef/name/hive_table_v1
HTTP/1.1" 200 1993 "-" "Java/1.8.0_144"
127.0.0.1 - - [26/Oct/2017:16:42:39 +0000] "GET /api/atlas/v2/types/typedef/name/hive_process_v1
HTTP/1.1" 200 1506 "-" "Java/1.8.0_144"
127.0.0.1 - - [26/Oct/2017:16:42:39 +0000] "POST /api/atlas/types HTTP/1.1" 201 190 "-" "Java/1.8.0_144"
127.0.0.1 - - [26/Oct/2017:16:42:39 +0000] "GET /api/atlas/v2/types/typedef/name/Fact HTTP/1.1"
404 81 "-" "Java/1.8.0_144"
127.0.0.1 - - [26/Oct/2017:16:42:39 +0000] "GET /api/atlas/v2/types/typedef/name/ETL HTTP/1.1"
404 80 "-" "Java/1.8.0_144"
127.0.0.1 - - [26/Oct/2017:16:42:39 +0000] "GET /api/atlas/v2/types/typedef/name/Dimension
HTTP/1.1" 404 86 "-" "Java/1.8.0_144"
127.0.0.1 - - [26/Oct/2017:16:42:39 +0000] "GET /api/atlas/v2/types/typedef/name/Metric HTTP/1.1"
404 83 "-" "Java/1.8.0_144"
127.0.0.1 - - [26/Oct/2017:16:42:39 +0000] "POST /api/atlas/types HTTP/1.1" 201 150 "-" "Java/1.8.0_144"
127.0.0.1 - - [26/Oct/2017:16:42:39 +0000] "POST /api/atlas/entities HTTP/1.1" 201 866 "-"
"Java/1.8.0_144"
127.0.0.1 - - [26/Oct/2017:16:42:40 +0000] "POST /api/atlas/entities HTTP/1.1" 201 1330 "-"
"Java/1.8.0_144"
127.0.0.1 - - [26/Oct/2017:16:42:40 +0000] "POST /api/atlas/entities HTTP/1.1" 201 1104 "-"
"Java/1.8.0_144"
127.0.0.1 - - [26/Oct/2017:16:42:40 +0000] "POST /api/atlas/entities HTTP/1.1" 201 877 "-"
"Java/1.8.0_144"
127.0.0.1 - - [26/Oct/2017:16:42:40 +0000] "POST /api/atlas/entities HTTP/1.1" 201 1330 "-"
"Java/1.8.0_144"
127.0.0.1 - - [26/Oct/2017:16:42:40 +0000] "POST /api/atlas/entities HTTP/1.1" 201 1752 "-"
"Java/1.8.0_144"
127.0.0.1 - - [26/Oct/2017:16:42:40 +0000] "POST /api/atlas/entities HTTP/1.1" 201 1330 "-"
"Java/1.8.0_144"
127.0.0.1 - - [26/Oct/2017:16:42:40 +0000] "POST /api/atlas/entities HTTP/1.1" 201 1548 "-"
"Java/1.8.0_144"
127.0.0.1 - - [26/Oct/2017:16:42:40 +0000] "GET /api/atlas/lineage/hive/table/sales_fact_monthly_mvgOK9HogTrj/inputs/graph
HTTP/1.1" 200 2516 "-" "Java/1.8.0_144"
127.0.0.1 - - [26/Oct/2017:16:42:42 +0000] "GET /api/atlas/entities?type=hive_table_v1&property=qualifiedName&value=sales_fact_monthly_mvgOK9HogTrj
HTTP/1.1" 200 4433 "-" "Java/1.8.0_144"
127.0.0.1 - - [26/Oct/2017:16:42:42 +0000] "GET /api/atlas/lineage/79cffc69-448d-48a0-adee-8c72f9e8215c/inputs/graph
HTTP/1.1" 200 2422 "-" "Java/1.8.0_144"
127.0.0.1 - - [26/Oct/2017:16:42:43 +0000] "GET /api/atlas/lineage/hive/table/sales_factZQiSfyjHUO/outputs/graph
HTTP/1.1" 200 2009 "-" "Java/1.8.0_144"
127.0.0.1 - - [26/Oct/2017:16:42:45 +0000] "GET /api/atlas/entities?type=hive_table_v1&property=qualifiedName&value=sales_factZQiSfyjHUO
HTTP/1.1" 200 4370 "-" "Java/1.8.0_144"
127.0.0.1 - - [26/Oct/2017:16:42:45 +0000] "GET /api/atlas/lineage/b3146ea2-af9a-4e2d-8776-fb0584325386/outputs/graph
HTTP/1.1" 200 1938 "-" "Java/1.8.0_144"
127.0.0.1 - - [26/Oct/2017:16:42:46 +0000] "GET /api/atlas/lineage/hive/table/sales_factZQiSfyjHUO/schema
HTTP/1.1" 200 2501 "-" "Java/1.8.0_144"
127.0.0.1 - - [26/Oct/2017:16:42:47 +0000] "GET /api/atlas/lineage/hive/table/SalesVPYsPwlzuT/schema
HTTP/1.1" 404 62 "-" "Java/1.8.0_144"
127.0.0.1 - - [26/Oct/2017:16:42:47 +0000] "GET /api/atlas/entities?type=hive_table_v1&property=qualifiedName&value=sales_factZQiSfyjHUO
HTTP/1.1" 200 4370 "-" "Java/1.8.0_144"
127.0.0.1 - - [26/Oct/2017:16:42:47 +0000] "GET /api/atlas/lineage/b3146ea2-af9a-4e2d-8776-fb0584325386/schema
HTTP/1.1" 200 2466 "-" "Java/1.8.0_144"
127.0.0.1 - - [26/Oct/2017:16:42:47 +0000] "GET /api/atlas/lineage/hive/table/blah/schema
HTTP/1.1" 404 51 "-" "Java/1.8.0_144"
127.0.0.1 - - [26/Oct/2017:16:42:48 +0000] "POST /api/atlas/v2/types/typedefs HTTP/1.1" 409
85 "-" "Java/1.8.0_144"
127.0.0.1 - - [26/Oct/2017:16:42:48 +0000] "POST /api/atlas/admin/import HTTP/1.1" 200 10429
"-" "Java/1.8.0_144"
127.0.0.1 - - [26/Oct/2017:16:42:56 +0000] "GET /api/atlas/v2/types/typedef/name/fooTag HTTP/1.1"
404 83 "-" "Java/1.8.0_144"
127.0.0.1 - - [26/Oct/2017:16:42:56 +0000] "POST /api/atlas/v2/types/typedefs HTTP/1.1" 200
387 "-" "Java/1.8.0_144"
127.0.0.1 - - [26/Oct/2017:16:42:56 +0000] "GET /api/atlas/v2/entity/uniqueAttribute/type/hdfs_path?attr:qualifiedName=test%241test%2B%2B-%2B%26%26%2B%7C%7C%2B%21%2B%28%2B%29%2B%7B%2B%7D%2B%5B%2B%5D%2B%5E%2B%3C%2B%3E%2B%3B%2B%3A%2B%22%2B%25%2B*%2B%60%2B%7E
HTTP/1.1" 404 176 "-" "Java/1.8.0_144"
127.0.0.1 - - [26/Oct/2017:16:42:56 +0000] "POST /api/atlas/v2/entity HTTP/1.1" 200 273 "-"
"Java/1.8.0_144"
127.0.0.1 - - [26/Oct/2017:16:43:01 +0000] "POST /api/atlas/v2/search/basic HTTP/1.1" 200
1133 "-" "Java/1.8.0_144"
127.0.0.1 - - [26/Oct/2017:16:43:02 +0000] "POST /api/atlas/v2/search/basic HTTP/1.1" 200
824 "-" "Java/1.8.0_144"
127.0.0.1 - - [26/Oct/2017:16:43:02 +0000] "POST /api/atlas/v2/search/basic HTTP/1.1" 200
565 "-" "Java/1.8.0_144"
127.0.0.1 - - [26/Oct/2017:16:43:02 +0000] "POST /api/atlas/v2/search/basic HTTP/1.1" 200
1135 "-" "Java/1.8.0_144"
127.0.0.1 - - [26/Oct/2017:16:43:02 +0000] "POST /api/atlas/v2/search/basic HTTP/1.1" 200
1182 "-" "Java/1.8.0_144"
127.0.0.1 - - [26/Oct/2017:16:43:02 +0000] "POST /api/atlas/v2/search/basic HTTP/1.1" 200
1182 "-" "Java/1.8.0_144"
127.0.0.1 - - [26/Oct/2017:16:43:02 +0000] "POST /api/atlas/v2/search/basic HTTP/1.1" 200
1130 "-" "Java/1.8.0_144"
127.0.0.1 - - [26/Oct/2017:16:43:02 +0000] "POST /api/atlas/v2/search/basic HTTP/1.1" 200
561 "-" "Java/1.8.0_144"
127.0.0.1 - - [26/Oct/2017:16:43:02 +0000] "POST /api/atlas/v2/search/basic HTTP/1.1" 200
5158 "-" "Java/1.8.0_144"
127.0.0.1 - - [26/Oct/2017:16:43:02 +0000] "POST /api/atlas/v2/search/basic HTTP/1.1" 200
1137 "-" "Java/1.8.0_144"
127.0.0.1 - - [26/Oct/2017:16:43:02 +0000] "POST /api/atlas/v2/search/basic HTTP/1.1" 200
1234 "-" "Java/1.8.0_144"
127.0.0.1 - - [26/Oct/2017:16:43:02 +0000] "POST /api/atlas/v2/search/basic HTTP/1.1" 200
564 "-" "Java/1.8.0_144"
127.0.0.1 - - [26/Oct/2017:16:43:02 +0000] "POST /api/atlas/v2/search/basic HTTP/1.1" 200
631 "-" "Java/1.8.0_144"
127.0.0.1 - - [26/Oct/2017:16:43:02 +0000] "POST /api/atlas/v2/search/basic HTTP/1.1" 200
188 "-" "Java/1.8.0_144"
127.0.0.1 - - [26/Oct/2017:16:43:02 +0000] "POST /api/atlas/v2/search/basic HTTP/1.1" 200
1835 "-" "Java/1.8.0_144"
127.0.0.1 - - [26/Oct/2017:16:43:02 +0000] "POST /api/atlas/v2/search/basic HTTP/1.1" 200
675 "-" "Java/1.8.0_144"
127.0.0.1 - - [26/Oct/2017:16:43:02 +0000] "POST /api/atlas/v2/search/basic HTTP/1.1" 200
1025 "-" "Java/1.8.0_144"
127.0.0.1 - - [26/Oct/2017:16:43:02 +0000] "POST /api/atlas/v2/search/basic HTTP/1.1" 200
768 "-" "Java/1.8.0_144"
127.0.0.1 - - [26/Oct/2017:16:43:02 +0000] "GET /api/atlas/v2/types/typedef/name/tableType
HTTP/1.1" 200 317 "-" "Java/1.8.0_144"
127.0.0.1 - - [26/Oct/2017:16:43:02 +0000] "GET /api/atlas/v2/types/typedef/name/serdeType
HTTP/1.1" 200 597 "-" "Java/1.8.0_144"
127.0.0.1 - - [26/Oct/2017:16:43:02 +0000] "GET /api/atlas/v2/types/typedef/name/classification
HTTP/1.1" 200 476 "-" "Java/1.8.0_144"
127.0.0.1 - - [26/Oct/2017:16:43:02 +0000] "GET /api/atlas/v2/types/typedef/name/pii HTTP/1.1"
200 286 "-" "Java/1.8.0_144"
127.0.0.1 - - [26/Oct/2017:16:43:02 +0000] "GET /api/atlas/v2/types/typedef/name/phi HTTP/1.1"
200 286 "-" "Java/1.8.0_144"
127.0.0.1 - - [26/Oct/2017:16:43:02 +0000] "GET /api/atlas/v2/types/typedef/name/pci HTTP/1.1"
200 286 "-" "Java/1.8.0_144"
127.0.0.1 - - [26/Oct/2017:16:43:02 +0000] "GET /api/atlas/v2/types/typedef/name/sox HTTP/1.1"
200 286 "-" "Java/1.8.0_144"
127.0.0.1 - - [26/Oct/2017:16:43:02 +0000] "GET /api/atlas/v2/types/typedef/name/sec HTTP/1.1"
200 286 "-" "Java/1.8.0_144"
127.0.0.1 - - [26/Oct/2017:16:43:02 +0000] "GET /api/atlas/v2/types/typedef/name/finance HTTP/1.1"
200 294 "-" "Java/1.8.0_144"
127.0.0.1 - - [26/Oct/2017:16:43:02 +0000] "GET /api/atlas/v2/types/typedef/name/FactAVYdnXp6Uq
HTTP/1.1" 404 91 "-" "Java/1.8.0_144"
127.0.0.1 - - [26/Oct/2017:16:43:02 +0000] "GET /api/atlas/v2/types/typedef/name/ETLeceSotUhKN
HTTP/1.1" 404 90 "-" "Java/1.8.0_144"
127.0.0.1 - - [26/Oct/2017:16:43:02 +0000] "GET /api/atlas/v2/types/typedef/name/DimensionC7cnnc7uyK
HTTP/1.1" 404 96 "-" "Java/1.8.0_144"
127.0.0.1 - - [26/Oct/2017:16:43:02 +0000] "GET /api/atlas/v2/types/typedef/name/MetricW2G1B3YHTt
HTTP/1.1" 404 93 "-" "Java/1.8.0_144"
127.0.0.1 - - [26/Oct/2017:16:43:02 +0000] "GET /api/atlas/v2/types/typedef/name/hive_db_v1
HTTP/1.1" 200 1388 "-" "Java/1.8.0_144"
127.0.0.1 - - [26/Oct/2017:16:43:02 +0000] "GET /api/atlas/v2/types/typedef/name/hive_column_v1
HTTP/1.1" 200 796 "-" "Java/1.8.0_144"
127.0.0.1 - - [26/Oct/2017:16:43:02 +0000] "GET /api/atlas/v2/types/typedef/name/hive_table_v1
HTTP/1.1" 200 1993 "-" "Java/1.8.0_144"
127.0.0.1 - - [26/Oct/2017:16:43:02 +0000] "GET /api/atlas/v2/types/typedef/name/hive_process_v1
HTTP/1.1" 200 1506 "-" "Java/1.8.0_144"
127.0.0.1 - - [26/Oct/2017:16:43:02 +0000] "POST /api/atlas/types HTTP/1.1" 201 190 "-" "Java/1.8.0_144"
127.0.0.1 - - [26/Oct/2017:16:43:03 +0000] "GET /api/atlas/v2/types/typedef/name/Classification
HTTP/1.1" 404 91 "-" "Java/1.8.0_144"
127.0.0.1 - - [26/Oct/2017:16:43:03 +0000] "GET /api/atlas/v2/types/typedef/name/dsl_test_type
HTTP/1.1" 404 90 "-" "Java/1.8.0_144"
127.0.0.1 - - [26/Oct/2017:16:43:03 +0000] "POST /api/atlas/types HTTP/1.1" 201 131 "-" "Java/1.8.0_144"
127.0.0.1 - - [26/Oct/2017:16:43:03 +0000] "POST /api/atlas/entities HTTP/1.1" 201 806 "-"
"Java/1.8.0_144"
127.0.0.1 - - [26/Oct/2017:16:43:03 +0000] "GET /api/atlas/discovery/search/dsl?query=from+hive_db_v1+name%3D%22dbqzlWVeQbbq%22
HTTP/1.1" 200 1869 "-" "Java/1.8.0_144"
127.0.0.1 - - [26/Oct/2017:16:43:03 +0000] "GET /api/atlas/discovery/search/dsl?query=from+blah
HTTP/1.1" 400 42 "-" "Java/1.8.0_144"
127.0.0.1 - - [26/Oct/2017:16:43:03 +0000] "GET /api/atlas/discovery/search/dsl?query=from+hive_db_v1+name%3D%22dbqzlWVeQbbq%22
HTTP/1.1" 200 1869 "-" "Java/1.8.0_144"
127.0.0.1 - - [26/Oct/2017:16:43:04 +0000] "GET /api/atlas/discovery/search/dsl?query=from+hive_db_v1+name%3D%22dbqzlWVeQbbq%22&limit=10&offset=0
HTTP/1.1" 200 1869 "-" "Java/1.8.0_144"
127.0.0.1 - - [26/Oct/2017:16:43:05 +0000] "GET /api/atlas/discovery/search/dsl?query=from+hive_db_v1+name%3D%22dbqzlWVeQbbq%22&limit=-1&offset=-1
HTTP/1.1" 200 1869 "-" "Java/1.8.0_144"
127.0.0.1 - - [26/Oct/2017:16:43:05 +0000] "GET /api/atlas/discovery/search/dsl?query=from+hive_db_v1+name%3D%22dbqzlWVeQbbq%22&limit=1&offset=0
HTTP/1.1" 200 1869 "-" "Java/1.8.0_144"
127.0.0.1 - - [26/Oct/2017:16:43:06 +0000] "GET /api/atlas/discovery/search/dsl?query=from+hive_db_v1+name%3D%22dbqzlWVeQbbq%22&limit=10&offset=1
HTTP/1.1" 200 1467 "-" "Java/1.8.0_144"
127.0.0.1 - - [26/Oct/2017:16:43:07 +0000] "GET /api/atlas/discovery/search/dsl?query=from+hive_db_v1+name%3D%22dbqzlWVeQbbq%22&limit=0&offset=10
HTTP/1.1" 400 48 "-" "Java/1.8.0_144"
127.0.0.1 - - [26/Oct/2017:16:43:07 +0000] "GET /api/atlas/discovery/search/dsl?query=from+hive_db_v1+name%3D%22dbqzlWVeQbbq%22&limit=2147483647&offset=10
HTTP/1.1" 400 62 "-" "Java/1.8.0_144"
127.0.0.1 - - [26/Oct/2017:16:43:07 +0000] "GET /api/atlas/discovery/search/dsl?query=from+hive_db_v1+name%3D%22dbqzlWVeQbbq%22&limit=10&offset=-2
HTTP/1.1" 400 51 "-" "Java/1.8.0_144"
127.0.0.1 - - [26/Oct/2017:16:43:07 +0000] "GET /api/atlas/discovery/search?query=* HTTP/1.1"
200 8462 "-" "Java/1.8.0_144"
127.0.0.1 - - [26/Oct/2017:16:43:07 +0000] "GET /api/atlas/discovery/search?query=from+hive_db_v1+name%3D%22dbqzlWVeQbbq%22
HTTP/1.1" 200 1869 "-" "Java/1.8.0_144"
127.0.0.1 - - [26/Oct/2017:16:43:08 +0000] "GET /api/atlas/discovery/search/gremlin?query=g.V.has('type',+'hive_table_v1').toList()
HTTP/1.1" 200 167 "-" "Java/1.8.0_144"
Tests run: 146, Failures: 2, Errors: 0, Skipped: 105, Time elapsed: 51.964 sec <<<
FAILURE! - in TestSuite
testSimpleLoginAndAuthorizationWithValidCrendentialsAndInvalidAccessToResource(org.apache.atlas.web.filters.AtlasAuthenticationSimpleFilterIT)
 Time elapsed: 0.016 sec  <<< FAILURE!
java.lang.AssertionError: expected [403] but found [500]
	at org.testng.Assert.fail(Assert.java:94)
	at org.testng.Assert.failNotEquals(Assert.java:496)
	at org.testng.Assert.assertEquals(Assert.java:125)
	at org.testng.Assert.assertEquals(Assert.java:372)
	at org.testng.Assert.assertEquals(Assert.java:382)
	at org.apache.atlas.web.filters.AtlasAuthenticationSimpleFilterIT.testSimpleLoginAndAuthorizationWithValidCrendentialsAndInvalidAccessToResource(AtlasAuthenticationSimpleFilterIT.java:74)

runQuickStart(org.apache.atlas.examples.QuickStartV2IT)  Time elapsed: 0.578 sec  <<<
FAILURE!
org.apache.atlas.AtlasServiceException: Metadata service API org.apache.atlas.AtlasClientV2$API_V2@72c5590f
failed with status 409 (Conflict) Response Body ({"errorCode":"ATLAS-409-00-001","errorMessage":"Given
type Dimension already exists"})
	at org.apache.atlas.AtlasBaseClient.callAPIWithResource(AtlasBaseClient.java:387)
	at org.apache.atlas.AtlasBaseClient.callAPIWithResource(AtlasBaseClient.java:320)
	at org.apache.atlas.AtlasBaseClient.callAPI(AtlasBaseClient.java:208)
	at org.apache.atlas.AtlasClientV2.createAtlasTypeDefs(AtlasClientV2.java:223)
	at org.apache.atlas.examples.QuickStartV2.createTypes(QuickStartV2.java:191)
	at org.apache.atlas.examples.QuickStartV2.runQuickstart(QuickStartV2.java:147)
	at org.apache.atlas.examples.QuickStartV2IT.runQuickStart(QuickStartV2IT.java:49)


Results :

Failed tests: 
  QuickStartV2IT.runQuickStart:49 » AtlasService Metadata service API org.apache...
  AtlasAuthenticationSimpleFilterIT.testSimpleLoginAndAuthorizationWithValidCrendentialsAndInvalidAccessToResource:74
expected [403] but found [500]

Tests run: 145, Failures: 2, Errors: 0, Skipped: 104

[INFO] 
[INFO] --- jetty-maven-plugin:9.4.0.v20161208:stop (stop-jetty) @ atlas-webapp ---
[INFO] Waiting 10 seconds for jetty to stop
[INFO] Stopped ServerConnector@7d6e5aa3{HTTP/1.1,[http/1.1]}{0.0.0.0:31000}
[INFO] Stopped scavenging
[INFO] Closing Spring root WebApplicationContext
[INFO] Shutting down log4j
[INFO] Stopped o.e.j.m.p.JettyWebAppContext@41f99a83{/,file://<https://builds.apache.org/job/Atlas-master-IntegrationTests/ws/webapp/target/atlas-webapp-1.0.0-SNAPSHOT/,UNAVAILABLE}{/home/jenkins/jenkins-slave/workspace/Atlas-master-IntegrationTests/webapp/target/atlas-webapp-1.0.0-SNAPSHOT.war}>
[INFO] Server reports itself as stopped
[INFO] 
[INFO] --- maven-source-plugin:2.4:jar-no-fork (attach-sources) @ atlas-webapp ---
[INFO] Building jar: <https://builds.apache.org/job/Atlas-master-IntegrationTests/ws/webapp/target/atlas-webapp-1.0.0-SNAPSHOT-sources.jar>
[INFO] 
[INFO] --- maven-source-plugin:2.4:test-jar-no-fork (attach-sources) @ atlas-webapp ---
[INFO] Building jar: <https://builds.apache.org/job/Atlas-master-IntegrationTests/ws/webapp/target/atlas-webapp-1.0.0-SNAPSHOT-test-sources.jar>
[INFO] 
[INFO] --- maven-failsafe-plugin:2.18.1:verify (verify) @ atlas-webapp ---
[INFO] Failsafe report directory: <https://builds.apache.org/job/Atlas-master-IntegrationTests/ws/webapp/target/failsafe-reports>
[INFO] ------------------------------------------------------------------------
[INFO] Reactor Summary:
[INFO] 
[INFO] Apache Atlas Server Build Tools .................... SUCCESS [  0.609 s]
[INFO] apache-atlas ....................................... SUCCESS [  3.426 s]
[INFO] Apache Atlas Integration ........................... SUCCESS [ 17.170 s]
[INFO] Apache Atlas Common ................................ SUCCESS [  6.762 s]
[INFO] Apache Atlas Typesystem ............................ SUCCESS [ 41.178 s]
[INFO] Apache Atlas Client ................................ SUCCESS [  0.527 s]
[INFO] atlas-client-common ................................ SUCCESS [  5.955 s]
[INFO] atlas-client-v1 .................................... SUCCESS [  6.186 s]
[INFO] Apache Atlas Server API ............................ SUCCESS [  5.384 s]
[INFO] Apache Atlas Notification .......................... SUCCESS [  8.595 s]
[INFO] atlas-client-v2 .................................... SUCCESS [  5.122 s]
[INFO] Apache Atlas Graph Database Projects ............... SUCCESS [  0.400 s]
[INFO] Apache Atlas Graph Database API .................... SUCCESS [  4.602 s]
[INFO] Graph Database Common Code ......................... SUCCESS [  4.646 s]
[INFO] Apache Atlas Titan 1.0.0 GraphDB Impl .............. SUCCESS [ 35.690 s]
[INFO] Shaded version of Apache hbase client .............. SUCCESS [  7.889 s]
[INFO] Apache Atlas Titan 0.5.4 Graph DB Impl ............. SUCCESS [ 34.610 s]
[INFO] Apache Atlas Graph Database Implementation Dependencies SUCCESS [  0.616 s]
[INFO] Shaded version of Apache hbase server .............. SUCCESS [ 20.269 s]
[INFO] Apache Atlas Repository ............................ SUCCESS [01:11 min]
[INFO] Apache Atlas Authorization ......................... SUCCESS [  6.007 s]
[INFO] Apache Atlas UI .................................... SUCCESS [01:24 min]
[INFO] Apache Atlas Web Application ....................... FAILURE [02:00 min]
[INFO] Apache Atlas Documentation ......................... SKIPPED
[INFO] Apache Atlas FileSystem Model ...................... SKIPPED
[INFO] Apache Atlas Plugin Classloader .................... SKIPPED
[INFO] Apache Atlas Hive Bridge Shim ...................... SKIPPED
[INFO] Apache Atlas Hive Bridge ........................... SKIPPED
[INFO] Apache Atlas Falcon Bridge Shim .................... SKIPPED
[INFO] Apache Atlas Falcon Bridge ......................... SKIPPED
[INFO] Apache Atlas Sqoop Bridge Shim ..................... SKIPPED
[INFO] Apache Atlas Sqoop Bridge .......................... SKIPPED
[INFO] Apache Atlas Storm Bridge Shim ..................... SKIPPED
[INFO] Apache Atlas Storm Bridge .......................... SKIPPED
[INFO] Apache Atlas Hbase Bridge Shim ..................... SKIPPED
[INFO] Apache Atlas Hbase Bridge .......................... SKIPPED
[INFO] Apache Atlas Distribution .......................... SKIPPED
[INFO] ------------------------------------------------------------------------
[INFO] BUILD FAILURE
[INFO] ------------------------------------------------------------------------
[INFO] Total time: 08:13 min
[INFO] Finished at: 2017-10-26T16:43:13Z
[INFO] Final Memory: 357M/3208M
[INFO] ------------------------------------------------------------------------
[ERROR] Failed to execute goal org.apache.maven.plugins:maven-failsafe-plugin:2.18.1:verify
(verify) on project atlas-webapp: There are test failures.
[ERROR] 
[ERROR] Please refer to <https://builds.apache.org/job/Atlas-master-IntegrationTests/ws/webapp/target/failsafe-reports>
for the individual test results.
[ERROR] -> [Help 1]
[ERROR] 
[ERROR] To see the full stack trace of the errors, re-run Maven with the -e switch.
[ERROR] Re-run Maven using the -X switch to enable full debug logging.
[ERROR] 
[ERROR] For more information about the errors and possible solutions, please read the following
articles:
[ERROR] [Help 1] http://cwiki.apache.org/confluence/display/MAVEN/MojoFailureException
[ERROR] 
[ERROR] After correcting the problems, you can resume the build with the command
[ERROR]   mvn <goals> -rf :atlas-webapp
Build step 'Execute shell' marked build as failure
[CHECKSTYLE] Collecting checkstyle analysis files...
[CHECKSTYLE] Searching for all files in <https://builds.apache.org/job/Atlas-master-IntegrationTests/ws/>
that match the pattern **/target/checkstyle-result.xml
[CHECKSTYLE] Parsing 21 files in <https://builds.apache.org/job/Atlas-master-IntegrationTests/ws/>
[CHECKSTYLE] Successfully parsed file <https://builds.apache.org/job/Atlas-master-IntegrationTests/ws/authorization/target/checkstyle-result.xml>
with 461 unique warnings and 0 duplicates.
[CHECKSTYLE] Successfully parsed file <https://builds.apache.org/job/Atlas-master-IntegrationTests/ws/client/client-v1/target/checkstyle-result.xml>
with 1336 unique warnings and 0 duplicates.
[CHECKSTYLE] Successfully parsed file <https://builds.apache.org/job/Atlas-master-IntegrationTests/ws/client/client-v2/target/checkstyle-result.xml>
with 1676 unique warnings and 0 duplicates.
[CHECKSTYLE] Successfully parsed file <https://builds.apache.org/job/Atlas-master-IntegrationTests/ws/client/common/target/checkstyle-result.xml>
with 2166 unique warnings and 0 duplicates.
[CHECKSTYLE] Successfully parsed file <https://builds.apache.org/job/Atlas-master-IntegrationTests/ws/client/target/checkstyle-result.xml>
with 2166 unique warnings and 0 duplicates.
[CHECKSTYLE] Successfully parsed file <https://builds.apache.org/job/Atlas-master-IntegrationTests/ws/common/target/checkstyle-result.xml>
with 3131 unique warnings and 0 duplicates.
[CHECKSTYLE] Successfully parsed file <https://builds.apache.org/job/Atlas-master-IntegrationTests/ws/dashboardv2/target/checkstyle-result.xml>
with 3131 unique warnings and 0 duplicates.
[CHECKSTYLE] Successfully parsed file <https://builds.apache.org/job/Atlas-master-IntegrationTests/ws/graphdb/api/target/checkstyle-result.xml>
with 3404 unique warnings and 0 duplicates.
[CHECKSTYLE] Successfully parsed file <https://builds.apache.org/job/Atlas-master-IntegrationTests/ws/graphdb/common/target/checkstyle-result.xml>
with 3591 unique warnings and 0 duplicates.
[CHECKSTYLE] Successfully parsed file <https://builds.apache.org/job/Atlas-master-IntegrationTests/ws/graphdb/graphdb-impls/target/checkstyle-result.xml>
with 3591 unique warnings and 0 duplicates.
[CHECKSTYLE] Successfully parsed file <https://builds.apache.org/job/Atlas-master-IntegrationTests/ws/graphdb/target/checkstyle-result.xml>
with 3591 unique warnings and 0 duplicates.
[CHECKSTYLE] Successfully parsed file <https://builds.apache.org/job/Atlas-master-IntegrationTests/ws/graphdb/titan0/target/checkstyle-result.xml>
with 6046 unique warnings and 0 duplicates.
[CHECKSTYLE] Successfully parsed file <https://builds.apache.org/job/Atlas-master-IntegrationTests/ws/graphdb/titan1/target/checkstyle-result.xml>
with 7013 unique warnings and 0 duplicates.
[CHECKSTYLE] Successfully parsed file <https://builds.apache.org/job/Atlas-master-IntegrationTests/ws/intg/target/checkstyle-result.xml>
with 15219 unique warnings and 0 duplicates.
[CHECKSTYLE] Successfully parsed file <https://builds.apache.org/job/Atlas-master-IntegrationTests/ws/notification/target/checkstyle-result.xml>
with 16784 unique warnings and 0 duplicates.
[CHECKSTYLE] Successfully parsed file <https://builds.apache.org/job/Atlas-master-IntegrationTests/ws/repository/target/checkstyle-result.xml>
with 37098 unique warnings and 0 duplicates.
[CHECKSTYLE] Successfully parsed file <https://builds.apache.org/job/Atlas-master-IntegrationTests/ws/server-api/target/checkstyle-result.xml>
with 37491 unique warnings and 0 duplicates.
[CHECKSTYLE] Successfully parsed file <https://builds.apache.org/job/Atlas-master-IntegrationTests/ws/shaded/hbase-client-shaded/target/checkstyle-result.xml>
with 37491 unique warnings and 0 duplicates.
[CHECKSTYLE] Successfully parsed file <https://builds.apache.org/job/Atlas-master-IntegrationTests/ws/shaded/hbase-server-shaded/target/checkstyle-result.xml>
with 37491 unique warnings and 0 duplicates.
[CHECKSTYLE] Successfully parsed file <https://builds.apache.org/job/Atlas-master-IntegrationTests/ws/target/checkstyle-result.xml>
with 37491 unique warnings and 0 duplicates.
[CHECKSTYLE] Successfully parsed file <https://builds.apache.org/job/Atlas-master-IntegrationTests/ws/typesystem/target/checkstyle-result.xml>
with 41709 unique warnings and 0 duplicates.
<Git Blamer> Using GitBlamer to create author and commit information for all warnings.
<Git Blamer> GIT_COMMIT=5d1868bbfac1fb9abbd6436dcb68d5f75e2cfeeb, workspace=<https://builds.apache.org/job/Atlas-master-IntegrationTests/ws/>
 > git rev-parse 5d1868bbfac1fb9abbd6436dcb68d5f75e2cfeeb^{commit} # timeout=10
<Git Blamer> Skipping file <https://builds.apache.org/job/Atlas-master-IntegrationTests/ws/typesystem/src/main/java/org/apache/atlas/typesystem/IStruct.java,>
no result found.
[FINDBUGS] Collecting findbugs analysis files...
[FINDBUGS] Searching for all files in <https://builds.apache.org/job/Atlas-master-IntegrationTests/ws/>
that match the pattern **/target/findbugs.xml
[FINDBUGS] Parsing 14 files in <https://builds.apache.org/job/Atlas-master-IntegrationTests/ws/>
[FINDBUGS] Successfully parsed file <https://builds.apache.org/job/Atlas-master-IntegrationTests/ws/authorization/target/findbugs.xml>
with 0 unique warnings and 0 duplicates.
[FINDBUGS] Successfully parsed file <https://builds.apache.org/job/Atlas-master-IntegrationTests/ws/client/client-v1/target/findbugs.xml>
with 0 unique warnings and 0 duplicates.
[FINDBUGS] Successfully parsed file <https://builds.apache.org/job/Atlas-master-IntegrationTests/ws/client/client-v2/target/findbugs.xml>
with 0 unique warnings and 0 duplicates.
[FINDBUGS] Successfully parsed file <https://builds.apache.org/job/Atlas-master-IntegrationTests/ws/client/common/target/findbugs.xml>
with 0 unique warnings and 0 duplicates.
[FINDBUGS] Successfully parsed file <https://builds.apache.org/job/Atlas-master-IntegrationTests/ws/common/target/findbugs.xml>
with 0 unique warnings and 0 duplicates.
[FINDBUGS] Successfully parsed file <https://builds.apache.org/job/Atlas-master-IntegrationTests/ws/graphdb/api/target/findbugs.xml>
with 0 unique warnings and 0 duplicates.
[FINDBUGS] Successfully parsed file <https://builds.apache.org/job/Atlas-master-IntegrationTests/ws/graphdb/common/target/findbugs.xml>
with 0 unique warnings and 0 duplicates.
[FINDBUGS] Successfully parsed file <https://builds.apache.org/job/Atlas-master-IntegrationTests/ws/graphdb/titan0/target/findbugs.xml>
with 0 unique warnings and 0 duplicates.
[FINDBUGS] Successfully parsed file <https://builds.apache.org/job/Atlas-master-IntegrationTests/ws/graphdb/titan1/target/findbugs.xml>
with 0 unique warnings and 0 duplicates.
[FINDBUGS] Successfully parsed file <https://builds.apache.org/job/Atlas-master-IntegrationTests/ws/intg/target/findbugs.xml>
with 0 unique warnings and 0 duplicates.
[FINDBUGS] Successfully parsed file <https://builds.apache.org/job/Atlas-master-IntegrationTests/ws/notification/target/findbugs.xml>
with 0 unique warnings and 0 duplicates.
[FINDBUGS] Successfully parsed file <https://builds.apache.org/job/Atlas-master-IntegrationTests/ws/repository/target/findbugs.xml>
with 0 unique warnings and 0 duplicates.
[FINDBUGS] Successfully parsed file <https://builds.apache.org/job/Atlas-master-IntegrationTests/ws/server-api/target/findbugs.xml>
with 0 unique warnings and 0 duplicates.
[FINDBUGS] Successfully parsed file <https://builds.apache.org/job/Atlas-master-IntegrationTests/ws/typesystem/target/findbugs.xml>
with 0 unique warnings and 0 duplicates.
<Git Blamer> Using GitBlamer to create author and commit information for all warnings.
<Git Blamer> GIT_COMMIT=5d1868bbfac1fb9abbd6436dcb68d5f75e2cfeeb, workspace=<https://builds.apache.org/job/Atlas-master-IntegrationTests/ws/>
Archiving artifacts
[Fast Archiver] No prior successful build to compare, so performing full copy of artifacts
TestNG Reports Processing: START
Looking for TestNG results report in workspace using pattern: **/target/surefire-reports/testng-results.xml,**/target/failsafe-reports/testng-results.xml
Saving reports...
Processing '/x1/jenkins/jenkins-home/jobs/Atlas-master-IntegrationTests/builds/166/testng/testng-results.xml'
0.735294% of tests failed, which exceeded threshold of 0%. Marking build as UNSTABLE
TestNG Reports Processing: FINISH

Mime
View raw message