atlas-dev mailing list archives

Site index · List index
Message view « Date » · « Thread »
Top « Date » · « Thread »
From Apache Jenkins Server <jenk...@builds.apache.org>
Subject Build failed in Jenkins: Atlas-0.8-UnitTests #99
Date Wed, 04 Oct 2017 13:02:49 GMT
See <https://builds.apache.org/job/Atlas-0.8-UnitTests/99/display/redirect?page=changes>

Changes:

[kbhatt] ATLAS-2188 : UI can trim whitespaces at the beginning or end of search

------------------------------------------
[...truncated 509.52 KB...]
Java HotSpot(TM) 64-Bit Server VM warning: ignoring option MaxPermSize=512m; support was removed
in 8.0
Running org.apache.atlas.web.adapters.TestEntityREST$5
Tests run: 0, Failures: 0, Errors: 0, Skipped: 0, Time elapsed: 0.255 sec - in org.apache.atlas.web.adapters.TestEntityREST$5
Java HotSpot(TM) 64-Bit Server VM warning: ignoring option MaxPermSize=512m; support was removed
in 8.0
Running org.apache.atlas.web.adapters.TestEntitiesREST
Tests run: 4, Failures: 0, Errors: 0, Skipped: 0, Time elapsed: 16.014 sec - in org.apache.atlas.web.adapters.TestEntitiesREST
Java HotSpot(TM) 64-Bit Server VM warning: ignoring option MaxPermSize=512m; support was removed
in 8.0
Running org.apache.atlas.web.adapters.TestEntityREST$2
Tests run: 0, Failures: 0, Errors: 0, Skipped: 0, Time elapsed: 0.258 sec - in org.apache.atlas.web.adapters.TestEntityREST$2
Java HotSpot(TM) 64-Bit Server VM warning: ignoring option MaxPermSize=512m; support was removed
in 8.0
Running org.apache.atlas.web.adapters.TestEntityREST
Tests run: 8, Failures: 0, Errors: 0, Skipped: 0, Time elapsed: 16.763 sec - in org.apache.atlas.web.adapters.TestEntityREST
Java HotSpot(TM) 64-Bit Server VM warning: ignoring option MaxPermSize=512m; support was removed
in 8.0
Running org.apache.atlas.web.adapters.TestEntityREST$6
Tests run: 0, Failures: 0, Errors: 0, Skipped: 0, Time elapsed: 0.247 sec - in org.apache.atlas.web.adapters.TestEntityREST$6
Java HotSpot(TM) 64-Bit Server VM warning: ignoring option MaxPermSize=512m; support was removed
in 8.0
Running org.apache.atlas.web.adapters.TestEntitiesREST$1
Tests run: 0, Failures: 0, Errors: 0, Skipped: 0, Time elapsed: 0.244 sec - in org.apache.atlas.web.adapters.TestEntitiesREST$1
Java HotSpot(TM) 64-Bit Server VM warning: ignoring option MaxPermSize=512m; support was removed
in 8.0
Running org.apache.atlas.web.adapters.TestEntitiesREST$3
Tests run: 0, Failures: 0, Errors: 0, Skipped: 0, Time elapsed: 0.259 sec - in org.apache.atlas.web.adapters.TestEntitiesREST$3
Java HotSpot(TM) 64-Bit Server VM warning: ignoring option MaxPermSize=512m; support was removed
in 8.0
Running org.apache.atlas.web.adapters.TestEntityREST$1
Tests run: 0, Failures: 0, Errors: 0, Skipped: 0, Time elapsed: 0.268 sec - in org.apache.atlas.web.adapters.TestEntityREST$1
Java HotSpot(TM) 64-Bit Server VM warning: ignoring option MaxPermSize=512m; support was removed
in 8.0
Running org.apache.atlas.web.adapters.TestEntityREST$3
Tests run: 0, Failures: 0, Errors: 0, Skipped: 0, Time elapsed: 0.255 sec - in org.apache.atlas.web.adapters.TestEntityREST$3
Java HotSpot(TM) 64-Bit Server VM warning: ignoring option MaxPermSize=512m; support was removed
in 8.0
Running org.apache.atlas.web.adapters.TestEntitiesREST$2
Tests run: 0, Failures: 0, Errors: 0, Skipped: 0, Time elapsed: 0.267 sec - in org.apache.atlas.web.adapters.TestEntitiesREST$2
Java HotSpot(TM) 64-Bit Server VM warning: ignoring option MaxPermSize=512m; support was removed
in 8.0
Running org.apache.atlas.web.adapters.TestEntityREST$4
Tests run: 0, Failures: 0, Errors: 0, Skipped: 0, Time elapsed: 0.239 sec - in org.apache.atlas.web.adapters.TestEntityREST$4
Java HotSpot(TM) 64-Bit Server VM warning: ignoring option MaxPermSize=512m; support was removed
in 8.0
Running org.apache.atlas.web.adapters.TestEntityREST$7
Tests run: 0, Failures: 0, Errors: 0, Skipped: 0, Time elapsed: 0.27 sec - in org.apache.atlas.web.adapters.TestEntityREST$7
Java HotSpot(TM) 64-Bit Server VM warning: ignoring option MaxPermSize=512m; support was removed
in 8.0
Running org.apache.atlas.web.filters.ActiveServerFilterTest
Tests run: 11, Failures: 0, Errors: 0, Skipped: 0, Time elapsed: 0.911 sec - in org.apache.atlas.web.filters.ActiveServerFilterTest
Java HotSpot(TM) 64-Bit Server VM warning: ignoring option MaxPermSize=512m; support was removed
in 8.0
Running org.apache.atlas.web.filters.AuditFilterTest
Tests run: 6, Failures: 0, Errors: 0, Skipped: 0, Time elapsed: 1.149 sec - in org.apache.atlas.web.filters.AuditFilterTest
Java HotSpot(TM) 64-Bit Server VM warning: ignoring option MaxPermSize=512m; support was removed
in 8.0
Running org.apache.atlas.web.filters.AtlasAuthenticationKerberosFilterTest
Tests run: 0, Failures: 0, Errors: 0, Skipped: 0, Time elapsed: 0.3 sec - in org.apache.atlas.web.filters.AtlasAuthenticationKerberosFilterTest
Java HotSpot(TM) 64-Bit Server VM warning: ignoring option MaxPermSize=512m; support was removed
in 8.0
Running org.apache.atlas.web.filters.AtlasCSRFPreventionFilterTest
Tests run: 6, Failures: 0, Errors: 0, Skipped: 0, Time elapsed: 1.162 sec - in org.apache.atlas.web.filters.AtlasCSRFPreventionFilterTest
Java HotSpot(TM) 64-Bit Server VM warning: ignoring option MaxPermSize=512m; support was removed
in 8.0
Running org.apache.atlas.web.TestUtils
Tests run: 0, Failures: 0, Errors: 0, Skipped: 0, Time elapsed: 0.232 sec - in org.apache.atlas.web.TestUtils
Java HotSpot(TM) 64-Bit Server VM warning: ignoring option MaxPermSize=512m; support was removed
in 8.0
Running org.apache.atlas.web.service.SecureEmbeddedServerTest
Tests run: 4, Failures: 1, Errors: 0, Skipped: 0, Time elapsed: 34.504 sec <<< FAILURE!
- in org.apache.atlas.web.service.SecureEmbeddedServerTest
testServerConfiguredUsingCredentialProvider(org.apache.atlas.web.service.SecureEmbeddedServerTest)
 Time elapsed: 22.077 sec  <<< FAILURE!
java.lang.AssertionError: War deploy failed
	at java.lang.ClassLoader.checkCerts(ClassLoader.java:898)
	at java.lang.ClassLoader.preDefineClass(ClassLoader.java:668)
	at java.lang.ClassLoader.defineClass(ClassLoader.java:761)
	at java.security.SecureClassLoader.defineClass(SecureClassLoader.java:142)
	at java.net.URLClassLoader.defineClass(URLClassLoader.java:467)
	at java.net.URLClassLoader.access$100(URLClassLoader.java:73)
	at java.net.URLClassLoader$1.run(URLClassLoader.java:368)
	at java.net.URLClassLoader$1.run(URLClassLoader.java:362)
	at java.security.AccessController.doPrivileged(Native Method)
	at java.net.URLClassLoader.findClass(URLClassLoader.java:361)
	at java.lang.ClassLoader.loadClass(ClassLoader.java:424)
	at sun.misc.Launcher$AppClassLoader.loadClass(Launcher.java:335)
	at java.lang.ClassLoader.loadClass(ClassLoader.java:357)
	at org.apache.jasper.compiler.JspRuntimeContext.<clinit>(JspRuntimeContext.java:123)
	at org.apache.jasper.servlet.JspServlet.init(JspServlet.java:159)
	at org.eclipse.jetty.servlet.ServletHolder.initServlet(ServletHolder.java:532)
	at org.eclipse.jetty.servlet.ServletHolder.doStart(ServletHolder.java:344)
	at org.eclipse.jetty.util.component.AbstractLifeCycle.start(AbstractLifeCycle.java:64)
	at org.eclipse.jetty.servlet.ServletHandler.initialize(ServletHandler.java:793)
	at org.eclipse.jetty.servlet.ServletContextHandler.startContext(ServletContextHandler.java:265)
	at org.eclipse.jetty.webapp.WebAppContext.startContext(WebAppContext.java:1242)
	at org.eclipse.jetty.server.handler.ContextHandler.doStart(ContextHandler.java:717)
	at org.eclipse.jetty.webapp.WebAppContext.doStart(WebAppContext.java:494)
	at org.eclipse.jetty.util.component.AbstractLifeCycle.start(AbstractLifeCycle.java:64)
	at org.eclipse.jetty.server.handler.HandlerWrapper.doStart(HandlerWrapper.java:95)
	at org.eclipse.jetty.server.Server.doStart(Server.java:282)
	at org.eclipse.jetty.util.component.AbstractLifeCycle.start(AbstractLifeCycle.java:64)
	at org.apache.atlas.web.service.SecureEmbeddedServerTest.testServerConfiguredUsingCredentialProvider(SecureEmbeddedServerTest.java:68)

Java HotSpot(TM) 64-Bit Server VM warning: ignoring option MaxPermSize=512m; support was removed
in 8.0
Running org.apache.atlas.web.service.ActiveInstanceStateTest
Tests run: 5, Failures: 0, Errors: 0, Skipped: 0, Time elapsed: 0.864 sec - in org.apache.atlas.web.service.ActiveInstanceStateTest
Java HotSpot(TM) 64-Bit Server VM warning: ignoring option MaxPermSize=512m; support was removed
in 8.0
Running org.apache.atlas.web.service.ServiceStateTest
Tests run: 3, Failures: 0, Errors: 0, Skipped: 0, Time elapsed: 0.767 sec - in org.apache.atlas.web.service.ServiceStateTest
Java HotSpot(TM) 64-Bit Server VM warning: ignoring option MaxPermSize=512m; support was removed
in 8.0
Running org.apache.atlas.web.service.ActiveInstanceElectorServiceTest
Tests run: 14, Failures: 0, Errors: 0, Skipped: 0, Time elapsed: 1.143 sec - in org.apache.atlas.web.service.ActiveInstanceElectorServiceTest
Java HotSpot(TM) 64-Bit Server VM warning: ignoring option MaxPermSize=512m; support was removed
in 8.0
Running org.apache.atlas.web.service.AtlasZookeeperSecurityPropertiesTest
Tests run: 6, Failures: 0, Errors: 0, Skipped: 0, Time elapsed: 0.376 sec - in org.apache.atlas.web.service.AtlasZookeeperSecurityPropertiesTest
Java HotSpot(TM) 64-Bit Server VM warning: ignoring option MaxPermSize=512m; support was removed
in 8.0
Running org.apache.atlas.web.service.CuratorFactoryTest
Tests run: 3, Failures: 0, Errors: 0, Skipped: 0, Time elapsed: 1.128 sec - in org.apache.atlas.web.service.CuratorFactoryTest
Java HotSpot(TM) 64-Bit Server VM warning: ignoring option MaxPermSize=512m; support was removed
in 8.0
Running org.apache.atlas.notification.NotificationHookConsumerTest
Tests run: 12, Failures: 0, Errors: 0, Skipped: 0, Time elapsed: 7.259 sec - in org.apache.atlas.notification.NotificationHookConsumerTest
Java HotSpot(TM) 64-Bit Server VM warning: ignoring option MaxPermSize=512m; support was removed
in 8.0
Running org.apache.atlas.notification.NotificationEntityChangeListenerTest
Tests run: 1, Failures: 0, Errors: 0, Skipped: 0, Time elapsed: 0.787 sec - in org.apache.atlas.notification.NotificationEntityChangeListenerTest
Java HotSpot(TM) 64-Bit Server VM warning: ignoring option MaxPermSize=512m; support was removed
in 8.0
Running org.apache.atlas.notification.NotificationHookConsumerKafkaTest
Tests run: 2, Failures: 0, Errors: 0, Skipped: 0, Time elapsed: 9.265 sec - in org.apache.atlas.notification.NotificationHookConsumerKafkaTest
Java HotSpot(TM) 64-Bit Server VM warning: ignoring option MaxPermSize=512m; support was removed
in 8.0
Running org.apache.atlas.notification.AdaptiveWaiterTest
Tests run: 3, Failures: 0, Errors: 0, Skipped: 0, Time elapsed: 4.85 sec - in org.apache.atlas.notification.AdaptiveWaiterTest

Results :

Failed tests: 
  NegativeSSLAndKerberosTest.setUp:114 » ExceptionInInitializer
  SSLAndKerberosTest.setUp:139 » ExceptionInInitializer
  SSLTest.setUp:95 » ExceptionInInitializer
  SecureEmbeddedServerTest.testServerConfiguredUsingCredentialProvider:78 War deploy failed

Tests run: 127, Failures: 4, Errors: 0, Skipped: 6

[INFO] ------------------------------------------------------------------------
[INFO] Reactor Summary:
[INFO] 
[INFO] Apache Atlas Server Build Tools .................... SUCCESS [  0.731 s]
[INFO] apache-atlas ....................................... SUCCESS [  4.203 s]
[INFO] Apache Atlas Integration ........................... SUCCESS [ 31.724 s]
[INFO] Apache Atlas Common ................................ SUCCESS [ 12.391 s]
[INFO] Apache Atlas Typesystem ............................ SUCCESS [01:12 min]
[INFO] Apache Atlas Client ................................ SUCCESS [  0.866 s]
[INFO] atlas-client-common ................................ SUCCESS [  9.045 s]
[INFO] atlas-client-v1 .................................... SUCCESS [ 12.280 s]
[INFO] Apache Atlas Server API ............................ SUCCESS [  7.642 s]
[INFO] Apache Atlas Notification .......................... SUCCESS [ 21.976 s]
[INFO] atlas-client-v2 .................................... SUCCESS [  6.278 s]
[INFO] Apache Atlas Graph Database Projects ............... SUCCESS [  0.485 s]
[INFO] Apache Atlas Graph Database API .................... SUCCESS [  5.464 s]
[INFO] Graph Database Common Code ......................... SUCCESS [  5.760 s]
[INFO] Apache Atlas Titan 1.0.0 GraphDB Impl .............. SUCCESS [ 37.645 s]
[INFO] Shaded version of Apache hbase client .............. SUCCESS [  8.448 s]
[INFO] Apache Atlas Titan 0.5.4 Graph DB Impl ............. SUCCESS [01:27 min]
[INFO] Apache Atlas Graph Database Implementation Dependencies SUCCESS [  0.791 s]
[INFO] Shaded version of Apache hbase server .............. SUCCESS [ 26.933 s]
[INFO] Apache Atlas Repository ............................ SUCCESS [08:53 min]
[INFO] Apache Atlas Authorization ......................... SUCCESS [ 10.495 s]
[INFO] Apache Atlas Business Catalog ...................... SUCCESS [ 15.047 s]
[INFO] Apache Atlas UI .................................... SUCCESS [01:36 min]
[INFO] Apache Atlas Web Application ....................... FAILURE [04:38 min]
[INFO] Apache Atlas Documentation ......................... SKIPPED
[INFO] Apache Atlas FileSystem Model ...................... SKIPPED
[INFO] Apache Atlas Plugin Classloader .................... SKIPPED
[INFO] Apache Atlas Hive Bridge Shim ...................... SKIPPED
[INFO] Apache Atlas Hive Bridge ........................... SKIPPED
[INFO] Apache Atlas Falcon Bridge Shim .................... SKIPPED
[INFO] Apache Atlas Falcon Bridge ......................... SKIPPED
[INFO] Apache Atlas Sqoop Bridge Shim ..................... SKIPPED
[INFO] Apache Atlas Sqoop Bridge .......................... SKIPPED
[INFO] Apache Atlas Storm Bridge Shim ..................... SKIPPED
[INFO] Apache Atlas Storm Bridge .......................... SKIPPED
[INFO] Apache Atlas Distribution .......................... SKIPPED
[INFO] ------------------------------------------------------------------------
[INFO] BUILD FAILURE
[INFO] ------------------------------------------------------------------------
[INFO] Total time: 21:28 min
[INFO] Finished at: 2017-10-04T12:55:46Z
[INFO] Final Memory: 176M/2375M
[INFO] ------------------------------------------------------------------------
[ERROR] Failed to execute goal org.apache.maven.plugins:maven-surefire-plugin:2.18.1:test
(default-test) on project atlas-webapp: There are test failures.
[ERROR] 
[ERROR] Please refer to <https://builds.apache.org/job/Atlas-0.8-UnitTests/ws/webapp/target/surefire-reports>
for the individual test results.
[ERROR] -> [Help 1]
[ERROR] 
[ERROR] To see the full stack trace of the errors, re-run Maven with the -e switch.
[ERROR] Re-run Maven using the -X switch to enable full debug logging.
[ERROR] 
[ERROR] For more information about the errors and possible solutions, please read the following
articles:
[ERROR] [Help 1] http://cwiki.apache.org/confluence/display/MAVEN/MojoFailureException
[ERROR] 
[ERROR] After correcting the problems, you can resume the build with the command
[ERROR]   mvn <goals> -rf :atlas-webapp
Build step 'Execute shell' marked build as failure
[CHECKSTYLE] Collecting checkstyle analysis files...
[CHECKSTYLE] Searching for all files in <https://builds.apache.org/job/Atlas-0.8-UnitTests/ws/>
that match the pattern **/target/checkstyle-result.xml
[CHECKSTYLE] Parsing 22 files in <https://builds.apache.org/job/Atlas-0.8-UnitTests/ws/>
[CHECKSTYLE] Successfully parsed file <https://builds.apache.org/job/Atlas-0.8-UnitTests/ws/authorization/target/checkstyle-result.xml>
with 467 unique warnings and 0 duplicates.
[CHECKSTYLE] Successfully parsed file <https://builds.apache.org/job/Atlas-0.8-UnitTests/ws/catalog/target/checkstyle-result.xml>
with 2604 unique warnings and 0 duplicates.
[CHECKSTYLE] Successfully parsed file <https://builds.apache.org/job/Atlas-0.8-UnitTests/ws/client/client-v1/target/checkstyle-result.xml>
with 3478 unique warnings and 0 duplicates.
[CHECKSTYLE] Successfully parsed file <https://builds.apache.org/job/Atlas-0.8-UnitTests/ws/client/client-v2/target/checkstyle-result.xml>
with 3803 unique warnings and 0 duplicates.
[CHECKSTYLE] Successfully parsed file <https://builds.apache.org/job/Atlas-0.8-UnitTests/ws/client/common/target/checkstyle-result.xml>
with 4263 unique warnings and 0 duplicates.
[CHECKSTYLE] Successfully parsed file <https://builds.apache.org/job/Atlas-0.8-UnitTests/ws/client/target/checkstyle-result.xml>
with 4263 unique warnings and 0 duplicates.
[CHECKSTYLE] Successfully parsed file <https://builds.apache.org/job/Atlas-0.8-UnitTests/ws/common/target/checkstyle-result.xml>
with 5218 unique warnings and 0 duplicates.
[CHECKSTYLE] Successfully parsed file <https://builds.apache.org/job/Atlas-0.8-UnitTests/ws/dashboardv2/target/checkstyle-result.xml>
with 5218 unique warnings and 0 duplicates.
[CHECKSTYLE] Successfully parsed file <https://builds.apache.org/job/Atlas-0.8-UnitTests/ws/graphdb/api/target/checkstyle-result.xml>
with 5491 unique warnings and 0 duplicates.
[CHECKSTYLE] Successfully parsed file <https://builds.apache.org/job/Atlas-0.8-UnitTests/ws/graphdb/common/target/checkstyle-result.xml>
with 5678 unique warnings and 0 duplicates.
[CHECKSTYLE] Successfully parsed file <https://builds.apache.org/job/Atlas-0.8-UnitTests/ws/graphdb/graphdb-impls/target/checkstyle-result.xml>
with 5678 unique warnings and 0 duplicates.
[CHECKSTYLE] Successfully parsed file <https://builds.apache.org/job/Atlas-0.8-UnitTests/ws/graphdb/target/checkstyle-result.xml>
with 5678 unique warnings and 0 duplicates.
[CHECKSTYLE] Successfully parsed file <https://builds.apache.org/job/Atlas-0.8-UnitTests/ws/graphdb/titan0/target/checkstyle-result.xml>
with 8080 unique warnings and 0 duplicates.
[CHECKSTYLE] Successfully parsed file <https://builds.apache.org/job/Atlas-0.8-UnitTests/ws/graphdb/titan1/target/checkstyle-result.xml>
with 9047 unique warnings and 0 duplicates.
[CHECKSTYLE] Successfully parsed file <https://builds.apache.org/job/Atlas-0.8-UnitTests/ws/intg/target/checkstyle-result.xml>
with 15769 unique warnings and 0 duplicates.
[CHECKSTYLE] Successfully parsed file <https://builds.apache.org/job/Atlas-0.8-UnitTests/ws/notification/target/checkstyle-result.xml>
with 17192 unique warnings and 0 duplicates.
[CHECKSTYLE] Successfully parsed file <https://builds.apache.org/job/Atlas-0.8-UnitTests/ws/repository/target/checkstyle-result.xml>
with 36068 unique warnings and 0 duplicates.
[CHECKSTYLE] Successfully parsed file <https://builds.apache.org/job/Atlas-0.8-UnitTests/ws/server-api/target/checkstyle-result.xml>
with 36447 unique warnings and 0 duplicates.
[CHECKSTYLE] Successfully parsed file <https://builds.apache.org/job/Atlas-0.8-UnitTests/ws/shaded/hbase-client-shaded/target/checkstyle-result.xml>
with 36447 unique warnings and 0 duplicates.
[CHECKSTYLE] Successfully parsed file <https://builds.apache.org/job/Atlas-0.8-UnitTests/ws/shaded/hbase-server-shaded/target/checkstyle-result.xml>
with 36447 unique warnings and 0 duplicates.
[CHECKSTYLE] Successfully parsed file <https://builds.apache.org/job/Atlas-0.8-UnitTests/ws/target/checkstyle-result.xml>
with 36447 unique warnings and 0 duplicates.
[CHECKSTYLE] Successfully parsed file <https://builds.apache.org/job/Atlas-0.8-UnitTests/ws/typesystem/target/checkstyle-result.xml>
with 40665 unique warnings and 0 duplicates.
<Git Blamer> Using GitBlamer to create author and commit information for all warnings.
<Git Blamer> GIT_COMMIT=19cd61d022b442c99a84ccfa5ea1547f82a4cc31, workspace=<https://builds.apache.org/job/Atlas-0.8-UnitTests/ws/>
 > git rev-parse 19cd61d022b442c99a84ccfa5ea1547f82a4cc31^{commit} # timeout=10
[CHECKSTYLE] Computing warning deltas based on reference build #96
[FINDBUGS] Collecting findbugs analysis files...
[FINDBUGS] Searching for all files in <https://builds.apache.org/job/Atlas-0.8-UnitTests/ws/>
that match the pattern **/target/findbugs.xml
[FINDBUGS] Parsing 15 files in <https://builds.apache.org/job/Atlas-0.8-UnitTests/ws/>
[FINDBUGS] Successfully parsed file <https://builds.apache.org/job/Atlas-0.8-UnitTests/ws/authorization/target/findbugs.xml>
with 0 unique warnings and 0 duplicates.
[FINDBUGS] Successfully parsed file <https://builds.apache.org/job/Atlas-0.8-UnitTests/ws/catalog/target/findbugs.xml>
with 0 unique warnings and 0 duplicates.
[FINDBUGS] Successfully parsed file <https://builds.apache.org/job/Atlas-0.8-UnitTests/ws/client/client-v1/target/findbugs.xml>
with 0 unique warnings and 0 duplicates.
[FINDBUGS] Successfully parsed file <https://builds.apache.org/job/Atlas-0.8-UnitTests/ws/client/client-v2/target/findbugs.xml>
with 0 unique warnings and 0 duplicates.
[FINDBUGS] Successfully parsed file <https://builds.apache.org/job/Atlas-0.8-UnitTests/ws/client/common/target/findbugs.xml>
with 0 unique warnings and 0 duplicates.
[FINDBUGS] Successfully parsed file <https://builds.apache.org/job/Atlas-0.8-UnitTests/ws/common/target/findbugs.xml>
with 0 unique warnings and 0 duplicates.
[FINDBUGS] Successfully parsed file <https://builds.apache.org/job/Atlas-0.8-UnitTests/ws/graphdb/api/target/findbugs.xml>
with 0 unique warnings and 0 duplicates.
[FINDBUGS] Successfully parsed file <https://builds.apache.org/job/Atlas-0.8-UnitTests/ws/graphdb/common/target/findbugs.xml>
with 0 unique warnings and 0 duplicates.
[FINDBUGS] Successfully parsed file <https://builds.apache.org/job/Atlas-0.8-UnitTests/ws/graphdb/titan0/target/findbugs.xml>
with 0 unique warnings and 0 duplicates.
[FINDBUGS] Successfully parsed file <https://builds.apache.org/job/Atlas-0.8-UnitTests/ws/graphdb/titan1/target/findbugs.xml>
with 0 unique warnings and 0 duplicates.
[FINDBUGS] Successfully parsed file <https://builds.apache.org/job/Atlas-0.8-UnitTests/ws/intg/target/findbugs.xml>
with 0 unique warnings and 0 duplicates.
[FINDBUGS] Successfully parsed file <https://builds.apache.org/job/Atlas-0.8-UnitTests/ws/notification/target/findbugs.xml>
with 0 unique warnings and 0 duplicates.
[FINDBUGS] Successfully parsed file <https://builds.apache.org/job/Atlas-0.8-UnitTests/ws/repository/target/findbugs.xml>
with 0 unique warnings and 0 duplicates.
[FINDBUGS] Successfully parsed file <https://builds.apache.org/job/Atlas-0.8-UnitTests/ws/server-api/target/findbugs.xml>
with 0 unique warnings and 0 duplicates.
[FINDBUGS] Successfully parsed file <https://builds.apache.org/job/Atlas-0.8-UnitTests/ws/typesystem/target/findbugs.xml>
with 0 unique warnings and 0 duplicates.
<Git Blamer> Using GitBlamer to create author and commit information for all warnings.
<Git Blamer> GIT_COMMIT=19cd61d022b442c99a84ccfa5ea1547f82a4cc31, workspace=<https://builds.apache.org/job/Atlas-0.8-UnitTests/ws/>
[FINDBUGS] Computing warning deltas based on reference build #96
Archiving artifacts
[Fast Archiver] Compressed 183.77 MB of artifacts by 57.1% relative to #96
TestNG Reports Processing: START
Looking for TestNG results report in workspace using pattern: **/target/surefire-reports/testng-results.xml,**/target/failsafe-reports/testng-results.xml
Saving reports...
Processing '/x1/jenkins/jenkins-home/jobs/Atlas-0.8-UnitTests/builds/99/testng/testng-results-1.xml'
Processing '/x1/jenkins/jenkins-home/jobs/Atlas-0.8-UnitTests/builds/99/testng/testng-results-2.xml'
Processing '/x1/jenkins/jenkins-home/jobs/Atlas-0.8-UnitTests/builds/99/testng/testng-results-3.xml'
Processing '/x1/jenkins/jenkins-home/jobs/Atlas-0.8-UnitTests/builds/99/testng/testng-results-4.xml'
Processing '/x1/jenkins/jenkins-home/jobs/Atlas-0.8-UnitTests/builds/99/testng/testng-results-5.xml'
Processing '/x1/jenkins/jenkins-home/jobs/Atlas-0.8-UnitTests/builds/99/testng/testng-results-6.xml'
Processing '/x1/jenkins/jenkins-home/jobs/Atlas-0.8-UnitTests/builds/99/testng/testng-results-7.xml'
Processing '/x1/jenkins/jenkins-home/jobs/Atlas-0.8-UnitTests/builds/99/testng/testng-results-8.xml'
Processing '/x1/jenkins/jenkins-home/jobs/Atlas-0.8-UnitTests/builds/99/testng/testng-results-9.xml'
Processing '/x1/jenkins/jenkins-home/jobs/Atlas-0.8-UnitTests/builds/99/testng/testng-results.xml'
TestNG Reports Processing: FINISH

Mime
View raw message