atlas-dev mailing list archives

Site index · List index
Message view « Date » · « Thread »
Top « Date » · « Thread »
From Apache Jenkins Server <jenk...@builds.apache.org>
Subject Build failed in Jenkins: Atlas-master-UnitTests #133
Date Sat, 14 Oct 2017 03:56:46 GMT
See <https://builds.apache.org/job/Atlas-master-UnitTests/133/display/redirect?page=changes>

Changes:

[madhan] ATLAS-2195: fix to close trasaction left open while queries index keys

------------------------------------------
[...truncated 509.15 KB...]
Running org.apache.atlas.web.security.SSLAndKerberosTest
Tests run: 1, Failures: 1, Errors: 0, Skipped: 0, Time elapsed: 47.462 sec <<< FAILURE!
- in org.apache.atlas.web.security.SSLAndKerberosTest
testService(org.apache.atlas.web.security.SSLAndKerberosTest)  Time elapsed: 30.202 sec  <<<
FAILURE!
com.sun.jersey.api.client.ClientHandlerException: java.io.IOException: javax.net.ssl.SSLHandshakeException:
Remote host closed connection during handshake
	at sun.security.ssl.InputRecord.read(InputRecord.java:505)
	at sun.security.ssl.SSLSocketImpl.readRecord(SSLSocketImpl.java:983)
	at sun.security.ssl.SSLSocketImpl.performInitialHandshake(SSLSocketImpl.java:1385)
	at sun.security.ssl.SSLSocketImpl.startHandshake(SSLSocketImpl.java:1413)
	at sun.security.ssl.SSLSocketImpl.startHandshake(SSLSocketImpl.java:1397)
	at sun.net.www.protocol.https.HttpsClient.afterConnect(HttpsClient.java:559)
	at sun.net.www.protocol.https.AbstractDelegateHttpsURLConnection.connect(AbstractDelegateHttpsURLConnection.java:185)
	at sun.net.www.protocol.https.HttpsURLConnectionImpl.connect(HttpsURLConnectionImpl.java:153)
	at org.apache.hadoop.security.authentication.client.KerberosAuthenticator.authenticate(KerberosAuthenticator.java:190)
	at org.apache.hadoop.security.token.delegation.web.DelegationTokenAuthenticator.authenticate(DelegationTokenAuthenticator.java:128)
	at org.apache.hadoop.security.authentication.client.AuthenticatedURL.openConnection(AuthenticatedURL.java:215)
	at org.apache.hadoop.security.token.delegation.web.DelegationTokenAuthenticatedURL.openConnection(DelegationTokenAuthenticatedURL.java:322)
	at org.apache.atlas.security.SecureClientUtils$1$1.run(SecureClientUtils.java:97)
	at org.apache.atlas.security.SecureClientUtils$1$1.run(SecureClientUtils.java:92)
	at java.security.AccessController.doPrivileged(Native Method)
	at javax.security.auth.Subject.doAs(Subject.java:422)
	at org.apache.hadoop.security.UserGroupInformation.doAs(UserGroupInformation.java:1657)
	at org.apache.atlas.security.SecureClientUtils$1.getHttpURLConnection(SecureClientUtils.java:92)
	at com.sun.jersey.client.urlconnection.URLConnectionClientHandler._invoke(URLConnectionClientHandler.java:165)
	at com.sun.jersey.client.urlconnection.URLConnectionClientHandler.handle(URLConnectionClientHandler.java:153)
	at com.sun.jersey.api.client.Client.handle(Client.java:652)
	at com.sun.jersey.api.client.WebResource.handle(WebResource.java:682)
	at com.sun.jersey.api.client.WebResource.access$200(WebResource.java:74)
	at com.sun.jersey.api.client.WebResource$Builder.method(WebResource.java:634)
	at org.apache.atlas.AtlasBaseClient.callAPIWithResource(AtlasBaseClient.java:334)
	at org.apache.atlas.AtlasBaseClient.callAPIWithResource(AtlasBaseClient.java:311)
	at org.apache.atlas.AtlasBaseClient.callAPI(AtlasBaseClient.java:227)
	at org.apache.atlas.AtlasClient.callAPIWithQueryParams(AtlasClient.java:962)
	at org.apache.atlas.AtlasClient.listTypes(AtlasClient.java:344)
	at org.apache.atlas.web.security.SSLAndKerberosTest.testService(SSLAndKerberosTest.java:185)

Java HotSpot(TM) 64-Bit Server VM warning: ignoring option MaxPermSize=512m; support was removed
in 8.0
Running org.apache.atlas.web.security.NegativeSSLAndKerberosTest
Tests run: 1, Failures: 1, Errors: 0, Skipped: 0, Time elapsed: 46.308 sec <<< FAILURE!
- in org.apache.atlas.web.security.NegativeSSLAndKerberosTest
testUnsecuredClient(org.apache.atlas.web.security.NegativeSSLAndKerberosTest)  Time elapsed:
30.173 sec  <<< FAILURE!
java.lang.AssertionError: expected [true] but found [false]
	at org.testng.Assert.fail(Assert.java:94)
	at org.testng.Assert.failNotEquals(Assert.java:496)
	at org.testng.Assert.assertTrue(Assert.java:42)
	at org.testng.Assert.assertTrue(Assert.java:52)
	at org.apache.atlas.web.security.NegativeSSLAndKerberosTest.testUnsecuredClient(NegativeSSLAndKerberosTest.java:139)

Java HotSpot(TM) 64-Bit Server VM warning: ignoring option MaxPermSize=512m; support was removed
in 8.0
Running org.apache.atlas.web.security.FileAuthenticationTest
Tests run: 6, Failures: 0, Errors: 0, Skipped: 0, Time elapsed: 2.347 sec - in org.apache.atlas.web.security.FileAuthenticationTest
Java HotSpot(TM) 64-Bit Server VM warning: ignoring option MaxPermSize=512m; support was removed
in 8.0
Running org.apache.atlas.web.security.UserDaoTest
Tests run: 2, Failures: 0, Errors: 0, Skipped: 0, Time elapsed: 0.657 sec - in org.apache.atlas.web.security.UserDaoTest
Java HotSpot(TM) 64-Bit Server VM warning: ignoring option MaxPermSize=512m; support was removed
in 8.0
Running org.apache.atlas.web.resources.AdminExportTest
Tests run: 0, Failures: 0, Errors: 0, Skipped: 0, Time elapsed: 0.276 sec - in org.apache.atlas.web.resources.AdminExportTest
Java HotSpot(TM) 64-Bit Server VM warning: ignoring option MaxPermSize=512m; support was removed
in 8.0
Running org.apache.atlas.web.resources.EntityResourceTest
Tests run: 1, Failures: 0, Errors: 0, Skipped: 0, Time elapsed: 0.54 sec - in org.apache.atlas.web.resources.EntityResourceTest
Java HotSpot(TM) 64-Bit Server VM warning: ignoring option MaxPermSize=512m; support was removed
in 8.0
Running org.apache.atlas.web.resources.AdminResourceTest
Tests run: 2, Failures: 0, Errors: 0, Skipped: 0, Time elapsed: 1.1 sec - in org.apache.atlas.web.resources.AdminResourceTest
Java HotSpot(TM) 64-Bit Server VM warning: ignoring option MaxPermSize=512m; support was removed
in 8.0
Running org.apache.atlas.web.resources.TaxonomyServiceTest
Tests run: 12, Failures: 0, Errors: 0, Skipped: 0, Time elapsed: 0.905 sec - in org.apache.atlas.web.resources.TaxonomyServiceTest
Java HotSpot(TM) 64-Bit Server VM warning: ignoring option MaxPermSize=512m; support was removed
in 8.0
Running org.apache.atlas.web.setup.SetupStepsTest
Tests run: 6, Failures: 0, Errors: 0, Skipped: 0, Time elapsed: 1.113 sec - in org.apache.atlas.web.setup.SetupStepsTest
Java HotSpot(TM) 64-Bit Server VM warning: ignoring option MaxPermSize=512m; support was removed
in 8.0
Running org.apache.atlas.web.service.ActiveInstanceElectorServiceTest
Tests run: 14, Failures: 0, Errors: 0, Skipped: 0, Time elapsed: 1.075 sec - in org.apache.atlas.web.service.ActiveInstanceElectorServiceTest
Java HotSpot(TM) 64-Bit Server VM warning: ignoring option MaxPermSize=512m; support was removed
in 8.0
Running org.apache.atlas.web.service.AtlasZookeeperSecurityPropertiesTest
Tests run: 6, Failures: 0, Errors: 0, Skipped: 0, Time elapsed: 0.393 sec - in org.apache.atlas.web.service.AtlasZookeeperSecurityPropertiesTest
Java HotSpot(TM) 64-Bit Server VM warning: ignoring option MaxPermSize=512m; support was removed
in 8.0
Running org.apache.atlas.web.service.SecureEmbeddedServerTest
Tests run: 4, Failures: 1, Errors: 0, Skipped: 0, Time elapsed: 46.401 sec <<< FAILURE!
- in org.apache.atlas.web.service.SecureEmbeddedServerTest
testServerConfiguredUsingCredentialProvider(org.apache.atlas.web.service.SecureEmbeddedServerTest)
 Time elapsed: 42.066 sec  <<< FAILURE!
java.lang.AssertionError: War deploy failed
	at sun.security.ssl.InputRecord.read(InputRecord.java:505)
	at sun.security.ssl.SSLSocketImpl.readRecord(SSLSocketImpl.java:983)
	at sun.security.ssl.SSLSocketImpl.performInitialHandshake(SSLSocketImpl.java:1385)
	at sun.security.ssl.SSLSocketImpl.startHandshake(SSLSocketImpl.java:1413)
	at sun.security.ssl.SSLSocketImpl.startHandshake(SSLSocketImpl.java:1397)
	at sun.net.www.protocol.https.HttpsClient.afterConnect(HttpsClient.java:559)
	at sun.net.www.protocol.https.AbstractDelegateHttpsURLConnection.connect(AbstractDelegateHttpsURLConnection.java:185)
	at sun.net.www.protocol.https.HttpsURLConnectionImpl.connect(HttpsURLConnectionImpl.java:153)
	at org.apache.atlas.web.service.SecureEmbeddedServerTest.testServerConfiguredUsingCredentialProvider(SecureEmbeddedServerTest.java:74)

Java HotSpot(TM) 64-Bit Server VM warning: ignoring option MaxPermSize=512m; support was removed
in 8.0
Running org.apache.atlas.web.service.ActiveInstanceStateTest
Tests run: 5, Failures: 0, Errors: 0, Skipped: 0, Time elapsed: 0.88 sec - in org.apache.atlas.web.service.ActiveInstanceStateTest
Java HotSpot(TM) 64-Bit Server VM warning: ignoring option MaxPermSize=512m; support was removed
in 8.0
Running org.apache.atlas.web.service.ServiceStateTest
Tests run: 3, Failures: 0, Errors: 0, Skipped: 0, Time elapsed: 0.768 sec - in org.apache.atlas.web.service.ServiceStateTest
Java HotSpot(TM) 64-Bit Server VM warning: ignoring option MaxPermSize=512m; support was removed
in 8.0
Running org.apache.atlas.web.service.CuratorFactoryTest
Tests run: 3, Failures: 0, Errors: 0, Skipped: 0, Time elapsed: 1.13 sec - in org.apache.atlas.web.service.CuratorFactoryTest
Java HotSpot(TM) 64-Bit Server VM warning: ignoring option MaxPermSize=512m; support was removed
in 8.0
Running org.apache.atlas.notification.NotificationEntityChangeListenerTest
Tests run: 1, Failures: 0, Errors: 0, Skipped: 0, Time elapsed: 0.864 sec - in org.apache.atlas.notification.NotificationEntityChangeListenerTest
Java HotSpot(TM) 64-Bit Server VM warning: ignoring option MaxPermSize=512m; support was removed
in 8.0
Running org.apache.atlas.notification.AdaptiveWaiterTest
Tests run: 3, Failures: 0, Errors: 0, Skipped: 0, Time elapsed: 4.926 sec - in org.apache.atlas.notification.AdaptiveWaiterTest
Java HotSpot(TM) 64-Bit Server VM warning: ignoring option MaxPermSize=512m; support was removed
in 8.0
Running org.apache.atlas.notification.NotificationHookConsumerTest
Tests run: 12, Failures: 0, Errors: 0, Skipped: 0, Time elapsed: 7.284 sec - in org.apache.atlas.notification.NotificationHookConsumerTest
Java HotSpot(TM) 64-Bit Server VM warning: ignoring option MaxPermSize=512m; support was removed
in 8.0
Running org.apache.atlas.notification.NotificationHookConsumerKafkaTest
Tests run: 2, Failures: 0, Errors: 0, Skipped: 0, Time elapsed: 6.738 sec - in org.apache.atlas.notification.NotificationHookConsumerKafkaTest
Java HotSpot(TM) 64-Bit Server VM warning: ignoring option MaxPermSize=512m; support was removed
in 8.0
Running org.apache.atlas.util.RestUtilsTest
Tests run: 0, Failures: 0, Errors: 0, Skipped: 0, Time elapsed: 0.366 sec - in org.apache.atlas.util.RestUtilsTest

Results :

Failed tests: 
  NegativeSSLAndKerberosTest.testUnsecuredClient:139 expected [true] but found [false]
  SSLAndKerberosTest.testService:185 » ClientHandler java.io.IOException: javax....
  SSLTest.testService:147 » ClientHandler javax.net.ssl.SSLHandshakeException: R...
  SecureEmbeddedServerTest.testServerConfiguredUsingCredentialProvider:79 War deploy failed

Tests run: 121, Failures: 4, Errors: 0, Skipped: 0

[INFO] ------------------------------------------------------------------------
[INFO] Reactor Summary:
[INFO] 
[INFO] Apache Atlas Server Build Tools .................... SUCCESS [  1.315 s]
[INFO] apache-atlas ....................................... SUCCESS [  5.179 s]
[INFO] Apache Atlas Integration ........................... SUCCESS [ 32.035 s]
[INFO] Apache Atlas Common ................................ SUCCESS [  9.669 s]
[INFO] Apache Atlas Typesystem ............................ SUCCESS [ 52.077 s]
[INFO] Apache Atlas Client ................................ SUCCESS [  0.630 s]
[INFO] atlas-client-common ................................ SUCCESS [  7.193 s]
[INFO] atlas-client-v1 .................................... SUCCESS [  9.854 s]
[INFO] Apache Atlas Server API ............................ SUCCESS [  6.222 s]
[INFO] Apache Atlas Notification .......................... SUCCESS [ 18.862 s]
[INFO] atlas-client-v2 .................................... SUCCESS [  5.999 s]
[INFO] Apache Atlas Graph Database Projects ............... SUCCESS [  0.526 s]
[INFO] Apache Atlas Graph Database API .................... SUCCESS [  5.098 s]
[INFO] Graph Database Common Code ......................... SUCCESS [  5.483 s]
[INFO] Apache Atlas Titan 1.0.0 GraphDB Impl .............. SUCCESS [ 39.230 s]
[INFO] Shaded version of Apache hbase client .............. SUCCESS [  8.058 s]
[INFO] Apache Atlas Titan 0.5.4 Graph DB Impl ............. SUCCESS [01:16 min]
[INFO] Apache Atlas Graph Database Implementation Dependencies SUCCESS [  0.711 s]
[INFO] Shaded version of Apache hbase server .............. SUCCESS [ 23.265 s]
[INFO] Apache Atlas Repository ............................ SUCCESS [07:40 min]
[INFO] Apache Atlas Authorization ......................... SUCCESS [  9.203 s]
[INFO] Apache Atlas Business Catalog ...................... SUCCESS [ 15.989 s]
[INFO] Apache Atlas UI .................................... SUCCESS [01:33 min]
[INFO] Apache Atlas Web Application ....................... FAILURE [04:56 min]
[INFO] Apache Atlas Documentation ......................... SKIPPED
[INFO] Apache Atlas FileSystem Model ...................... SKIPPED
[INFO] Apache Atlas Plugin Classloader .................... SKIPPED
[INFO] Apache Atlas Hive Bridge Shim ...................... SKIPPED
[INFO] Apache Atlas Hive Bridge ........................... SKIPPED
[INFO] Apache Atlas Falcon Bridge Shim .................... SKIPPED
[INFO] Apache Atlas Falcon Bridge ......................... SKIPPED
[INFO] Apache Atlas Sqoop Bridge Shim ..................... SKIPPED
[INFO] Apache Atlas Sqoop Bridge .......................... SKIPPED
[INFO] Apache Atlas Storm Bridge Shim ..................... SKIPPED
[INFO] Apache Atlas Storm Bridge .......................... SKIPPED
[INFO] Apache Atlas Distribution .......................... SKIPPED
[INFO] ------------------------------------------------------------------------
[INFO] BUILD FAILURE
[INFO] ------------------------------------------------------------------------
[INFO] Total time: 19:44 min
[INFO] Finished at: 2017-10-14T03:47:17Z
[INFO] Final Memory: 178M/2628M
[INFO] ------------------------------------------------------------------------
[ERROR] Failed to execute goal org.apache.maven.plugins:maven-surefire-plugin:2.18.1:test
(default-test) on project atlas-webapp: There are test failures.
[ERROR] 
[ERROR] Please refer to <https://builds.apache.org/job/Atlas-master-UnitTests/ws/webapp/target/surefire-reports>
for the individual test results.
[ERROR] -> [Help 1]
[ERROR] 
[ERROR] To see the full stack trace of the errors, re-run Maven with the -e switch.
[ERROR] Re-run Maven using the -X switch to enable full debug logging.
[ERROR] 
[ERROR] For more information about the errors and possible solutions, please read the following
articles:
[ERROR] [Help 1] http://cwiki.apache.org/confluence/display/MAVEN/MojoFailureException
[ERROR] 
[ERROR] After correcting the problems, you can resume the build with the command
[ERROR]   mvn <goals> -rf :atlas-webapp
Build step 'Execute shell' marked build as failure
[CHECKSTYLE] Collecting checkstyle analysis files...
[CHECKSTYLE] Searching for all files in <https://builds.apache.org/job/Atlas-master-UnitTests/ws/>
that match the pattern **/target/checkstyle-result.xml
[CHECKSTYLE] Parsing 22 files in <https://builds.apache.org/job/Atlas-master-UnitTests/ws/>
[CHECKSTYLE] Successfully parsed file <https://builds.apache.org/job/Atlas-master-UnitTests/ws/authorization/target/checkstyle-result.xml>
with 467 unique warnings and 0 duplicates.
[CHECKSTYLE] Successfully parsed file <https://builds.apache.org/job/Atlas-master-UnitTests/ws/catalog/target/checkstyle-result.xml>
with 2604 unique warnings and 0 duplicates.
[CHECKSTYLE] Successfully parsed file <https://builds.apache.org/job/Atlas-master-UnitTests/ws/client/client-v1/target/checkstyle-result.xml>
with 3477 unique warnings and 0 duplicates.
[CHECKSTYLE] Successfully parsed file <https://builds.apache.org/job/Atlas-master-UnitTests/ws/client/client-v2/target/checkstyle-result.xml>
with 3802 unique warnings and 0 duplicates.
[CHECKSTYLE] Successfully parsed file <https://builds.apache.org/job/Atlas-master-UnitTests/ws/client/common/target/checkstyle-result.xml>
with 4262 unique warnings and 0 duplicates.
[CHECKSTYLE] Successfully parsed file <https://builds.apache.org/job/Atlas-master-UnitTests/ws/client/target/checkstyle-result.xml>
with 4262 unique warnings and 0 duplicates.
[CHECKSTYLE] Successfully parsed file <https://builds.apache.org/job/Atlas-master-UnitTests/ws/common/target/checkstyle-result.xml>
with 5227 unique warnings and 0 duplicates.
[CHECKSTYLE] Successfully parsed file <https://builds.apache.org/job/Atlas-master-UnitTests/ws/dashboardv2/target/checkstyle-result.xml>
with 5227 unique warnings and 0 duplicates.
[CHECKSTYLE] Successfully parsed file <https://builds.apache.org/job/Atlas-master-UnitTests/ws/graphdb/api/target/checkstyle-result.xml>
with 5500 unique warnings and 0 duplicates.
[CHECKSTYLE] Successfully parsed file <https://builds.apache.org/job/Atlas-master-UnitTests/ws/graphdb/common/target/checkstyle-result.xml>
with 5687 unique warnings and 0 duplicates.
[CHECKSTYLE] Successfully parsed file <https://builds.apache.org/job/Atlas-master-UnitTests/ws/graphdb/graphdb-impls/target/checkstyle-result.xml>
with 5687 unique warnings and 0 duplicates.
[CHECKSTYLE] Successfully parsed file <https://builds.apache.org/job/Atlas-master-UnitTests/ws/graphdb/target/checkstyle-result.xml>
with 5687 unique warnings and 0 duplicates.
[CHECKSTYLE] Successfully parsed file <https://builds.apache.org/job/Atlas-master-UnitTests/ws/graphdb/titan0/target/checkstyle-result.xml>
with 8089 unique warnings and 0 duplicates.
[CHECKSTYLE] Successfully parsed file <https://builds.apache.org/job/Atlas-master-UnitTests/ws/graphdb/titan1/target/checkstyle-result.xml>
with 9056 unique warnings and 0 duplicates.
[CHECKSTYLE] Successfully parsed file <https://builds.apache.org/job/Atlas-master-UnitTests/ws/intg/target/checkstyle-result.xml>
with 17262 unique warnings and 0 duplicates.
[CHECKSTYLE] Successfully parsed file <https://builds.apache.org/job/Atlas-master-UnitTests/ws/notification/target/checkstyle-result.xml>
with 18827 unique warnings and 0 duplicates.
[CHECKSTYLE] Successfully parsed file <https://builds.apache.org/job/Atlas-master-UnitTests/ws/repository/target/checkstyle-result.xml>
with 39089 unique warnings and 0 duplicates.
[CHECKSTYLE] Successfully parsed file <https://builds.apache.org/job/Atlas-master-UnitTests/ws/server-api/target/checkstyle-result.xml>
with 39468 unique warnings and 0 duplicates.
[CHECKSTYLE] Successfully parsed file <https://builds.apache.org/job/Atlas-master-UnitTests/ws/shaded/hbase-client-shaded/target/checkstyle-result.xml>
with 39468 unique warnings and 0 duplicates.
[CHECKSTYLE] Successfully parsed file <https://builds.apache.org/job/Atlas-master-UnitTests/ws/shaded/hbase-server-shaded/target/checkstyle-result.xml>
with 39468 unique warnings and 0 duplicates.
[CHECKSTYLE] Successfully parsed file <https://builds.apache.org/job/Atlas-master-UnitTests/ws/target/checkstyle-result.xml>
with 39468 unique warnings and 0 duplicates.
[CHECKSTYLE] Successfully parsed file <https://builds.apache.org/job/Atlas-master-UnitTests/ws/typesystem/target/checkstyle-result.xml>
with 43686 unique warnings and 0 duplicates.
<Git Blamer> Using GitBlamer to create author and commit information for all warnings.
<Git Blamer> GIT_COMMIT=8663eb1dedfc9f3136ea44460055f7e332e3212c, workspace=<https://builds.apache.org/job/Atlas-master-UnitTests/ws/>
 > git rev-parse 8663eb1dedfc9f3136ea44460055f7e332e3212c^{commit} # timeout=10
[CHECKSTYLE] Computing warning deltas based on reference build #59
[FINDBUGS] Collecting findbugs analysis files...
[FINDBUGS] Searching for all files in <https://builds.apache.org/job/Atlas-master-UnitTests/ws/>
that match the pattern **/target/findbugs.xml
[FINDBUGS] Parsing 15 files in <https://builds.apache.org/job/Atlas-master-UnitTests/ws/>
[FINDBUGS] Successfully parsed file <https://builds.apache.org/job/Atlas-master-UnitTests/ws/authorization/target/findbugs.xml>
with 0 unique warnings and 0 duplicates.
[FINDBUGS] Successfully parsed file <https://builds.apache.org/job/Atlas-master-UnitTests/ws/catalog/target/findbugs.xml>
with 0 unique warnings and 0 duplicates.
[FINDBUGS] Successfully parsed file <https://builds.apache.org/job/Atlas-master-UnitTests/ws/client/client-v1/target/findbugs.xml>
with 0 unique warnings and 0 duplicates.
[FINDBUGS] Successfully parsed file <https://builds.apache.org/job/Atlas-master-UnitTests/ws/client/client-v2/target/findbugs.xml>
with 0 unique warnings and 0 duplicates.
[FINDBUGS] Successfully parsed file <https://builds.apache.org/job/Atlas-master-UnitTests/ws/client/common/target/findbugs.xml>
with 0 unique warnings and 0 duplicates.
[FINDBUGS] Successfully parsed file <https://builds.apache.org/job/Atlas-master-UnitTests/ws/common/target/findbugs.xml>
with 0 unique warnings and 0 duplicates.
[FINDBUGS] Successfully parsed file <https://builds.apache.org/job/Atlas-master-UnitTests/ws/graphdb/api/target/findbugs.xml>
with 0 unique warnings and 0 duplicates.
[FINDBUGS] Successfully parsed file <https://builds.apache.org/job/Atlas-master-UnitTests/ws/graphdb/common/target/findbugs.xml>
with 0 unique warnings and 0 duplicates.
[FINDBUGS] Successfully parsed file <https://builds.apache.org/job/Atlas-master-UnitTests/ws/graphdb/titan0/target/findbugs.xml>
with 0 unique warnings and 0 duplicates.
[FINDBUGS] Successfully parsed file <https://builds.apache.org/job/Atlas-master-UnitTests/ws/graphdb/titan1/target/findbugs.xml>
with 0 unique warnings and 0 duplicates.
[FINDBUGS] Successfully parsed file <https://builds.apache.org/job/Atlas-master-UnitTests/ws/intg/target/findbugs.xml>
with 0 unique warnings and 0 duplicates.
[FINDBUGS] Successfully parsed file <https://builds.apache.org/job/Atlas-master-UnitTests/ws/notification/target/findbugs.xml>
with 0 unique warnings and 0 duplicates.
[FINDBUGS] Successfully parsed file <https://builds.apache.org/job/Atlas-master-UnitTests/ws/repository/target/findbugs.xml>
with 0 unique warnings and 0 duplicates.
[FINDBUGS] Successfully parsed file <https://builds.apache.org/job/Atlas-master-UnitTests/ws/server-api/target/findbugs.xml>
with 0 unique warnings and 0 duplicates.
[FINDBUGS] Successfully parsed file <https://builds.apache.org/job/Atlas-master-UnitTests/ws/typesystem/target/findbugs.xml>
with 0 unique warnings and 0 duplicates.
<Git Blamer> Using GitBlamer to create author and commit information for all warnings.
<Git Blamer> GIT_COMMIT=8663eb1dedfc9f3136ea44460055f7e332e3212c, workspace=<https://builds.apache.org/job/Atlas-master-UnitTests/ws/>
[FINDBUGS] Computing warning deltas based on reference build #59
Archiving artifacts
[Fast Archiver] Compressed 201.92 MB of artifacts by 52.3% relative to #59
TestNG Reports Processing: START
Looking for TestNG results report in workspace using pattern: **/target/surefire-reports/testng-results.xml,**/target/failsafe-reports/testng-results.xml
Saving reports...
Processing '/x1/jenkins/jenkins-home/jobs/Atlas-master-UnitTests/builds/133/testng/testng-results-1.xml'
Processing '/x1/jenkins/jenkins-home/jobs/Atlas-master-UnitTests/builds/133/testng/testng-results-2.xml'
Processing '/x1/jenkins/jenkins-home/jobs/Atlas-master-UnitTests/builds/133/testng/testng-results-3.xml'
Processing '/x1/jenkins/jenkins-home/jobs/Atlas-master-UnitTests/builds/133/testng/testng-results-4.xml'
Processing '/x1/jenkins/jenkins-home/jobs/Atlas-master-UnitTests/builds/133/testng/testng-results-5.xml'
Processing '/x1/jenkins/jenkins-home/jobs/Atlas-master-UnitTests/builds/133/testng/testng-results-6.xml'
Processing '/x1/jenkins/jenkins-home/jobs/Atlas-master-UnitTests/builds/133/testng/testng-results-7.xml'
Processing '/x1/jenkins/jenkins-home/jobs/Atlas-master-UnitTests/builds/133/testng/testng-results-8.xml'
Processing '/x1/jenkins/jenkins-home/jobs/Atlas-master-UnitTests/builds/133/testng/testng-results-9.xml'
Processing '/x1/jenkins/jenkins-home/jobs/Atlas-master-UnitTests/builds/133/testng/testng-results.xml'
TestNG Reports Processing: FINISH

Mime
View raw message