atlas-dev mailing list archives

Site index · List index
Message view « Date » · « Thread »
Top « Date » · « Thread »
From Apache Jenkins Server <jenk...@builds.apache.org>
Subject Build failed in Jenkins: Atlas-0.8-IntegrationTests #93
Date Mon, 02 Oct 2017 17:50:28 GMT
See <https://builds.apache.org/job/Atlas-0.8-IntegrationTests/93/display/redirect?page=changes>

Changes:

[apoorvnaik] ATLAS-2174: Query length validations and path normalization

------------------------------------------
[...truncated 460.71 KB...]
	at org.apache.atlas.examples.QuickStartV2IT.runQuickStart(QuickStartV2IT.java:49)

testGetVersion(org.apache.atlas.web.integration.AdminJerseyResourceIT)  Time elapsed: 0.002
sec  <<< FAILURE!
com.sun.jersey.api.client.ClientHandlerException: java.net.ConnectException: Connection refused
(Connection refused)
	at org.apache.atlas.web.integration.AdminJerseyResourceIT.testGetVersion(AdminJerseyResourceIT.java:40)
Caused by: java.net.ConnectException: Connection refused (Connection refused)
	at org.apache.atlas.web.integration.AdminJerseyResourceIT.testGetVersion(AdminJerseyResourceIT.java:40)

setUp(org.apache.atlas.web.integration.DataSetLineageJerseyResourceIT)  Time elapsed: 0.18
sec  <<< FAILURE!
com.sun.jersey.api.client.ClientHandlerException: java.net.ConnectException: Connection refused
(Connection refused)
	at org.apache.atlas.web.integration.DataSetLineageJerseyResourceIT.setUp(DataSetLineageJerseyResourceIT.java:56)
Caused by: java.net.ConnectException: Connection refused (Connection refused)
	at org.apache.atlas.web.integration.DataSetLineageJerseyResourceIT.setUp(DataSetLineageJerseyResourceIT.java:56)

setUp(org.apache.atlas.web.integration.EntityJerseyResourceIT)  Time elapsed: 0.2 sec  <<<
FAILURE!
com.sun.jersey.api.client.ClientHandlerException: java.net.ConnectException: Connection refused
(Connection refused)
	at org.apache.atlas.web.integration.EntityJerseyResourceIT.setUp(EntityJerseyResourceIT.java:87)
Caused by: java.net.ConnectException: Connection refused (Connection refused)
	at org.apache.atlas.web.integration.EntityJerseyResourceIT.setUp(EntityJerseyResourceIT.java:87)

testDuplicateCreate(org.apache.atlas.web.integration.TypedefsJerseyResourceIT)  Time elapsed:
0.006 sec  <<< FAILURE!
com.sun.jersey.api.client.ClientHandlerException: java.net.ConnectException: Connection refused
(Connection refused)
	at org.apache.atlas.web.integration.TypedefsJerseyResourceIT.testDuplicateCreate(TypedefsJerseyResourceIT.java:112)
Caused by: java.net.ConnectException: Connection refused (Connection refused)
	at org.apache.atlas.web.integration.TypedefsJerseyResourceIT.testDuplicateCreate(TypedefsJerseyResourceIT.java:112)

testInvalidGets(org.apache.atlas.web.integration.TypedefsJerseyResourceIT)  Time elapsed:
0.001 sec  <<< FAILURE!
com.sun.jersey.api.client.ClientHandlerException: java.net.ConnectException: Connection refused
(Connection refused)
	at org.apache.atlas.web.integration.TypedefsJerseyResourceIT.testInvalidGets(TypedefsJerseyResourceIT.java:197)
Caused by: java.net.ConnectException: Connection refused (Connection refused)
	at org.apache.atlas.web.integration.TypedefsJerseyResourceIT.testInvalidGets(TypedefsJerseyResourceIT.java:197)

testListTypesByFilter(org.apache.atlas.web.integration.TypedefsJerseyResourceIT)  Time elapsed:
0.006 sec  <<< FAILURE!
com.sun.jersey.api.client.ClientHandlerException: java.net.ConnectException: Connection refused
(Connection refused)
	at org.apache.atlas.web.integration.TypedefsJerseyResourceIT.testListTypesByFilter(TypedefsJerseyResourceIT.java:277)
Caused by: java.net.ConnectException: Connection refused (Connection refused)
	at org.apache.atlas.web.integration.TypedefsJerseyResourceIT.testListTypesByFilter(TypedefsJerseyResourceIT.java:277)

testUpdate(org.apache.atlas.web.integration.TypedefsJerseyResourceIT)  Time elapsed: 0.001
sec  <<< FAILURE!
com.sun.jersey.api.client.ClientHandlerException: java.net.ConnectException: Connection refused
(Connection refused)
	at org.apache.atlas.web.integration.TypedefsJerseyResourceIT.testUpdate(TypedefsJerseyResourceIT.java:133)
Caused by: java.net.ConnectException: Connection refused (Connection refused)
	at org.apache.atlas.web.integration.TypedefsJerseyResourceIT.testUpdate(TypedefsJerseyResourceIT.java:133)

testDuplicateSubmit(org.apache.atlas.web.integration.TypesJerseyResourceIT)  Time elapsed:
0.002 sec  <<< FAILURE!
com.sun.jersey.api.client.ClientHandlerException: java.net.ConnectException: Connection refused
(Connection refused)
	at org.apache.atlas.web.integration.TypesJerseyResourceIT.testDuplicateSubmit(TypesJerseyResourceIT.java:102)
Caused by: java.net.ConnectException: Connection refused (Connection refused)
	at org.apache.atlas.web.integration.TypesJerseyResourceIT.testDuplicateSubmit(TypesJerseyResourceIT.java:102)

testGetDefinitionForNonexistentType(org.apache.atlas.web.integration.TypesJerseyResourceIT)
 Time elapsed: 0.002 sec  <<< FAILURE!
org.testng.TestException: 

Expected exception org.apache.atlas.AtlasServiceException but got com.sun.jersey.api.client.ClientHandlerException:
java.net.ConnectException: Connection refused (Connection refused)
	at org.apache.atlas.web.integration.TypesJerseyResourceIT.testGetDefinitionForNonexistentType(TypesJerseyResourceIT.java:167)
Caused by: java.net.ConnectException: Connection refused (Connection refused)
	at org.apache.atlas.web.integration.TypesJerseyResourceIT.testGetDefinitionForNonexistentType(TypesJerseyResourceIT.java:167)

testGetTraitNames(org.apache.atlas.web.integration.TypesJerseyResourceIT)  Time elapsed: 0.042
sec  <<< FAILURE!
com.sun.jersey.api.client.ClientHandlerException: java.net.ConnectException: Connection refused
(Connection refused)
	at org.apache.atlas.web.integration.TypesJerseyResourceIT.addTraits(TypesJerseyResourceIT.java:226)
	at org.apache.atlas.web.integration.TypesJerseyResourceIT.testGetTraitNames(TypesJerseyResourceIT.java:188)
Caused by: java.net.ConnectException: Connection refused (Connection refused)
	at org.apache.atlas.web.integration.TypesJerseyResourceIT.addTraits(TypesJerseyResourceIT.java:226)
	at org.apache.atlas.web.integration.TypesJerseyResourceIT.testGetTraitNames(TypesJerseyResourceIT.java:188)

testListTypesByFilter(org.apache.atlas.web.integration.TypesJerseyResourceIT)  Time elapsed:
0.014 sec  <<< FAILURE!
com.sun.jersey.api.client.ClientHandlerException: java.net.ConnectException: Connection refused
(Connection refused)
	at org.apache.atlas.web.integration.TypesJerseyResourceIT.testListTypesByFilter(TypesJerseyResourceIT.java:206)
Caused by: java.net.ConnectException: Connection refused (Connection refused)
	at org.apache.atlas.web.integration.TypesJerseyResourceIT.testListTypesByFilter(TypesJerseyResourceIT.java:206)

testUpdate(org.apache.atlas.web.integration.TypesJerseyResourceIT)  Time elapsed: 0.002 sec
 <<< FAILURE!
com.sun.jersey.api.client.ClientHandlerException: java.net.ConnectException: Connection refused
(Connection refused)
	at org.apache.atlas.web.integration.TypesJerseyResourceIT.testUpdate(TypesJerseyResourceIT.java:117)
Caused by: java.net.ConnectException: Connection refused (Connection refused)
	at org.apache.atlas.web.integration.TypesJerseyResourceIT.testUpdate(TypesJerseyResourceIT.java:117)

setUp(org.apache.atlas.notification.NotificationHookConsumerIT)  Time elapsed: 3.558 sec 
<<< FAILURE!
com.sun.jersey.api.client.ClientHandlerException: java.net.ConnectException: Connection refused
(Connection refused)
	at org.apache.atlas.notification.NotificationHookConsumerIT.setUp(NotificationHookConsumerIT.java:55)
Caused by: java.net.ConnectException: Connection refused (Connection refused)
	at org.apache.atlas.notification.NotificationHookConsumerIT.setUp(NotificationHookConsumerIT.java:55)


Results :

Failed tests: 
  QuickStartIT.runQuickStart:44 » ClientHandler java.net.ConnectException: Conne...
  QuickStartV2IT.runQuickStart:49 » ClientHandler java.net.ConnectException: Con...
  NotificationHookConsumerIT.setUp:55->BaseResourceIT.createTypeDefinitionsV1:357->BaseResourceIT.createType:172
» ClientHandler
  AdminJerseyResourceIT.testGetVersion:40 » ClientHandler java.net.ConnectExcept...
  DataSetLineageJerseyResourceIT.setUp:56->BaseResourceIT.createTypeDefinitionsV1:357->BaseResourceIT.createType:172
» ClientHandler
  EntityDiscoveryJerseyResourceIT.setUp:58->createTypes:209->BaseResourceIT.createType:186
» ClientHandler
  EntityJerseyResourceIT.setUp:87->BaseResourceIT.createTypeDefinitionsV1:357->BaseResourceIT.createType:172
» ClientHandler
  EntityV2JerseyResourceIT.setUp:80->BaseResourceIT.createTypeDefinitionsV2:454->BaseResourceIT.batchCreateTypes:126
» ClientHandler
  MetadataDiscoveryJerseyResourceIT.setUp:63->createTypes:237->BaseResourceIT.createTypeDefinitionsV1:357->BaseResourceIT.createType:172
» ClientHandler
  TypedefsJerseyResourceIT.testCreate:84->BaseResourceIT.createType:162->BaseResourceIT.batchCreateTypes:142
» ClientHandler
  TypedefsJerseyResourceIT.testDuplicateCreate:112 » ClientHandler java.net.Conn...
  TypedefsJerseyResourceIT.testInvalidGets:197 » ClientHandler java.net.ConnectE...
  TypedefsJerseyResourceIT.testListTypesByFilter:277 » ClientHandler java.net.Co...
  TypedefsJerseyResourceIT.testUpdate:133 » ClientHandler java.net.ConnectExcept...
  TypesJerseyResourceIT.testDuplicateSubmit:102 » ClientHandler java.net.Connect...
  TypesJerseyResourceIT.testGetDefinitionForNonexistentType » Test 
Expected exc...
  TypesJerseyResourceIT.testGetTraitNames:188->addTraits:226->BaseResourceIT.createType:208->BaseResourceIT.createType:186
» ClientHandler
  TypesJerseyResourceIT.testListTypesByFilter:206->BaseResourceIT.createType:208->BaseResourceIT.createType:193
» ClientHandler
  TypesJerseyResourceIT.testSubmit:79 » ClientHandler java.net.ConnectException:...
  TypesJerseyResourceIT.testUpdate:117 » ClientHandler java.net.ConnectException...

Tests run: 142, Failures: 20, Errors: 0, Skipped: 111

[INFO] 
[INFO] --- jetty-maven-plugin:9.4.0.v20161208:stop (stop-jetty) @ atlas-webapp ---
[INFO] Waiting 10 seconds for jetty to stop
[INFO] Stopped ServerConnector@70a06ea2{HTTP/1.1,[http/1.1]}{0.0.0.0:31000}
[INFO] Stopped scavenging
[INFO] Closing Spring root WebApplicationContext
[INFO] Shutting down log4j
[INFO] Stopped o.e.j.m.p.JettyWebAppContext@d1a86cd{/,file://<https://builds.apache.org/job/Atlas-0.8-IntegrationTests/ws/webapp/target/atlas-webapp-0.8.2-SNAPSHOT/,UNAVAILABLE}{/home/jenkins/jenkins-slave/workspace/Atlas-0.8-IntegrationTests/webapp/target/atlas-webapp-0.8.2-SNAPSHOT.war}>
[INFO] Server reports itself as stopped
[INFO] 
[INFO] --- maven-source-plugin:2.4:jar-no-fork (attach-sources) @ atlas-webapp ---
[INFO] Building jar: <https://builds.apache.org/job/Atlas-0.8-IntegrationTests/ws/webapp/target/atlas-webapp-0.8.2-SNAPSHOT-sources.jar>
[INFO] 
[INFO] --- maven-source-plugin:2.4:test-jar-no-fork (attach-sources) @ atlas-webapp ---
[INFO] Building jar: <https://builds.apache.org/job/Atlas-0.8-IntegrationTests/ws/webapp/target/atlas-webapp-0.8.2-SNAPSHOT-test-sources.jar>
[INFO] 
[INFO] --- maven-failsafe-plugin:2.19.1:verify (verify) @ atlas-webapp ---
[INFO] ------------------------------------------------------------------------
[INFO] Reactor Summary:
[INFO] 
[INFO] Apache Atlas Server Build Tools .................... SUCCESS [  0.567 s]
[INFO] apache-atlas ....................................... SUCCESS [  3.449 s]
[INFO] Apache Atlas Integration ........................... SUCCESS [ 17.039 s]
[INFO] Apache Atlas Common ................................ SUCCESS [  7.209 s]
[INFO] Apache Atlas Typesystem ............................ SUCCESS [ 41.418 s]
[INFO] Apache Atlas Client ................................ SUCCESS [  0.634 s]
[INFO] atlas-client-common ................................ SUCCESS [  6.266 s]
[INFO] atlas-client-v1 .................................... SUCCESS [  6.496 s]
[INFO] Apache Atlas Server API ............................ SUCCESS [  5.234 s]
[INFO] Apache Atlas Notification .......................... SUCCESS [  8.391 s]
[INFO] atlas-client-v2 .................................... SUCCESS [  5.172 s]
[INFO] Apache Atlas Graph Database Projects ............... SUCCESS [  0.537 s]
[INFO] Apache Atlas Graph Database API .................... SUCCESS [  4.693 s]
[INFO] Graph Database Common Code ......................... SUCCESS [  4.766 s]
[INFO] Apache Atlas Titan 1.0.0 GraphDB Impl .............. SUCCESS [ 33.217 s]
[INFO] Shaded version of Apache hbase client .............. SUCCESS [  7.342 s]
[INFO] Apache Atlas Titan 0.5.4 Graph DB Impl ............. SUCCESS [ 33.013 s]
[INFO] Apache Atlas Graph Database Implementation Dependencies SUCCESS [  0.613 s]
[INFO] Shaded version of Apache hbase server .............. SUCCESS [ 21.644 s]
[INFO] Apache Atlas Repository ............................ SUCCESS [01:09 min]
[INFO] Apache Atlas Authorization ......................... SUCCESS [  6.626 s]
[INFO] Apache Atlas Business Catalog ...................... SUCCESS [  9.763 s]
[INFO] Apache Atlas UI .................................... SUCCESS [01:22 min]
[INFO] Apache Atlas Web Application ....................... FAILURE [01:16 min]
[INFO] Apache Atlas Documentation ......................... SKIPPED
[INFO] Apache Atlas FileSystem Model ...................... SKIPPED
[INFO] Apache Atlas Plugin Classloader .................... SKIPPED
[INFO] Apache Atlas Hive Bridge Shim ...................... SKIPPED
[INFO] Apache Atlas Hive Bridge ........................... SKIPPED
[INFO] Apache Atlas Falcon Bridge Shim .................... SKIPPED
[INFO] Apache Atlas Falcon Bridge ......................... SKIPPED
[INFO] Apache Atlas Sqoop Bridge Shim ..................... SKIPPED
[INFO] Apache Atlas Sqoop Bridge .......................... SKIPPED
[INFO] Apache Atlas Storm Bridge Shim ..................... SKIPPED
[INFO] Apache Atlas Storm Bridge .......................... SKIPPED
[INFO] Apache Atlas Distribution .......................... SKIPPED
[INFO] ------------------------------------------------------------------------
[INFO] BUILD FAILURE
[INFO] ------------------------------------------------------------------------
[INFO] Total time: 07:34 min
[INFO] Finished at: 2017-10-02T17:46:52Z
[INFO] Final Memory: 347M/2926M
[INFO] ------------------------------------------------------------------------
log4j:WARN No appenders could be found for logger (org.apache.zookeeper.ClientCnxn).
log4j:WARN Please initialize the log4j system properly.
log4j:WARN See http://logging.apache.org/log4j/1.2/faq.html#noconfig for more info.
[ERROR] Failed to execute goal org.apache.maven.plugins:maven-failsafe-plugin:2.19.1:verify
(verify) on project atlas-webapp: There are test failures.
[ERROR] 
[ERROR] Please refer to <https://builds.apache.org/job/Atlas-0.8-IntegrationTests/ws/webapp/target/failsafe-reports>
for the individual test results.
[ERROR] -> [Help 1]
[ERROR] 
[ERROR] To see the full stack trace of the errors, re-run Maven with the -e switch.
[ERROR] Re-run Maven using the -X switch to enable full debug logging.
[ERROR] 
[ERROR] For more information about the errors and possible solutions, please read the following
articles:
[ERROR] [Help 1] http://cwiki.apache.org/confluence/display/MAVEN/MojoFailureException
[ERROR] 
[ERROR] After correcting the problems, you can resume the build with the command
[ERROR]   mvn <goals> -rf :atlas-webapp
Build step 'Execute shell' marked build as failure
[CHECKSTYLE] Collecting checkstyle analysis files...
[CHECKSTYLE] Searching for all files in <https://builds.apache.org/job/Atlas-0.8-IntegrationTests/ws/>
that match the pattern **/target/checkstyle-result.xml
[CHECKSTYLE] Parsing 22 files in <https://builds.apache.org/job/Atlas-0.8-IntegrationTests/ws/>
[CHECKSTYLE] Successfully parsed file <https://builds.apache.org/job/Atlas-0.8-IntegrationTests/ws/authorization/target/checkstyle-result.xml>
with 467 unique warnings and 0 duplicates.
[CHECKSTYLE] Successfully parsed file <https://builds.apache.org/job/Atlas-0.8-IntegrationTests/ws/catalog/target/checkstyle-result.xml>
with 2604 unique warnings and 0 duplicates.
[CHECKSTYLE] Successfully parsed file <https://builds.apache.org/job/Atlas-0.8-IntegrationTests/ws/client/client-v1/target/checkstyle-result.xml>
with 3478 unique warnings and 0 duplicates.
[CHECKSTYLE] Successfully parsed file <https://builds.apache.org/job/Atlas-0.8-IntegrationTests/ws/client/client-v2/target/checkstyle-result.xml>
with 3803 unique warnings and 0 duplicates.
[CHECKSTYLE] Successfully parsed file <https://builds.apache.org/job/Atlas-0.8-IntegrationTests/ws/client/common/target/checkstyle-result.xml>
with 4263 unique warnings and 0 duplicates.
[CHECKSTYLE] Successfully parsed file <https://builds.apache.org/job/Atlas-0.8-IntegrationTests/ws/client/target/checkstyle-result.xml>
with 4263 unique warnings and 0 duplicates.
[CHECKSTYLE] Successfully parsed file <https://builds.apache.org/job/Atlas-0.8-IntegrationTests/ws/common/target/checkstyle-result.xml>
with 5218 unique warnings and 0 duplicates.
[CHECKSTYLE] Successfully parsed file <https://builds.apache.org/job/Atlas-0.8-IntegrationTests/ws/dashboardv2/target/checkstyle-result.xml>
with 5218 unique warnings and 0 duplicates.
[CHECKSTYLE] Successfully parsed file <https://builds.apache.org/job/Atlas-0.8-IntegrationTests/ws/graphdb/api/target/checkstyle-result.xml>
with 5491 unique warnings and 0 duplicates.
[CHECKSTYLE] Successfully parsed file <https://builds.apache.org/job/Atlas-0.8-IntegrationTests/ws/graphdb/common/target/checkstyle-result.xml>
with 5678 unique warnings and 0 duplicates.
[CHECKSTYLE] Successfully parsed file <https://builds.apache.org/job/Atlas-0.8-IntegrationTests/ws/graphdb/graphdb-impls/target/checkstyle-result.xml>
with 5678 unique warnings and 0 duplicates.
[CHECKSTYLE] Successfully parsed file <https://builds.apache.org/job/Atlas-0.8-IntegrationTests/ws/graphdb/target/checkstyle-result.xml>
with 5678 unique warnings and 0 duplicates.
[CHECKSTYLE] Successfully parsed file <https://builds.apache.org/job/Atlas-0.8-IntegrationTests/ws/graphdb/titan0/target/checkstyle-result.xml>
with 8080 unique warnings and 0 duplicates.
[CHECKSTYLE] Successfully parsed file <https://builds.apache.org/job/Atlas-0.8-IntegrationTests/ws/graphdb/titan1/target/checkstyle-result.xml>
with 9047 unique warnings and 0 duplicates.
[CHECKSTYLE] Successfully parsed file <https://builds.apache.org/job/Atlas-0.8-IntegrationTests/ws/intg/target/checkstyle-result.xml>
with 15769 unique warnings and 0 duplicates.
[CHECKSTYLE] Successfully parsed file <https://builds.apache.org/job/Atlas-0.8-IntegrationTests/ws/notification/target/checkstyle-result.xml>
with 17192 unique warnings and 0 duplicates.
[CHECKSTYLE] Successfully parsed file <https://builds.apache.org/job/Atlas-0.8-IntegrationTests/ws/repository/target/checkstyle-result.xml>
with 36068 unique warnings and 0 duplicates.
[CHECKSTYLE] Successfully parsed file <https://builds.apache.org/job/Atlas-0.8-IntegrationTests/ws/server-api/target/checkstyle-result.xml>
with 36447 unique warnings and 0 duplicates.
[CHECKSTYLE] Successfully parsed file <https://builds.apache.org/job/Atlas-0.8-IntegrationTests/ws/shaded/hbase-client-shaded/target/checkstyle-result.xml>
with 36447 unique warnings and 0 duplicates.
[CHECKSTYLE] Successfully parsed file <https://builds.apache.org/job/Atlas-0.8-IntegrationTests/ws/shaded/hbase-server-shaded/target/checkstyle-result.xml>
with 36447 unique warnings and 0 duplicates.
[CHECKSTYLE] Successfully parsed file <https://builds.apache.org/job/Atlas-0.8-IntegrationTests/ws/target/checkstyle-result.xml>
with 36447 unique warnings and 0 duplicates.
[CHECKSTYLE] Successfully parsed file <https://builds.apache.org/job/Atlas-0.8-IntegrationTests/ws/typesystem/target/checkstyle-result.xml>
with 40665 unique warnings and 0 duplicates.
<Git Blamer> Using GitBlamer to create author and commit information for all warnings.
<Git Blamer> GIT_COMMIT=b30444e5d328c3e6b4f0ba79cd2dcba8a3664188, workspace=<https://builds.apache.org/job/Atlas-0.8-IntegrationTests/ws/>
 > git rev-parse b30444e5d328c3e6b4f0ba79cd2dcba8a3664188^{commit} # timeout=10
<Git Blamer> Skipping file <https://builds.apache.org/job/Atlas-0.8-IntegrationTests/ws/typesystem/src/main/java/org/apache/atlas/typesystem/IStruct.java,>
no result found.
[FINDBUGS] Collecting findbugs analysis files...
[FINDBUGS] Searching for all files in <https://builds.apache.org/job/Atlas-0.8-IntegrationTests/ws/>
that match the pattern **/target/findbugs.xml
[FINDBUGS] Parsing 15 files in <https://builds.apache.org/job/Atlas-0.8-IntegrationTests/ws/>
[FINDBUGS] Successfully parsed file <https://builds.apache.org/job/Atlas-0.8-IntegrationTests/ws/authorization/target/findbugs.xml>
with 0 unique warnings and 0 duplicates.
[FINDBUGS] Successfully parsed file <https://builds.apache.org/job/Atlas-0.8-IntegrationTests/ws/catalog/target/findbugs.xml>
with 0 unique warnings and 0 duplicates.
[FINDBUGS] Successfully parsed file <https://builds.apache.org/job/Atlas-0.8-IntegrationTests/ws/client/client-v1/target/findbugs.xml>
with 0 unique warnings and 0 duplicates.
[FINDBUGS] Successfully parsed file <https://builds.apache.org/job/Atlas-0.8-IntegrationTests/ws/client/client-v2/target/findbugs.xml>
with 0 unique warnings and 0 duplicates.
[FINDBUGS] Successfully parsed file <https://builds.apache.org/job/Atlas-0.8-IntegrationTests/ws/client/common/target/findbugs.xml>
with 0 unique warnings and 0 duplicates.
[FINDBUGS] Successfully parsed file <https://builds.apache.org/job/Atlas-0.8-IntegrationTests/ws/common/target/findbugs.xml>
with 0 unique warnings and 0 duplicates.
[FINDBUGS] Successfully parsed file <https://builds.apache.org/job/Atlas-0.8-IntegrationTests/ws/graphdb/api/target/findbugs.xml>
with 0 unique warnings and 0 duplicates.
[FINDBUGS] Successfully parsed file <https://builds.apache.org/job/Atlas-0.8-IntegrationTests/ws/graphdb/common/target/findbugs.xml>
with 0 unique warnings and 0 duplicates.
[FINDBUGS] Successfully parsed file <https://builds.apache.org/job/Atlas-0.8-IntegrationTests/ws/graphdb/titan0/target/findbugs.xml>
with 0 unique warnings and 0 duplicates.
[FINDBUGS] Successfully parsed file <https://builds.apache.org/job/Atlas-0.8-IntegrationTests/ws/graphdb/titan1/target/findbugs.xml>
with 0 unique warnings and 0 duplicates.
[FINDBUGS] Successfully parsed file <https://builds.apache.org/job/Atlas-0.8-IntegrationTests/ws/intg/target/findbugs.xml>
with 0 unique warnings and 0 duplicates.
[FINDBUGS] Successfully parsed file <https://builds.apache.org/job/Atlas-0.8-IntegrationTests/ws/notification/target/findbugs.xml>
with 0 unique warnings and 0 duplicates.
[FINDBUGS] Successfully parsed file <https://builds.apache.org/job/Atlas-0.8-IntegrationTests/ws/repository/target/findbugs.xml>
with 0 unique warnings and 0 duplicates.
[FINDBUGS] Successfully parsed file <https://builds.apache.org/job/Atlas-0.8-IntegrationTests/ws/server-api/target/findbugs.xml>
with 0 unique warnings and 0 duplicates.
[FINDBUGS] Successfully parsed file <https://builds.apache.org/job/Atlas-0.8-IntegrationTests/ws/typesystem/target/findbugs.xml>
with 0 unique warnings and 0 duplicates.
<Git Blamer> Using GitBlamer to create author and commit information for all warnings.
<Git Blamer> GIT_COMMIT=b30444e5d328c3e6b4f0ba79cd2dcba8a3664188, workspace=<https://builds.apache.org/job/Atlas-0.8-IntegrationTests/ws/>
Archiving artifacts
[Fast Archiver] No prior successful build to compare, so performing full copy of artifacts
TestNG Reports Processing: START
Looking for TestNG results report in workspace using pattern: **/target/surefire-reports/testng-results.xml,**/target/failsafe-reports/testng-results.xml
Saving reports...
Processing '/x1/jenkins/jenkins-home/jobs/Atlas-0.8-IntegrationTests/builds/93/testng/testng-results.xml'
9.022556% of tests failed, which exceeded threshold of 0%. Marking build as UNSTABLE
TestNG Reports Processing: FINISH

Mime
View raw message