atlas-dev mailing list archives

Site index · List index
Message view « Date » · « Thread »
Top « Date » · « Thread »
From Apache Jenkins Server <jenk...@builds.apache.org>
Subject Build failed in Jenkins: Atlas-0.8-IntegrationTests #109
Date Fri, 13 Oct 2017 17:31:08 GMT
See <https://builds.apache.org/job/Atlas-0.8-IntegrationTests/109/display/redirect?page=changes>

Changes:

[madhan] ATLAS-2166 - Block Knox proxy service user for kerberos authentication

------------------------------------------
[...truncated 74.41 MB...]
[INFO] atlas-client-v1 .................................... SUCCESS [ 11.501 s]
[INFO] Apache Atlas Server API ............................ SUCCESS [  9.994 s]
[INFO] Apache Atlas Notification .......................... SUCCESS [ 17.556 s]
[INFO] atlas-client-v2 .................................... SUCCESS [  9.897 s]
[INFO] Apache Atlas Graph Database Projects ............... SUCCESS [  0.705 s]
[INFO] Apache Atlas Graph Database API .................... SUCCESS [  8.847 s]
[INFO] Graph Database Common Code ......................... SUCCESS [  8.829 s]
[INFO] Apache Atlas Titan 1.0.0 GraphDB Impl .............. SUCCESS [ 51.111 s]
[INFO] Shaded version of Apache hbase client .............. SUCCESS [ 10.681 s]
[INFO] Apache Atlas Titan 0.5.4 Graph DB Impl ............. SUCCESS [ 51.190 s]
[INFO] Apache Atlas Graph Database Implementation Dependencies SUCCESS [  0.828 s]
[INFO] Shaded version of Apache hbase server .............. SUCCESS [ 28.968 s]
[INFO] Apache Atlas Repository ............................ SUCCESS [02:04 min]
[INFO] Apache Atlas Authorization ......................... SUCCESS [ 10.433 s]
[INFO] Apache Atlas Business Catalog ...................... SUCCESS [ 16.258 s]
[INFO] Apache Atlas UI .................................... SUCCESS [01:51 min]
[INFO] Apache Atlas Web Application ....................... SUCCESS [05:57 min]
[INFO] Apache Atlas Documentation ......................... SUCCESS [  7.895 s]
[INFO] Apache Atlas FileSystem Model ...................... SUCCESS [  2.111 s]
[INFO] Apache Atlas Plugin Classloader .................... SUCCESS [ 10.217 s]
[INFO] Apache Atlas Hive Bridge Shim ...................... SUCCESS [  8.456 s]
[INFO] Apache Atlas Hive Bridge ........................... FAILURE [07:08 min]
[INFO] Apache Atlas Falcon Bridge Shim .................... SKIPPED
[INFO] Apache Atlas Falcon Bridge ......................... SKIPPED
[INFO] Apache Atlas Sqoop Bridge Shim ..................... SKIPPED
[INFO] Apache Atlas Sqoop Bridge .......................... SKIPPED
[INFO] Apache Atlas Storm Bridge Shim ..................... SKIPPED
[INFO] Apache Atlas Storm Bridge .......................... SKIPPED
[INFO] Apache Atlas Distribution .......................... SKIPPED
[INFO] ------------------------------------------------------------------------
[INFO] BUILD FAILURE
[INFO] ------------------------------------------------------------------------
[INFO] Total time: 23:57 min
[INFO] Finished at: 2017-10-13T17:25:28Z
[INFO] Final Memory: 605M/3271M
[INFO] ------------------------------------------------------------------------
2017-10-13 17:25:30,904 DEBUG - [Curator-Framework-0-SendThread(localhost:19026):] ~ ==>
InMemoryJAASConfiguration.getAppConfigurationEntry(Client) (InMemoryJAASConfiguration:208)
2017-10-13 17:25:30,904 DEBUG - [main-SendThread(localhost:19026):] ~ ==> InMemoryJAASConfiguration.getAppConfigurationEntry(Client)
(InMemoryJAASConfiguration:208)
2017-10-13 17:25:30,905 DEBUG - [main-SendThread(localhost:19026):] ~ <== InMemoryJAASConfiguration.getAppConfigurationEntry(Client):
{} (InMemoryJAASConfiguration:238)
2017-10-13 17:25:30,906 DEBUG - [Curator-Framework-0-SendThread(localhost:19026):] ~ <==
InMemoryJAASConfiguration.getAppConfigurationEntry(Client): {} (InMemoryJAASConfiguration:238)
2017-10-13 17:25:30,907 WARN  - [main-SendThread(localhost:19026):] ~ Session 0x15f16bfaebb0002
for server null, unexpected error, closing socket connection and attempting reconnect (ClientCnxn$SendThread:1102)
java.net.ConnectException: Connection refused
	at sun.nio.ch.SocketChannelImpl.checkConnect(Native Method)
	at sun.nio.ch.SocketChannelImpl.finishConnect(SocketChannelImpl.java:717)
	at org.apache.zookeeper.ClientCnxnSocketNIO.doTransport(ClientCnxnSocketNIO.java:361)
	at org.apache.zookeeper.ClientCnxn$SendThread.run(ClientCnxn.java:1081)
[ERROR] Failed to execute goal org.apache.maven.plugins:maven-failsafe-plugin:2.19.1:verify
(verify) on project hive-bridge: There are test failures.
[ERROR] 
[ERROR] Please refer to <https://builds.apache.org/job/Atlas-0.8-IntegrationTests/ws/addons/hive-bridge/target/failsafe-reports>
for the individual test results.
[ERROR] -> [Help 1]
[ERROR] 
[ERROR] To see the full stack trace of the errors, re-run Maven with the -e switch.
[ERROR] Re-run Maven using the -X switch to enable full debug logging.
[ERROR] 
[ERROR] For more information about the errors and possible solutions, please read the following
articles:
[ERROR] [Help 1] http://cwiki.apache.org/confluence/display/MAVEN/MojoFailureException
[ERROR] 
[ERROR] After correcting the problems, you can resume the build with the command
[ERROR]   mvn <goals> -rf :hive-bridge
2017-10-13 17:25:31,230 DEBUG - [Curator-Framework-0-SendThread(localhost:19026):] ~ ==>
InMemoryJAASConfiguration.getAppConfigurationEntry(Client) (InMemoryJAASConfiguration:208)
2017-10-13 17:25:31,231 DEBUG - [Curator-Framework-0-SendThread(localhost:19026):] ~ <==
InMemoryJAASConfiguration.getAppConfigurationEntry(Client): {} (InMemoryJAASConfiguration:238)
2017-10-13 17:25:31,327 DEBUG - [main-SendThread(localhost:19026):] ~ ==> InMemoryJAASConfiguration.getAppConfigurationEntry(Client)
(InMemoryJAASConfiguration:208)
2017-10-13 17:25:31,328 DEBUG - [main-SendThread(localhost:19026):] ~ <== InMemoryJAASConfiguration.getAppConfigurationEntry(Client):
{} (InMemoryJAASConfiguration:238)
2017-10-13 17:25:31,328 WARN  - [main-SendThread(localhost:19026):] ~ Session 0x15f16bfaebb0002
for server null, unexpected error, closing socket connection and attempting reconnect (ClientCnxn$SendThread:1102)
java.net.ConnectException: Connection refused
	at sun.nio.ch.SocketChannelImpl.checkConnect(Native Method)
	at sun.nio.ch.SocketChannelImpl.finishConnect(SocketChannelImpl.java:717)
	at org.apache.zookeeper.ClientCnxnSocketNIO.doTransport(ClientCnxnSocketNIO.java:361)
	at org.apache.zookeeper.ClientCnxn$SendThread.run(ClientCnxn.java:1081)
2017-10-13 17:25:31,616 ERROR - [main:] ~ Could not commit transaction [373] due to storage
exception in commit (StandardTitanGraph:673)
com.thinkaurelius.titan.core.TitanException: Could not execute operation due to backend exception
	at com.thinkaurelius.titan.diskstorage.util.BackendOperation.execute(BackendOperation.java:44)
	at com.thinkaurelius.titan.diskstorage.keycolumnvalue.cache.CacheTransaction.persist(CacheTransaction.java:86)
	at com.thinkaurelius.titan.diskstorage.keycolumnvalue.cache.CacheTransaction.flushInternal(CacheTransaction.java:140)
	at com.thinkaurelius.titan.diskstorage.keycolumnvalue.cache.CacheTransaction.commit(CacheTransaction.java:197)
	at com.thinkaurelius.titan.diskstorage.BackendTransaction.commitStorage(BackendTransaction.java:117)
	at com.thinkaurelius.titan.graphdb.database.StandardTitanGraph.commit(StandardTitanGraph.java:670)
	at com.thinkaurelius.titan.graphdb.transaction.StandardTitanTx.commit(StandardTitanTx.java:1337)
	at com.thinkaurelius.titan.graphdb.blueprints.TitanBlueprintsGraph.shutdown(TitanBlueprintsGraph.java:120)
	at com.thinkaurelius.titan.graphdb.database.StandardTitanGraph.shutdownInternal(StandardTitanGraph.java:171)
	at com.thinkaurelius.titan.graphdb.database.StandardTitanGraph.access$700(StandardTitanGraph.java:75)
	at com.thinkaurelius.titan.graphdb.database.StandardTitanGraph$ShutdownThread.start(StandardTitanGraph.java:756)
	at java.lang.ApplicationShutdownHooks.runHooks(ApplicationShutdownHooks.java:102)
	at java.lang.ApplicationShutdownHooks$1.run(ApplicationShutdownHooks.java:46)
	at java.lang.Shutdown.runHooks(Shutdown.java:123)
	at java.lang.Shutdown.sequence(Shutdown.java:167)
	at java.lang.Shutdown.exit(Shutdown.java:212)
	at java.lang.Runtime.exit(Runtime.java:109)
	at java.lang.System.exit(System.java:971)
	at org.codehaus.plexus.classworlds.launcher.Launcher.main(Launcher.java:358)
Caused by: com.thinkaurelius.titan.diskstorage.PermanentBackendException: Permanent failure
in storage backend
	at com.thinkaurelius.titan.diskstorage.berkeleyje.BerkeleyJEKeyValueStore.insert(BerkeleyJEKeyValueStore.java:206)
	at com.thinkaurelius.titan.diskstorage.berkeleyje.BerkeleyJEKeyValueStore.insert(BerkeleyJEKeyValueStore.java:183)
	at com.thinkaurelius.titan.diskstorage.berkeleyje.BerkeleyJEStoreManager.mutateMany(BerkeleyJEStoreManager.java:193)
	at com.thinkaurelius.titan.diskstorage.keycolumnvalue.keyvalue.OrderedKeyValueStoreManagerAdapter.mutateMany(OrderedKeyValueStoreManagerAdapter.java:100)
	at com.thinkaurelius.titan.diskstorage.keycolumnvalue.cache.CacheTransaction$1.call(CacheTransaction.java:89)
	at com.thinkaurelius.titan.diskstorage.keycolumnvalue.cache.CacheTransaction$1.call(CacheTransaction.java:86)
	at com.thinkaurelius.titan.diskstorage.util.BackendOperation.executeDirect(BackendOperation.java:56)
	at com.thinkaurelius.titan.diskstorage.util.BackendOperation.execute(BackendOperation.java:42)
	... 18 more
Caused by: com.sleepycat.je.LockTimeoutException: (JE 5.0.73) Lock expired. Locker 1098159454
13588_NotificationHookConsumer thread-0_Txn: waited for lock on database=edgestore LockAddr:1257068385
LSN=0x0/0x5bed8c type=WRITE grant=WAIT_PROMOTION timeoutMillis=500 startTime=1507915531116
endTime=1507915531616
Owners: [<LockInfo locker="815785355 13561_qtp1562842273-822_Txn" type="READ"/>, <LockInfo
locker="1098159454 13588_NotificationHookConsumer thread-0_Txn" type="READ"/>, <LockInfo
locker="1083502009 13523_qtp1562842273-816_Txn" type="READ"/>, <LockInfo locker="287826861
13559_qtp1562842273-821_Txn" type="READ"/>]
Waiters: []
Transaction 1098159454 13588_NotificationHookConsumer thread-0_Txn owns LockAddr:1257068385
<LockInfo locker="1098159454 13588_NotificationHookConsumer thread-0_Txn" type="READ"/>
Transaction 1098159454 13588_NotificationHookConsumer thread-0_Txn waits for LockAddr:1257068385

	at com.sleepycat.je.txn.LockManager.newLockTimeoutException(LockManager.java:664)
	at com.sleepycat.je.txn.LockManager.makeTimeoutMsgInternal(LockManager.java:623)
	at com.sleepycat.je.txn.SyncedLockManager.makeTimeoutMsg(SyncedLockManager.java:97)
	at com.sleepycat.je.txn.LockManager.lockInternal(LockManager.java:390)
	at com.sleepycat.je.txn.LockManager.lock(LockManager.java:276)
	at com.sleepycat.je.txn.Txn.lockInternal(Txn.java:498)
	at com.sleepycat.je.txn.Locker.lock(Locker.java:443)
	at com.sleepycat.je.dbi.CursorImpl.lockLN(CursorImpl.java:2621)
	at com.sleepycat.je.dbi.CursorImpl.getSlotReuseInfo(CursorImpl.java:1091)
	at com.sleepycat.je.dbi.CursorImpl.putInternal(CursorImpl.java:880)
	at com.sleepycat.je.dbi.CursorImpl.put(CursorImpl.java:811)
	at com.sleepycat.je.Cursor.putAllowPhantoms(Cursor.java:2243)
	at com.sleepycat.je.Cursor.putNoNotify(Cursor.java:2200)
	at com.sleepycat.je.Cursor.putNotify(Cursor.java:2117)
	at com.sleepycat.je.Cursor.putNoDups(Cursor.java:2052)
	at com.sleepycat.je.Cursor.putInternal(Cursor.java:2020)
	at com.sleepycat.je.Database.putInternal(Database.java:1302)
	at com.sleepycat.je.Database.put(Database.java:1172)
	at com.thinkaurelius.titan.diskstorage.berkeleyje.BerkeleyJEKeyValueStore.insert(BerkeleyJEKeyValueStore.java:194)
	... 25 more
2017-10-13 17:25:31,617 ERROR - [main:] ~ Could not commit transaction [373] due to exception
(StandardTitanGraph:731)
com.thinkaurelius.titan.core.TitanException: Could not execute operation due to backend exception
	at com.thinkaurelius.titan.diskstorage.util.BackendOperation.execute(BackendOperation.java:44)
	at com.thinkaurelius.titan.diskstorage.keycolumnvalue.cache.CacheTransaction.persist(CacheTransaction.java:86)
	at com.thinkaurelius.titan.diskstorage.keycolumnvalue.cache.CacheTransaction.flushInternal(CacheTransaction.java:140)
	at com.thinkaurelius.titan.diskstorage.keycolumnvalue.cache.CacheTransaction.commit(CacheTransaction.java:197)
	at com.thinkaurelius.titan.diskstorage.BackendTransaction.commitStorage(BackendTransaction.java:117)
	at com.thinkaurelius.titan.graphdb.database.StandardTitanGraph.commit(StandardTitanGraph.java:670)
	at com.thinkaurelius.titan.graphdb.transaction.StandardTitanTx.commit(StandardTitanTx.java:1337)
	at com.thinkaurelius.titan.graphdb.blueprints.TitanBlueprintsGraph.shutdown(TitanBlueprintsGraph.java:120)
	at com.thinkaurelius.titan.graphdb.database.StandardTitanGraph.shutdownInternal(StandardTitanGraph.java:171)
	at com.thinkaurelius.titan.graphdb.database.StandardTitanGraph.access$700(StandardTitanGraph.java:75)
	at com.thinkaurelius.titan.graphdb.database.StandardTitanGraph$ShutdownThread.start(StandardTitanGraph.java:756)
	at java.lang.ApplicationShutdownHooks.runHooks(ApplicationShutdownHooks.java:102)
	at java.lang.ApplicationShutdownHooks$1.run(ApplicationShutdownHooks.java:46)
	at java.lang.Shutdown.runHooks(Shutdown.java:123)
	at java.lang.Shutdown.sequence(Shutdown.java:167)
	at java.lang.Shutdown.exit(Shutdown.java:212)
	at java.lang.Runtime.exit(Runtime.java:109)
	at java.lang.System.exit(System.java:971)
	at org.codehaus.plexus.classworlds.launcher.Launcher.main(Launcher.java:358)
Caused by: com.thinkaurelius.titan.diskstorage.PermanentBackendException: Permanent failure
in storage backend
	at com.thinkaurelius.titan.diskstorage.berkeleyje.BerkeleyJEKeyValueStore.insert(BerkeleyJEKeyValueStore.java:206)
	at com.thinkaurelius.titan.diskstorage.berkeleyje.BerkeleyJEKeyValueStore.insert(BerkeleyJEKeyValueStore.java:183)
	at com.thinkaurelius.titan.diskstorage.berkeleyje.BerkeleyJEStoreManager.mutateMany(BerkeleyJEStoreManager.java:193)
	at com.thinkaurelius.titan.diskstorage.keycolumnvalue.keyvalue.OrderedKeyValueStoreManagerAdapter.mutateMany(OrderedKeyValueStoreManagerAdapter.java:100)
	at com.thinkaurelius.titan.diskstorage.keycolumnvalue.cache.CacheTransaction$1.call(CacheTransaction.java:89)
	at com.thinkaurelius.titan.diskstorage.keycolumnvalue.cache.CacheTransaction$1.call(CacheTransaction.java:86)
	at com.thinkaurelius.titan.diskstorage.util.BackendOperation.executeDirect(BackendOperation.java:56)
	at com.thinkaurelius.titan.diskstorage.util.BackendOperation.execute(BackendOperation.java:42)
	... 18 more
Caused by: com.sleepycat.je.LockTimeoutException: (JE 5.0.73) Lock expired. Locker 1098159454
13588_NotificationHookConsumer thread-0_Txn: waited for lock on database=edgestore LockAddr:1257068385
LSN=0x0/0x5bed8c type=WRITE grant=WAIT_PROMOTION timeoutMillis=500 startTime=1507915531116
endTime=1507915531616
Owners: [<LockInfo locker="815785355 13561_qtp1562842273-822_Txn" type="READ"/>, <LockInfo
locker="1098159454 13588_NotificationHookConsumer thread-0_Txn" type="READ"/>, <LockInfo
locker="1083502009 13523_qtp1562842273-816_Txn" type="READ"/>, <LockInfo locker="287826861
13559_qtp1562842273-821_Txn" type="READ"/>]
Waiters: []
Transaction 1098159454 13588_NotificationHookConsumer thread-0_Txn owns LockAddr:1257068385
<LockInfo locker="1098159454 13588_NotificationHookConsumer thread-0_Txn" type="READ"/>
Transaction 1098159454 13588_NotificationHookConsumer thread-0_Txn waits for LockAddr:1257068385

	at com.sleepycat.je.txn.LockManager.newLockTimeoutException(LockManager.java:664)
	at com.sleepycat.je.txn.LockManager.makeTimeoutMsgInternal(LockManager.java:623)
	at com.sleepycat.je.txn.SyncedLockManager.makeTimeoutMsg(SyncedLockManager.java:97)
	at com.sleepycat.je.txn.LockManager.lockInternal(LockManager.java:390)
	at com.sleepycat.je.txn.LockManager.lock(LockManager.java:276)
	at com.sleepycat.je.txn.Txn.lockInternal(Txn.java:498)
	at com.sleepycat.je.txn.Locker.lock(Locker.java:443)
	at com.sleepycat.je.dbi.CursorImpl.lockLN(CursorImpl.java:2621)
	at com.sleepycat.je.dbi.CursorImpl.getSlotReuseInfo(CursorImpl.java:1091)
	at com.sleepycat.je.dbi.CursorImpl.putInternal(CursorImpl.java:880)
	at com.sleepycat.je.dbi.CursorImpl.put(CursorImpl.java:811)
	at com.sleepycat.je.Cursor.putAllowPhantoms(Cursor.java:2243)
	at com.sleepycat.je.Cursor.putNoNotify(Cursor.java:2200)
	at com.sleepycat.je.Cursor.putNotify(Cursor.java:2117)
	at com.sleepycat.je.Cursor.putNoDups(Cursor.java:2052)
	at com.sleepycat.je.Cursor.putInternal(Cursor.java:2020)
	at com.sleepycat.je.Database.putInternal(Database.java:1302)
	at com.sleepycat.je.Database.put(Database.java:1172)
	at com.thinkaurelius.titan.diskstorage.berkeleyje.BerkeleyJEKeyValueStore.insert(BerkeleyJEKeyValueStore.java:194)
	... 25 more
Build step 'Execute shell' marked build as failure
[CHECKSTYLE] Collecting checkstyle analysis files...
[CHECKSTYLE] Searching for all files in <https://builds.apache.org/job/Atlas-0.8-IntegrationTests/ws/>
that match the pattern **/target/checkstyle-result.xml
[CHECKSTYLE] Parsing 27 files in <https://builds.apache.org/job/Atlas-0.8-IntegrationTests/ws/>
[CHECKSTYLE] Successfully parsed file <https://builds.apache.org/job/Atlas-0.8-IntegrationTests/ws/addons/hdfs-model/target/checkstyle-result.xml>
with 0 unique warnings and 0 duplicates.
[CHECKSTYLE] Successfully parsed file <https://builds.apache.org/job/Atlas-0.8-IntegrationTests/ws/addons/hive-bridge-shim/target/checkstyle-result.xml>
with 15 unique warnings and 0 duplicates.
[CHECKSTYLE] Successfully parsed file <https://builds.apache.org/job/Atlas-0.8-IntegrationTests/ws/authorization/target/checkstyle-result.xml>
with 482 unique warnings and 0 duplicates.
[CHECKSTYLE] Successfully parsed file <https://builds.apache.org/job/Atlas-0.8-IntegrationTests/ws/catalog/target/checkstyle-result.xml>
with 2619 unique warnings and 0 duplicates.
[CHECKSTYLE] Successfully parsed file <https://builds.apache.org/job/Atlas-0.8-IntegrationTests/ws/client/client-v1/target/checkstyle-result.xml>
with 3493 unique warnings and 0 duplicates.
[CHECKSTYLE] Successfully parsed file <https://builds.apache.org/job/Atlas-0.8-IntegrationTests/ws/client/client-v2/target/checkstyle-result.xml>
with 3818 unique warnings and 0 duplicates.
[CHECKSTYLE] Successfully parsed file <https://builds.apache.org/job/Atlas-0.8-IntegrationTests/ws/client/common/target/checkstyle-result.xml>
with 4278 unique warnings and 0 duplicates.
[CHECKSTYLE] Successfully parsed file <https://builds.apache.org/job/Atlas-0.8-IntegrationTests/ws/client/target/checkstyle-result.xml>
with 4278 unique warnings and 0 duplicates.
[CHECKSTYLE] Successfully parsed file <https://builds.apache.org/job/Atlas-0.8-IntegrationTests/ws/common/target/checkstyle-result.xml>
with 5237 unique warnings and 0 duplicates.
[CHECKSTYLE] Successfully parsed file <https://builds.apache.org/job/Atlas-0.8-IntegrationTests/ws/dashboardv2/target/checkstyle-result.xml>
with 5237 unique warnings and 0 duplicates.
[CHECKSTYLE] Successfully parsed file <https://builds.apache.org/job/Atlas-0.8-IntegrationTests/ws/docs/target/checkstyle-result.xml>
with 5237 unique warnings and 0 duplicates.
[CHECKSTYLE] Successfully parsed file <https://builds.apache.org/job/Atlas-0.8-IntegrationTests/ws/graphdb/api/target/checkstyle-result.xml>
with 5510 unique warnings and 0 duplicates.
[CHECKSTYLE] Successfully parsed file <https://builds.apache.org/job/Atlas-0.8-IntegrationTests/ws/graphdb/common/target/checkstyle-result.xml>
with 5697 unique warnings and 0 duplicates.
[CHECKSTYLE] Successfully parsed file <https://builds.apache.org/job/Atlas-0.8-IntegrationTests/ws/graphdb/graphdb-impls/target/checkstyle-result.xml>
with 5697 unique warnings and 0 duplicates.
[CHECKSTYLE] Successfully parsed file <https://builds.apache.org/job/Atlas-0.8-IntegrationTests/ws/graphdb/target/checkstyle-result.xml>
with 5697 unique warnings and 0 duplicates.
[CHECKSTYLE] Successfully parsed file <https://builds.apache.org/job/Atlas-0.8-IntegrationTests/ws/graphdb/titan0/target/checkstyle-result.xml>
with 8099 unique warnings and 0 duplicates.
[CHECKSTYLE] Successfully parsed file <https://builds.apache.org/job/Atlas-0.8-IntegrationTests/ws/graphdb/titan1/target/checkstyle-result.xml>
with 9066 unique warnings and 0 duplicates.
[CHECKSTYLE] Successfully parsed file <https://builds.apache.org/job/Atlas-0.8-IntegrationTests/ws/intg/target/checkstyle-result.xml>
with 15788 unique warnings and 0 duplicates.
[CHECKSTYLE] Successfully parsed file <https://builds.apache.org/job/Atlas-0.8-IntegrationTests/ws/notification/target/checkstyle-result.xml>
with 17353 unique warnings and 0 duplicates.
[CHECKSTYLE] Successfully parsed file <https://builds.apache.org/job/Atlas-0.8-IntegrationTests/ws/plugin-classloader/target/checkstyle-result.xml>
with 17466 unique warnings and 0 duplicates.
[CHECKSTYLE] Successfully parsed file <https://builds.apache.org/job/Atlas-0.8-IntegrationTests/ws/repository/target/checkstyle-result.xml>
with 36343 unique warnings and 0 duplicates.
[CHECKSTYLE] Successfully parsed file <https://builds.apache.org/job/Atlas-0.8-IntegrationTests/ws/server-api/target/checkstyle-result.xml>
with 36722 unique warnings and 0 duplicates.
[CHECKSTYLE] Successfully parsed file <https://builds.apache.org/job/Atlas-0.8-IntegrationTests/ws/shaded/hbase-client-shaded/target/checkstyle-result.xml>
with 36722 unique warnings and 0 duplicates.
[CHECKSTYLE] Successfully parsed file <https://builds.apache.org/job/Atlas-0.8-IntegrationTests/ws/shaded/hbase-server-shaded/target/checkstyle-result.xml>
with 36722 unique warnings and 0 duplicates.
[CHECKSTYLE] Successfully parsed file <https://builds.apache.org/job/Atlas-0.8-IntegrationTests/ws/target/checkstyle-result.xml>
with 36722 unique warnings and 0 duplicates.
[CHECKSTYLE] Successfully parsed file <https://builds.apache.org/job/Atlas-0.8-IntegrationTests/ws/typesystem/target/checkstyle-result.xml>
with 40940 unique warnings and 0 duplicates.
[CHECKSTYLE] Successfully parsed file <https://builds.apache.org/job/Atlas-0.8-IntegrationTests/ws/webapp/target/checkstyle-result.xml>
with 49183 unique warnings and 0 duplicates.
<Git Blamer> Using GitBlamer to create author and commit information for all warnings.
<Git Blamer> GIT_COMMIT=59fe7d56e695748301ed5f6abff980a95c9f6727, workspace=<https://builds.apache.org/job/Atlas-0.8-IntegrationTests/ws/>
 > git rev-parse 59fe7d56e695748301ed5f6abff980a95c9f6727^{commit} # timeout=10
[FINDBUGS] Collecting findbugs analysis files...
[FINDBUGS] Searching for all files in <https://builds.apache.org/job/Atlas-0.8-IntegrationTests/ws/>
that match the pattern **/target/findbugs.xml
[FINDBUGS] Parsing 18 files in <https://builds.apache.org/job/Atlas-0.8-IntegrationTests/ws/>
[FINDBUGS] Successfully parsed file <https://builds.apache.org/job/Atlas-0.8-IntegrationTests/ws/addons/hive-bridge-shim/target/findbugs.xml>
with 0 unique warnings and 0 duplicates.
[FINDBUGS] Successfully parsed file <https://builds.apache.org/job/Atlas-0.8-IntegrationTests/ws/authorization/target/findbugs.xml>
with 0 unique warnings and 0 duplicates.
[FINDBUGS] Successfully parsed file <https://builds.apache.org/job/Atlas-0.8-IntegrationTests/ws/catalog/target/findbugs.xml>
with 0 unique warnings and 0 duplicates.
[FINDBUGS] Successfully parsed file <https://builds.apache.org/job/Atlas-0.8-IntegrationTests/ws/client/client-v1/target/findbugs.xml>
with 0 unique warnings and 0 duplicates.
[FINDBUGS] Successfully parsed file <https://builds.apache.org/job/Atlas-0.8-IntegrationTests/ws/client/client-v2/target/findbugs.xml>
with 0 unique warnings and 0 duplicates.
[FINDBUGS] Successfully parsed file <https://builds.apache.org/job/Atlas-0.8-IntegrationTests/ws/client/common/target/findbugs.xml>
with 0 unique warnings and 0 duplicates.
[FINDBUGS] Successfully parsed file <https://builds.apache.org/job/Atlas-0.8-IntegrationTests/ws/common/target/findbugs.xml>
with 0 unique warnings and 0 duplicates.
[FINDBUGS] Successfully parsed file <https://builds.apache.org/job/Atlas-0.8-IntegrationTests/ws/graphdb/api/target/findbugs.xml>
with 0 unique warnings and 0 duplicates.
[FINDBUGS] Successfully parsed file <https://builds.apache.org/job/Atlas-0.8-IntegrationTests/ws/graphdb/common/target/findbugs.xml>
with 0 unique warnings and 0 duplicates.
[FINDBUGS] Successfully parsed file <https://builds.apache.org/job/Atlas-0.8-IntegrationTests/ws/graphdb/titan0/target/findbugs.xml>
with 0 unique warnings and 0 duplicates.
[FINDBUGS] Successfully parsed file <https://builds.apache.org/job/Atlas-0.8-IntegrationTests/ws/graphdb/titan1/target/findbugs.xml>
with 0 unique warnings and 0 duplicates.
[FINDBUGS] Successfully parsed file <https://builds.apache.org/job/Atlas-0.8-IntegrationTests/ws/intg/target/findbugs.xml>
with 0 unique warnings and 0 duplicates.
[FINDBUGS] Successfully parsed file <https://builds.apache.org/job/Atlas-0.8-IntegrationTests/ws/notification/target/findbugs.xml>
with 0 unique warnings and 0 duplicates.
[FINDBUGS] Successfully parsed file <https://builds.apache.org/job/Atlas-0.8-IntegrationTests/ws/plugin-classloader/target/findbugs.xml>
with 0 unique warnings and 0 duplicates.
[FINDBUGS] Successfully parsed file <https://builds.apache.org/job/Atlas-0.8-IntegrationTests/ws/repository/target/findbugs.xml>
with 0 unique warnings and 0 duplicates.
[FINDBUGS] Successfully parsed file <https://builds.apache.org/job/Atlas-0.8-IntegrationTests/ws/server-api/target/findbugs.xml>
with 0 unique warnings and 0 duplicates.
[FINDBUGS] Successfully parsed file <https://builds.apache.org/job/Atlas-0.8-IntegrationTests/ws/typesystem/target/findbugs.xml>
with 0 unique warnings and 0 duplicates.
[FINDBUGS] Successfully parsed file <https://builds.apache.org/job/Atlas-0.8-IntegrationTests/ws/webapp/target/findbugs.xml>
with 0 unique warnings and 0 duplicates.
<Git Blamer> Using GitBlamer to create author and commit information for all warnings.
<Git Blamer> GIT_COMMIT=59fe7d56e695748301ed5f6abff980a95c9f6727, workspace=<https://builds.apache.org/job/Atlas-0.8-IntegrationTests/ws/>
Archiving artifacts
[Fast Archiver] No prior successful build to compare, so performing full copy of artifacts
TestNG Reports Processing: START
Looking for TestNG results report in workspace using pattern: **/target/surefire-reports/testng-results.xml,**/target/failsafe-reports/testng-results.xml
Saving reports...
Processing '/x1/jenkins/jenkins-home/jobs/Atlas-0.8-IntegrationTests/builds/109/testng/testng-results-1.xml'
Processing '/x1/jenkins/jenkins-home/jobs/Atlas-0.8-IntegrationTests/builds/109/testng/testng-results.xml'
17.977528% of tests failed, which exceeded threshold of 0%. Marking build as UNSTABLE
TestNG Reports Processing: FINISH

Mime
View raw message