atlas-dev mailing list archives

Site index · List index
Message view « Date » · « Thread »
Top « Date » · « Thread »
From Apache Jenkins Server <jenk...@builds.apache.org>
Subject Build failed in Jenkins: Atlas-master-UnitTests #149
Date Fri, 27 Oct 2017 22:03:22 GMT
See <https://builds.apache.org/job/Atlas-master-UnitTests/149/display/redirect?page=changes>

Changes:

[ssubramanian] ATLAS-1757: Introduce JanusGraph 0.1.1 graph store in atlas

------------------------------------------
[...truncated 164.51 KB...]
[INFO] Including org.apache.hbase:hbase-hadoop2-compat:jar:1.1.2 in the shaded jar.
[INFO] Including com.yammer.metrics:metrics-core:jar:2.2.0 in the shaded jar.
[INFO] Including com.google.guava:guava:jar:12.0.1 in the shaded jar.
[INFO] Including com.google.code.findbugs:jsr305:jar:1.3.9 in the shaded jar.
[INFO] Including com.google.protobuf:protobuf-java:jar:2.5.0 in the shaded jar.
[INFO] Including com.sun.jersey:jersey-core:jar:1.19 in the shaded jar.
[INFO] Including javax.ws.rs:jsr311-api:jar:1.1.1 in the shaded jar.
[INFO] Including com.sun.jersey:jersey-server:jar:1.19 in the shaded jar.
[INFO] Including commons-cli:commons-cli:jar:1.2 in the shaded jar.
[INFO] Including commons-io:commons-io:jar:2.4 in the shaded jar.
[INFO] Including commons-lang:commons-lang:jar:2.6 in the shaded jar.
[INFO] Including commons-logging:commons-logging:jar:1.2 in the shaded jar.
[INFO] Including org.apache.commons:commons-math:jar:2.2 in the shaded jar.
[INFO] Including log4j:log4j:jar:1.2.17 in the shaded jar.
[INFO] Including org.apache.zookeeper:zookeeper:jar:3.4.6 in the shaded jar.
[INFO] Including org.mortbay.jetty:jetty:jar:6.1.26 in the shaded jar.
[INFO] Including org.mortbay.jetty:jetty-util:jar:6.1.26 in the shaded jar.
[INFO] Including org.mortbay.jetty:jetty-sslengine:jar:6.1.26 in the shaded jar.
[INFO] Including org.mortbay.jetty:jsp-2.1:jar:6.1.14 in the shaded jar.
[INFO] Including org.mortbay.jetty:jsp-api-2.1:jar:6.1.14 in the shaded jar.
[INFO] Including org.mortbay.jetty:servlet-api-2.5:jar:6.1.14 in the shaded jar.
[INFO] Including org.codehaus.jackson:jackson-core-asl:jar:1.9.13 in the shaded jar.
[INFO] Including org.codehaus.jackson:jackson-mapper-asl:jar:1.9.13 in the shaded jar.
[INFO] Including org.codehaus.jackson:jackson-jaxrs:jar:1.9.13 in the shaded jar.
[INFO] Including tomcat:jasper-compiler:jar:5.5.23 in the shaded jar.
[INFO] Including tomcat:jasper-runtime:jar:5.5.23 in the shaded jar.
[INFO] Including commons-el:commons-el:jar:1.0 in the shaded jar.
[INFO] Including org.jamon:jamon-runtime:jar:2.3.1 in the shaded jar.
[INFO] Including io.netty:netty-all:jar:4.0.23.Final in the shaded jar.
[INFO] Including org.apache.htrace:htrace-core:jar:3.1.0-incubating in the shaded jar.
[INFO] Including com.lmax:disruptor:jar:3.3.0 in the shaded jar.
[INFO] Including org.apache.hadoop:hadoop-common:jar:2.7.1 in the shaded jar.
[INFO] Including org.apache.hadoop:hadoop-annotations:jar:2.7.1 in the shaded jar.
[INFO] Including org.apache.commons:commons-math3:jar:3.1.1 in the shaded jar.
[INFO] Including xmlenc:xmlenc:jar:0.52 in the shaded jar.
[INFO] Including commons-net:commons-net:jar:3.1 in the shaded jar.
[INFO] Including com.sun.jersey:jersey-json:jar:1.19 in the shaded jar.
[INFO] Including org.codehaus.jettison:jettison:jar:1.3.7 in the shaded jar.
[INFO] Including com.sun.xml.bind:jaxb-impl:jar:2.2.3-1 in the shaded jar.
[INFO] Including net.java.dev.jets3t:jets3t:jar:0.9.0 in the shaded jar.
[INFO] Including org.apache.httpcomponents:httpcore:jar:4.4.1 in the shaded jar.
[INFO] Including com.jamesmurty.utils:java-xmlbuilder:jar:0.4 in the shaded jar.
[INFO] Including commons-configuration:commons-configuration:jar:1.10 in the shaded jar.
[INFO] Including org.apache.avro:avro:jar:1.7.4 in the shaded jar.
[INFO] Including com.thoughtworks.paranamer:paranamer:jar:2.3 in the shaded jar.
[INFO] Including org.xerial.snappy:snappy-java:jar:1.0.4.1 in the shaded jar.
[INFO] Including com.google.code.gson:gson:jar:2.5 in the shaded jar.
[INFO] Including com.jcraft:jsch:jar:0.1.42 in the shaded jar.
[INFO] Including org.apache.curator:curator-client:jar:2.11.0 in the shaded jar.
[INFO] Including org.apache.curator:curator-recipes:jar:2.11.0 in the shaded jar.
[INFO] Including org.apache.commons:commons-compress:jar:1.4.1 in the shaded jar.
[INFO] Including org.tukaani:xz:jar:1.0 in the shaded jar.
[INFO] Including org.apache.hadoop:hadoop-auth:jar:2.7.1 in the shaded jar.
[INFO] Including org.apache.httpcomponents:httpclient:jar:4.4.1 in the shaded jar.
[INFO] Including org.apache.directory.server:apacheds-kerberos-codec:jar:2.0.0-M15 in the
shaded jar.
[INFO] Including org.apache.directory.server:apacheds-i18n:jar:2.0.0-M15 in the shaded jar.
[INFO] Including org.apache.directory.api:api-asn1-api:jar:1.0.0-M20 in the shaded jar.
[INFO] Including org.apache.directory.api:api-util:jar:1.0.0-M20 in the shaded jar.
[INFO] Including org.apache.curator:curator-framework:jar:2.11.0 in the shaded jar.
[INFO] Including org.apache.hadoop:hadoop-client:jar:2.7.1 in the shaded jar.
[INFO] Including org.apache.hadoop:hadoop-mapreduce-client-app:jar:2.7.1 in the shaded jar.
[INFO] Including org.apache.hadoop:hadoop-mapreduce-client-common:jar:2.7.1 in the shaded
jar.
[INFO] Including org.apache.hadoop:hadoop-yarn-client:jar:2.7.1 in the shaded jar.
[INFO] Including org.apache.hadoop:hadoop-yarn-server-common:jar:2.7.1 in the shaded jar.
[INFO] Including org.apache.hadoop:hadoop-mapreduce-client-shuffle:jar:2.7.1 in the shaded
jar.
[INFO] Including org.apache.hadoop:hadoop-yarn-api:jar:2.7.1 in the shaded jar.
[INFO] Including org.apache.hadoop:hadoop-mapreduce-client-jobclient:jar:2.7.1 in the shaded
jar.
[INFO] Including org.apache.hadoop:hadoop-mapreduce-client-core:jar:2.5.1 in the shaded jar.
[INFO] Including org.apache.hadoop:hadoop-yarn-common:jar:2.5.1 in the shaded jar.
[INFO] Including javax.xml.bind:jaxb-api:jar:2.2.2 in the shaded jar.
[INFO] Including javax.xml.stream:stax-api:jar:1.0-2 in the shaded jar.
[INFO] Including javax.activation:activation:jar:1.1 in the shaded jar.
[INFO] Including javax.servlet:servlet-api:jar:2.5 in the shaded jar.
[INFO] Including org.codehaus.jackson:jackson-xc:jar:1.9.13 in the shaded jar.
[INFO] Including com.google.inject:guice:jar:3.0 in the shaded jar.
[INFO] Including javax.inject:javax.inject:jar:1 in the shaded jar.
[INFO] Including aopalliance:aopalliance:jar:1.0 in the shaded jar.
[INFO] Including com.sun.jersey.contribs:jersey-guice:jar:1.9 in the shaded jar.
[INFO] Including com.google.inject.extensions:guice-servlet:jar:3.0 in the shaded jar.
[INFO] Including org.apache.hadoop:hadoop-hdfs:jar:2.7.1 in the shaded jar.
[INFO] Including commons-daemon:commons-daemon:jar:1.0.13 in the shaded jar.
[INFO] Including xerces:xercesImpl:jar:2.9.1 in the shaded jar.
[INFO] Including xml-apis:xml-apis:jar:1.3.04 in the shaded jar.
[INFO] Including org.fusesource.leveldbjni:leveldbjni-all:jar:1.8 in the shaded jar.
[INFO] Including com.github.stephenc.findbugs:findbugs-annotations:jar:1.3.9-1 in the shaded
jar.
[INFO] Including org.apache.hbase:hbase-server:jar:1.1.2 in the shaded jar.
[INFO] Excluding org.slf4j:slf4j-api:jar:1.7.21 from the shaded jar.
[INFO] Excluding org.slf4j:slf4j-log4j12:jar:1.7.21 from the shaded jar.
[INFO] Excluding org.slf4j:jul-to-slf4j:jar:1.7.21 from the shaded jar.
[INFO] Including cglib:cglib:jar:2.2.2 in the shaded jar.
[INFO] Including asm:asm:jar:3.3.1 in the shaded jar.
[WARNING] servlet-api-2.5-6.1.14.jar, servlet-api-2.5.jar define 42 overlapping classes: 
[WARNING]   - javax.servlet.http.HttpSessionBindingEvent
[WARNING]   - javax.servlet.http.Cookie
[WARNING]   - javax.servlet.http.NoBodyResponse
[WARNING]   - javax.servlet.ServletContext
[WARNING]   - javax.servlet.ServletOutputStream
[WARNING]   - javax.servlet.http.HttpSessionListener
[WARNING]   - javax.servlet.http.HttpSessionContext
[WARNING]   - javax.servlet.FilterChain
[WARNING]   - javax.servlet.GenericServlet
[WARNING]   - javax.servlet.http.HttpServletRequestWrapper
[WARNING]   - 32 more...
[WARNING] jsp-2.1-6.1.14.jar, jasper-runtime-5.5.23.jar define 43 overlapping classes: 
[WARNING]   - org.apache.jasper.runtime.PerThreadTagHandlerPool$1
[WARNING]   - org.apache.jasper.runtime.JspFactoryImpl$PrivilegedGetPageContext
[WARNING]   - org.apache.jasper.runtime.PageContextImpl$4
[WARNING]   - org.apache.jasper.runtime.JspSourceDependent
[WARNING]   - org.apache.jasper.runtime.JspRuntimeLibrary$PrivilegedIntrospectHelper
[WARNING]   - org.apache.jasper.runtime.PageContextImpl$2
[WARNING]   - org.apache.jasper.Constants
[WARNING]   - org.apache.jasper.runtime.ProtectedFunctionMapper$2
[WARNING]   - org.apache.jasper.runtime.PageContextImpl
[WARNING]   - org.apache.jasper.runtime.PageContextImpl$11
[WARNING]   - 33 more...
[WARNING] jsp-2.1-6.1.14.jar, jasper-compiler-5.5.23.jar define 143 overlapping classes: 
[WARNING]   - org.apache.jasper.compiler.Node$Nodes
[WARNING]   - org.apache.jasper.compiler.tagplugin.TagPlugin
[WARNING]   - org.apache.jasper.compiler.JspUtil
[WARNING]   - org.apache.jasper.xmlparser.MyEntityResolver
[WARNING]   - org.apache.jasper.compiler.Validator$TagExtraInfoVisitor
[WARNING]   - org.apache.jasper.compiler.SmapGenerator
[WARNING]   - org.apache.jasper.compiler.SmapStratum
[WARNING]   - org.apache.jasper.compiler.tagplugin.TagPluginContext
[WARNING]   - org.apache.jasper.compiler.JasperTagInfo
[WARNING]   - org.apache.jasper.EmbeddedServletOptions
[WARNING]   - 133 more...
[WARNING] hadoop-yarn-api-2.7.1.jar, hadoop-yarn-common-2.5.1.jar define 3 overlapping classes:

[WARNING]   - org.apache.hadoop.yarn.util.package-info
[WARNING]   - org.apache.hadoop.yarn.factories.package-info
[WARNING]   - org.apache.hadoop.yarn.factory.providers.package-info
[WARNING] jsp-2.1-6.1.14.jar, jasper-compiler-5.5.23.jar, jasper-runtime-5.5.23.jar define
1 overlapping classes: 
[WARNING]   - org.apache.jasper.compiler.Localizer
[WARNING] maven-shade-plugin has detected that some class files are
[WARNING] present in two or more JARs. When this happens, only one
[WARNING] single version of the class is copied to the uber jar.
[WARNING] Usually this is not harmful and you can skip these warnings,
[WARNING] otherwise try to manually exclude artifacts based on
[WARNING] mvn dependency:tree -Ddetail=true and the above output.
[WARNING] See http://docs.codehaus.org/display/MAVENUSER/Shade+Plugin
[INFO] Replacing original artifact with shaded artifact.
[INFO] Replacing <https://builds.apache.org/job/Atlas-master-UnitTests/ws/shaded/hbase-server-shaded/target/atlas-hbase-server-shaded-1.0.0-SNAPSHOT.jar>
with <https://builds.apache.org/job/Atlas-master-UnitTests/ws/shaded/hbase-server-shaded/target/atlas-hbase-server-shaded-1.0.0-SNAPSHOT-shaded.jar>
[INFO] Dependency-reduced POM written at: <https://builds.apache.org/job/Atlas-master-UnitTests/ws/shaded/hbase-server-shaded/dependency-reduced-pom.xml>
[INFO] 
[INFO] ------------------------------------------------------------------------
[INFO] Building Apache Atlas Repository 1.0.0-SNAPSHOT
[INFO] ------------------------------------------------------------------------
Downloading: https://repository.apache.org/content/groups/public/org/apache/atlas/atlas-graphdb-janus/1.0.0-SNAPSHOT/maven-metadata.xml
Downloading: https://repository.apache.org/content/groups/staging/org/apache/atlas/atlas-graphdb-janus/1.0.0-SNAPSHOT/maven-metadata.xml
Downloading: https://repository.apache.org/content/groups/snapshots/org/apache/atlas/atlas-graphdb-janus/1.0.0-SNAPSHOT/maven-metadata.xml
Downloading: https://maven.java.net/content/groups/public/org/apache/atlas/atlas-graphdb-janus/1.0.0-SNAPSHOT/maven-metadata.xml
Downloading: https://repository.jboss.org/nexus/content/groups/public/org/apache/atlas/atlas-graphdb-janus/1.0.0-SNAPSHOT/maven-metadata.xml
Downloading: http://repo.typesafe.com/typesafe/releases/org/apache/atlas/atlas-graphdb-janus/1.0.0-SNAPSHOT/maven-metadata.xml
Downloading: http://repository.apache.org/snapshots/org/apache/atlas/atlas-graphdb-janus/1.0.0-SNAPSHOT/maven-metadata.xml
Downloading: https://repository.apache.org/content/groups/snapshots/org/apache/atlas/atlas-graphdb-janus/1.0.0-SNAPSHOT/atlas-graphdb-janus-1.0.0-SNAPSHOT.pom
Downloading: https://repository.apache.org/content/groups/staging/org/apache/atlas/atlas-graphdb-janus/1.0.0-SNAPSHOT/atlas-graphdb-janus-1.0.0-SNAPSHOT.pom
Downloading: https://repository.apache.org/content/groups/public/org/apache/atlas/atlas-graphdb-janus/1.0.0-SNAPSHOT/atlas-graphdb-janus-1.0.0-SNAPSHOT.pom
Downloading: https://maven.java.net/content/groups/public/org/apache/atlas/atlas-graphdb-janus/1.0.0-SNAPSHOT/atlas-graphdb-janus-1.0.0-SNAPSHOT.pom
Downloading: https://repository.jboss.org/nexus/content/groups/public/org/apache/atlas/atlas-graphdb-janus/1.0.0-SNAPSHOT/atlas-graphdb-janus-1.0.0-SNAPSHOT.pom
Downloading: http://repo.typesafe.com/typesafe/releases/org/apache/atlas/atlas-graphdb-janus/1.0.0-SNAPSHOT/atlas-graphdb-janus-1.0.0-SNAPSHOT.pom
Downloading: http://repository.apache.org/snapshots/org/apache/atlas/atlas-graphdb-janus/1.0.0-SNAPSHOT/atlas-graphdb-janus-1.0.0-SNAPSHOT.pom
[WARNING] The POM for org.apache.atlas:atlas-graphdb-janus:jar:1.0.0-SNAPSHOT is missing,
no dependency information available
Downloading: https://repository.apache.org/content/groups/snapshots/org/apache/atlas/atlas-graphdb-janus/1.0.0-SNAPSHOT/atlas-graphdb-janus-1.0.0-SNAPSHOT.jar
Downloading: https://repository.apache.org/content/groups/staging/org/apache/atlas/atlas-graphdb-janus/1.0.0-SNAPSHOT/atlas-graphdb-janus-1.0.0-SNAPSHOT.jar
Downloading: https://repository.apache.org/content/groups/public/org/apache/atlas/atlas-graphdb-janus/1.0.0-SNAPSHOT/atlas-graphdb-janus-1.0.0-SNAPSHOT.jar
Downloading: https://maven.java.net/content/groups/public/org/apache/atlas/atlas-graphdb-janus/1.0.0-SNAPSHOT/atlas-graphdb-janus-1.0.0-SNAPSHOT.jar
Downloading: https://repository.jboss.org/nexus/content/groups/public/org/apache/atlas/atlas-graphdb-janus/1.0.0-SNAPSHOT/atlas-graphdb-janus-1.0.0-SNAPSHOT.jar
Downloading: http://repo.typesafe.com/typesafe/releases/org/apache/atlas/atlas-graphdb-janus/1.0.0-SNAPSHOT/atlas-graphdb-janus-1.0.0-SNAPSHOT.jar
Downloading: http://repository.apache.org/snapshots/org/apache/atlas/atlas-graphdb-janus/1.0.0-SNAPSHOT/atlas-graphdb-janus-1.0.0-SNAPSHOT.jar
[INFO] ------------------------------------------------------------------------
[INFO] Reactor Summary:
[INFO] 
[INFO] Apache Atlas Server Build Tools .................... SUCCESS [  0.732 s]
[INFO] apache-atlas ....................................... SUCCESS [  3.143 s]
[INFO] Apache Atlas Integration ........................... SUCCESS [ 20.174 s]
[INFO] Apache Atlas Common ................................ SUCCESS [  2.111 s]
[INFO] Apache Atlas Typesystem ............................ SUCCESS [ 46.786 s]
[INFO] Apache Atlas Client ................................ SUCCESS [  0.157 s]
[INFO] atlas-client-common ................................ SUCCESS [  0.847 s]
[INFO] atlas-client-v1 .................................... SUCCESS [  4.260 s]
[INFO] Apache Atlas Server API ............................ SUCCESS [  0.978 s]
[INFO] Apache Atlas Notification .......................... SUCCESS [ 11.718 s]
[INFO] atlas-client-v2 .................................... SUCCESS [  0.621 s]
[INFO] Apache Atlas Graph Database Projects ............... SUCCESS [  0.182 s]
[INFO] Apache Atlas Graph Database API .................... SUCCESS [  0.910 s]
[INFO] Graph Database Common Code ......................... SUCCESS [  0.864 s]
[INFO] Shaded version of Apache hbase client .............. SUCCESS [ 10.400 s]
[INFO] Apache Atlas Titan 0.5.4 Graph DB Impl ............. SUCCESS [01:20 min]
[INFO] Apache Atlas Graph Database Implementation Dependencies SUCCESS [  0.131 s]
[INFO] Shaded version of Apache hbase server .............. SUCCESS [ 23.290 s]
[INFO] Apache Atlas Repository ............................ FAILURE [  4.984 s]
[INFO] Apache Atlas Authorization ......................... SKIPPED
[INFO] Apache Atlas UI .................................... SKIPPED
[INFO] Apache Atlas Web Application ....................... SKIPPED
[INFO] Apache Atlas Documentation ......................... SKIPPED
[INFO] Apache Atlas FileSystem Model ...................... SKIPPED
[INFO] Apache Atlas Plugin Classloader .................... SKIPPED
[INFO] Apache Atlas Hive Bridge Shim ...................... SKIPPED
[INFO] Apache Atlas Hive Bridge ........................... SKIPPED
[INFO] Apache Atlas Falcon Bridge Shim .................... SKIPPED
[INFO] Apache Atlas Falcon Bridge ......................... SKIPPED
[INFO] Apache Atlas Sqoop Bridge Shim ..................... SKIPPED
[INFO] Apache Atlas Sqoop Bridge .......................... SKIPPED
[INFO] Apache Atlas Storm Bridge Shim ..................... SKIPPED
[INFO] Apache Atlas Storm Bridge .......................... SKIPPED
[INFO] Apache Atlas Hbase Bridge Shim ..................... SKIPPED
[INFO] Apache Atlas Hbase Bridge .......................... SKIPPED
[INFO] Apache Atlas Distribution .......................... SKIPPED
[INFO] ------------------------------------------------------------------------
[INFO] BUILD FAILURE
[INFO] ------------------------------------------------------------------------
[INFO] Total time: 03:34 min
[INFO] Finished at: 2017-10-27T22:03:15Z
[INFO] Final Memory: 139M/2169M
[INFO] ------------------------------------------------------------------------
[ERROR] Failed to execute goal on project atlas-repository: Could not resolve dependencies
for project org.apache.atlas:atlas-repository:jar:1.0.0-SNAPSHOT: Could not find artifact
org.apache.atlas:atlas-graphdb-janus:jar:1.0.0-SNAPSHOT in apache.snapshots.repo (https://repository.apache.org/content/groups/snapshots)
-> [Help 1]
[ERROR] 
[ERROR] To see the full stack trace of the errors, re-run Maven with the -e switch.
[ERROR] Re-run Maven using the -X switch to enable full debug logging.
[ERROR] 
[ERROR] For more information about the errors and possible solutions, please read the following
articles:
[ERROR] [Help 1] http://cwiki.apache.org/confluence/display/MAVEN/DependencyResolutionException
[ERROR] 
[ERROR] After correcting the problems, you can resume the build with the command
[ERROR]   mvn <goals> -rf :atlas-repository
Build step 'Execute shell' marked build as failure
[CHECKSTYLE] Collecting checkstyle analysis files...
[CHECKSTYLE] Searching for all files in <https://builds.apache.org/job/Atlas-master-UnitTests/ws/>
that match the pattern **/target/checkstyle-result.xml
[CHECKSTYLE] No files found. Configuration error?
<Git Blamer> Using GitBlamer to create author and commit information for all warnings.
<Git Blamer> GIT_COMMIT=503dddb8c820ae0dba62d200052262144409d3cf, workspace=<https://builds.apache.org/job/Atlas-master-UnitTests/ws/>
[CHECKSTYLE] Computing warning deltas based on reference build #148
[FINDBUGS] Collecting findbugs analysis files...
[FINDBUGS] Searching for all files in <https://builds.apache.org/job/Atlas-master-UnitTests/ws/>
that match the pattern **/target/findbugs.xml
[FINDBUGS] No files found. Configuration error?
<Git Blamer> Using GitBlamer to create author and commit information for all warnings.
<Git Blamer> GIT_COMMIT=503dddb8c820ae0dba62d200052262144409d3cf, workspace=<https://builds.apache.org/job/Atlas-master-UnitTests/ws/>
[FINDBUGS] Computing warning deltas based on reference build #148
Archiving artifacts
TestNG Reports Processing: START
Looking for TestNG results report in workspace using pattern: **/target/surefire-reports/testng-results.xml,**/target/failsafe-reports/testng-results.xml
Saving reports...
Processing '/x1/jenkins/jenkins-home/jobs/Atlas-master-UnitTests/builds/149/testng/testng-results-1.xml'
Processing '/x1/jenkins/jenkins-home/jobs/Atlas-master-UnitTests/builds/149/testng/testng-results-2.xml'
Processing '/x1/jenkins/jenkins-home/jobs/Atlas-master-UnitTests/builds/149/testng/testng-results-3.xml'
Processing '/x1/jenkins/jenkins-home/jobs/Atlas-master-UnitTests/builds/149/testng/testng-results-4.xml'
Processing '/x1/jenkins/jenkins-home/jobs/Atlas-master-UnitTests/builds/149/testng/testng-results-5.xml'
Processing '/x1/jenkins/jenkins-home/jobs/Atlas-master-UnitTests/builds/149/testng/testng-results.xml'
TestNG Reports Processing: FINISH

Mime
View raw message