atlas-dev mailing list archives

Site index · List index
Message view « Date » · « Thread »
Top « Date » · « Thread »
From Apache Jenkins Server <jenk...@builds.apache.org>
Subject Build failed in Jenkins: Atlas-master-UnitTests #132
Date Fri, 13 Oct 2017 22:50:41 GMT
See <https://builds.apache.org/job/Atlas-master-UnitTests/132/display/redirect?page=changes>

Changes:

[apoorvnaik] ATLAS-2211: Dangling transaction issue within

[apoorvnaik] ATLAS-2201: Test dependency, plugin version and test code fixes

------------------------------------------
[...truncated 510.53 KB...]
Java HotSpot(TM) 64-Bit Server VM warning: ignoring option MaxPermSize=512m; support was removed
in 8.0
Running org.apache.atlas.web.filters.AuditFilterTest
Tests run: 6, Failures: 0, Errors: 0, Skipped: 0, Time elapsed: 1.496 sec - in org.apache.atlas.web.filters.AuditFilterTest
Java HotSpot(TM) 64-Bit Server VM warning: ignoring option MaxPermSize=512m; support was removed
in 8.0
Running org.apache.atlas.web.service.AtlasZookeeperSecurityPropertiesTest
Tests run: 6, Failures: 0, Errors: 0, Skipped: 0, Time elapsed: 0.49 sec - in org.apache.atlas.web.service.AtlasZookeeperSecurityPropertiesTest
Java HotSpot(TM) 64-Bit Server VM warning: ignoring option MaxPermSize=512m; support was removed
in 8.0
Running org.apache.atlas.web.service.ServiceStateTest
Tests run: 3, Failures: 0, Errors: 0, Skipped: 0, Time elapsed: 1.096 sec - in org.apache.atlas.web.service.ServiceStateTest
Java HotSpot(TM) 64-Bit Server VM warning: ignoring option MaxPermSize=512m; support was removed
in 8.0
Running org.apache.atlas.web.service.CuratorFactoryTest
Tests run: 3, Failures: 0, Errors: 0, Skipped: 0, Time elapsed: 1.391 sec - in org.apache.atlas.web.service.CuratorFactoryTest
Java HotSpot(TM) 64-Bit Server VM warning: ignoring option MaxPermSize=512m; support was removed
in 8.0
Running org.apache.atlas.web.service.SecureEmbeddedServerTest
Tests run: 4, Failures: 1, Errors: 0, Skipped: 0, Time elapsed: 49.855 sec <<< FAILURE!
- in org.apache.atlas.web.service.SecureEmbeddedServerTest
testServerConfiguredUsingCredentialProvider(org.apache.atlas.web.service.SecureEmbeddedServerTest)
 Time elapsed: 43.901 sec  <<< FAILURE!
java.lang.AssertionError: War deploy failed
	at sun.security.ssl.InputRecord.read(InputRecord.java:505)
	at sun.security.ssl.SSLSocketImpl.readRecord(SSLSocketImpl.java:983)
	at sun.security.ssl.SSLSocketImpl.performInitialHandshake(SSLSocketImpl.java:1385)
	at sun.security.ssl.SSLSocketImpl.startHandshake(SSLSocketImpl.java:1413)
	at sun.security.ssl.SSLSocketImpl.startHandshake(SSLSocketImpl.java:1397)
	at sun.net.www.protocol.https.HttpsClient.afterConnect(HttpsClient.java:559)
	at sun.net.www.protocol.https.AbstractDelegateHttpsURLConnection.connect(AbstractDelegateHttpsURLConnection.java:185)
	at sun.net.www.protocol.https.HttpsURLConnectionImpl.connect(HttpsURLConnectionImpl.java:153)
	at org.apache.atlas.web.service.SecureEmbeddedServerTest.testServerConfiguredUsingCredentialProvider(SecureEmbeddedServerTest.java:74)

Java HotSpot(TM) 64-Bit Server VM warning: ignoring option MaxPermSize=512m; support was removed
in 8.0
Running org.apache.atlas.web.service.ActiveInstanceStateTest
Tests run: 5, Failures: 0, Errors: 0, Skipped: 0, Time elapsed: 1.066 sec - in org.apache.atlas.web.service.ActiveInstanceStateTest
Java HotSpot(TM) 64-Bit Server VM warning: ignoring option MaxPermSize=512m; support was removed
in 8.0
Running org.apache.atlas.web.service.ActiveInstanceElectorServiceTest
Tests run: 14, Failures: 0, Errors: 0, Skipped: 0, Time elapsed: 1.416 sec - in org.apache.atlas.web.service.ActiveInstanceElectorServiceTest
Java HotSpot(TM) 64-Bit Server VM warning: ignoring option MaxPermSize=512m; support was removed
in 8.0
Running org.apache.atlas.web.util.ServletsTest
Tests run: 1, Failures: 0, Errors: 0, Skipped: 0, Time elapsed: 1.109 sec - in org.apache.atlas.web.util.ServletsTest
Java HotSpot(TM) 64-Bit Server VM warning: ignoring option MaxPermSize=512m; support was removed
in 8.0
Running org.apache.atlas.web.setup.SetupStepsTest
Tests run: 6, Failures: 0, Errors: 0, Skipped: 0, Time elapsed: 1.256 sec - in org.apache.atlas.web.setup.SetupStepsTest
Java HotSpot(TM) 64-Bit Server VM warning: ignoring option MaxPermSize=512m; support was removed
in 8.0
Running org.apache.atlas.web.resources.TaxonomyServiceTest
Tests run: 12, Failures: 0, Errors: 0, Skipped: 0, Time elapsed: 1.196 sec - in org.apache.atlas.web.resources.TaxonomyServiceTest
Java HotSpot(TM) 64-Bit Server VM warning: ignoring option MaxPermSize=512m; support was removed
in 8.0
Running org.apache.atlas.web.resources.AdminResourceTest
Tests run: 2, Failures: 0, Errors: 0, Skipped: 0, Time elapsed: 1.53 sec - in org.apache.atlas.web.resources.AdminResourceTest
Java HotSpot(TM) 64-Bit Server VM warning: ignoring option MaxPermSize=512m; support was removed
in 8.0
Running org.apache.atlas.web.resources.AdminExportTest
Tests run: 0, Failures: 0, Errors: 0, Skipped: 0, Time elapsed: 0.335 sec - in org.apache.atlas.web.resources.AdminExportTest
Java HotSpot(TM) 64-Bit Server VM warning: ignoring option MaxPermSize=512m; support was removed
in 8.0
Running org.apache.atlas.web.resources.EntityResourceTest
Tests run: 1, Failures: 0, Errors: 0, Skipped: 0, Time elapsed: 0.595 sec - in org.apache.atlas.web.resources.EntityResourceTest
Java HotSpot(TM) 64-Bit Server VM warning: ignoring option MaxPermSize=512m; support was removed
in 8.0
Running org.apache.atlas.web.adapters.TestEntityREST$4
Tests run: 0, Failures: 0, Errors: 0, Skipped: 0, Time elapsed: 0.385 sec - in org.apache.atlas.web.adapters.TestEntityREST$4
Java HotSpot(TM) 64-Bit Server VM warning: ignoring option MaxPermSize=512m; support was removed
in 8.0
Running org.apache.atlas.web.adapters.TestEntityREST$1
Tests run: 0, Failures: 0, Errors: 0, Skipped: 0, Time elapsed: 0.309 sec - in org.apache.atlas.web.adapters.TestEntityREST$1
Java HotSpot(TM) 64-Bit Server VM warning: ignoring option MaxPermSize=512m; support was removed
in 8.0
Running org.apache.atlas.web.adapters.TestEntityREST$5
Tests run: 0, Failures: 0, Errors: 0, Skipped: 0, Time elapsed: 0.269 sec - in org.apache.atlas.web.adapters.TestEntityREST$5
Java HotSpot(TM) 64-Bit Server VM warning: ignoring option MaxPermSize=512m; support was removed
in 8.0
Running org.apache.atlas.web.adapters.TestEntityREST$7
Tests run: 0, Failures: 0, Errors: 0, Skipped: 0, Time elapsed: 0.353 sec - in org.apache.atlas.web.adapters.TestEntityREST$7
Java HotSpot(TM) 64-Bit Server VM warning: ignoring option MaxPermSize=512m; support was removed
in 8.0
Running org.apache.atlas.web.adapters.TestEntitiesREST$3
Tests run: 0, Failures: 0, Errors: 0, Skipped: 0, Time elapsed: 0.422 sec - in org.apache.atlas.web.adapters.TestEntitiesREST$3
Java HotSpot(TM) 64-Bit Server VM warning: ignoring option MaxPermSize=512m; support was removed
in 8.0
Running org.apache.atlas.web.adapters.TestEntityREST$3
Tests run: 0, Failures: 0, Errors: 0, Skipped: 0, Time elapsed: 0.381 sec - in org.apache.atlas.web.adapters.TestEntityREST$3
Java HotSpot(TM) 64-Bit Server VM warning: ignoring option MaxPermSize=512m; support was removed
in 8.0
Running org.apache.atlas.web.adapters.TestEntityREST$6
Tests run: 0, Failures: 0, Errors: 0, Skipped: 0, Time elapsed: 0.406 sec - in org.apache.atlas.web.adapters.TestEntityREST$6
Java HotSpot(TM) 64-Bit Server VM warning: ignoring option MaxPermSize=512m; support was removed
in 8.0
Running org.apache.atlas.web.adapters.TestEntityREST
Tests run: 8, Failures: 0, Errors: 0, Skipped: 0, Time elapsed: 17.012 sec - in org.apache.atlas.web.adapters.TestEntityREST
Java HotSpot(TM) 64-Bit Server VM warning: ignoring option MaxPermSize=512m; support was removed
in 8.0
Running org.apache.atlas.web.adapters.TestEntityREST$2
Tests run: 0, Failures: 0, Errors: 0, Skipped: 0, Time elapsed: 0.336 sec - in org.apache.atlas.web.adapters.TestEntityREST$2
Java HotSpot(TM) 64-Bit Server VM warning: ignoring option MaxPermSize=512m; support was removed
in 8.0
Running org.apache.atlas.web.adapters.TestEntitiesREST$2
Tests run: 0, Failures: 0, Errors: 0, Skipped: 0, Time elapsed: 0.292 sec - in org.apache.atlas.web.adapters.TestEntitiesREST$2
Java HotSpot(TM) 64-Bit Server VM warning: ignoring option MaxPermSize=512m; support was removed
in 8.0
Running org.apache.atlas.web.adapters.TestEntitiesREST$1
Tests run: 0, Failures: 0, Errors: 0, Skipped: 0, Time elapsed: 0.302 sec - in org.apache.atlas.web.adapters.TestEntitiesREST$1
Java HotSpot(TM) 64-Bit Server VM warning: ignoring option MaxPermSize=512m; support was removed
in 8.0
Running org.apache.atlas.web.adapters.TestEntitiesREST
Tests run: 4, Failures: 0, Errors: 0, Skipped: 0, Time elapsed: 16.29 sec - in org.apache.atlas.web.adapters.TestEntitiesREST
Java HotSpot(TM) 64-Bit Server VM warning: ignoring option MaxPermSize=512m; support was removed
in 8.0
Running org.apache.atlas.web.TestUtils
Tests run: 0, Failures: 0, Errors: 0, Skipped: 0, Time elapsed: 0.346 sec - in org.apache.atlas.web.TestUtils
Java HotSpot(TM) 64-Bit Server VM warning: ignoring option MaxPermSize=512m; support was removed
in 8.0
Running org.apache.atlas.util.RestUtilsTest
Tests run: 0, Failures: 0, Errors: 0, Skipped: 0, Time elapsed: 0.377 sec - in org.apache.atlas.util.RestUtilsTest

Results :

Failed tests: 
  NegativeSSLAndKerberosTest.testUnsecuredClient:139 expected [true] but found [false]
  SSLAndKerberosTest.testService:185 » ClientHandler java.io.IOException: javax....
  SSLTest.testService:147 » ClientHandler javax.net.ssl.SSLHandshakeException: R...
  SecureEmbeddedServerTest.testServerConfiguredUsingCredentialProvider:79 War deploy failed

Tests run: 121, Failures: 4, Errors: 0, Skipped: 0

[INFO] ------------------------------------------------------------------------
[INFO] Reactor Summary:
[INFO] 
[INFO] Apache Atlas Server Build Tools .................... SUCCESS [  0.889 s]
[INFO] apache-atlas ....................................... SUCCESS [  4.555 s]
[INFO] Apache Atlas Integration ........................... SUCCESS [ 34.136 s]
[INFO] Apache Atlas Common ................................ SUCCESS [  9.939 s]
[INFO] Apache Atlas Typesystem ............................ SUCCESS [ 55.289 s]
[INFO] Apache Atlas Client ................................ SUCCESS [  0.726 s]
[INFO] atlas-client-common ................................ SUCCESS [  8.371 s]
[INFO] atlas-client-v1 .................................... SUCCESS [ 10.604 s]
[INFO] Apache Atlas Server API ............................ SUCCESS [  6.409 s]
[INFO] Apache Atlas Notification .......................... SUCCESS [ 21.306 s]
[INFO] atlas-client-v2 .................................... SUCCESS [  6.760 s]
[INFO] Apache Atlas Graph Database Projects ............... SUCCESS [  0.482 s]
[INFO] Apache Atlas Graph Database API .................... SUCCESS [  5.611 s]
[INFO] Graph Database Common Code ......................... SUCCESS [  5.579 s]
[INFO] Apache Atlas Titan 1.0.0 GraphDB Impl .............. SUCCESS [ 36.846 s]
[INFO] Shaded version of Apache hbase client .............. SUCCESS [  7.994 s]
[INFO] Apache Atlas Titan 0.5.4 Graph DB Impl ............. SUCCESS [01:19 min]
[INFO] Apache Atlas Graph Database Implementation Dependencies SUCCESS [  0.555 s]
[INFO] Shaded version of Apache hbase server .............. SUCCESS [ 22.372 s]
[INFO] Apache Atlas Repository ............................ SUCCESS [08:38 min]
[INFO] Apache Atlas Authorization ......................... SUCCESS [  9.076 s]
[INFO] Apache Atlas Business Catalog ...................... SUCCESS [ 17.017 s]
[INFO] Apache Atlas UI .................................... SUCCESS [01:26 min]
[INFO] Apache Atlas Web Application ....................... FAILURE [05:58 min]
[INFO] Apache Atlas Documentation ......................... SKIPPED
[INFO] Apache Atlas FileSystem Model ...................... SKIPPED
[INFO] Apache Atlas Plugin Classloader .................... SKIPPED
[INFO] Apache Atlas Hive Bridge Shim ...................... SKIPPED
[INFO] Apache Atlas Hive Bridge ........................... SKIPPED
[INFO] Apache Atlas Falcon Bridge Shim .................... SKIPPED
[INFO] Apache Atlas Falcon Bridge ......................... SKIPPED
[INFO] Apache Atlas Sqoop Bridge Shim ..................... SKIPPED
[INFO] Apache Atlas Sqoop Bridge .......................... SKIPPED
[INFO] Apache Atlas Storm Bridge Shim ..................... SKIPPED
[INFO] Apache Atlas Storm Bridge .......................... SKIPPED
[INFO] Apache Atlas Distribution .......................... SKIPPED
[INFO] ------------------------------------------------------------------------
[INFO] BUILD FAILURE
[INFO] ------------------------------------------------------------------------
[INFO] Total time: 21:49 min
[INFO] Finished at: 2017-10-13T22:41:49Z
[INFO] Final Memory: 177M/2400M
[INFO] ------------------------------------------------------------------------
[ERROR] Failed to execute goal org.apache.maven.plugins:maven-surefire-plugin:2.18.1:test
(default-test) on project atlas-webapp: There are test failures.
[ERROR] 
[ERROR] Please refer to <https://builds.apache.org/job/Atlas-master-UnitTests/ws/webapp/target/surefire-reports>
for the individual test results.
[ERROR] -> [Help 1]
[ERROR] 
[ERROR] To see the full stack trace of the errors, re-run Maven with the -e switch.
[ERROR] Re-run Maven using the -X switch to enable full debug logging.
[ERROR] 
[ERROR] For more information about the errors and possible solutions, please read the following
articles:
[ERROR] [Help 1] http://cwiki.apache.org/confluence/display/MAVEN/MojoFailureException
[ERROR] 
[ERROR] After correcting the problems, you can resume the build with the command
[ERROR]   mvn <goals> -rf :atlas-webapp
Build step 'Execute shell' marked build as failure
[CHECKSTYLE] Collecting checkstyle analysis files...
[CHECKSTYLE] Searching for all files in <https://builds.apache.org/job/Atlas-master-UnitTests/ws/>
that match the pattern **/target/checkstyle-result.xml
[CHECKSTYLE] Parsing 22 files in <https://builds.apache.org/job/Atlas-master-UnitTests/ws/>
[CHECKSTYLE] Successfully parsed file <https://builds.apache.org/job/Atlas-master-UnitTests/ws/authorization/target/checkstyle-result.xml>
with 467 unique warnings and 0 duplicates.
[CHECKSTYLE] Successfully parsed file <https://builds.apache.org/job/Atlas-master-UnitTests/ws/catalog/target/checkstyle-result.xml>
with 2604 unique warnings and 0 duplicates.
[CHECKSTYLE] Successfully parsed file <https://builds.apache.org/job/Atlas-master-UnitTests/ws/client/client-v1/target/checkstyle-result.xml>
with 3477 unique warnings and 0 duplicates.
[CHECKSTYLE] Successfully parsed file <https://builds.apache.org/job/Atlas-master-UnitTests/ws/client/client-v2/target/checkstyle-result.xml>
with 3802 unique warnings and 0 duplicates.
[CHECKSTYLE] Successfully parsed file <https://builds.apache.org/job/Atlas-master-UnitTests/ws/client/common/target/checkstyle-result.xml>
with 4262 unique warnings and 0 duplicates.
[CHECKSTYLE] Successfully parsed file <https://builds.apache.org/job/Atlas-master-UnitTests/ws/client/target/checkstyle-result.xml>
with 4262 unique warnings and 0 duplicates.
[CHECKSTYLE] Successfully parsed file <https://builds.apache.org/job/Atlas-master-UnitTests/ws/common/target/checkstyle-result.xml>
with 5227 unique warnings and 0 duplicates.
[CHECKSTYLE] Successfully parsed file <https://builds.apache.org/job/Atlas-master-UnitTests/ws/dashboardv2/target/checkstyle-result.xml>
with 5227 unique warnings and 0 duplicates.
[CHECKSTYLE] Successfully parsed file <https://builds.apache.org/job/Atlas-master-UnitTests/ws/graphdb/api/target/checkstyle-result.xml>
with 5500 unique warnings and 0 duplicates.
[CHECKSTYLE] Successfully parsed file <https://builds.apache.org/job/Atlas-master-UnitTests/ws/graphdb/common/target/checkstyle-result.xml>
with 5687 unique warnings and 0 duplicates.
[CHECKSTYLE] Successfully parsed file <https://builds.apache.org/job/Atlas-master-UnitTests/ws/graphdb/graphdb-impls/target/checkstyle-result.xml>
with 5687 unique warnings and 0 duplicates.
[CHECKSTYLE] Successfully parsed file <https://builds.apache.org/job/Atlas-master-UnitTests/ws/graphdb/target/checkstyle-result.xml>
with 5687 unique warnings and 0 duplicates.
[CHECKSTYLE] Successfully parsed file <https://builds.apache.org/job/Atlas-master-UnitTests/ws/graphdb/titan0/target/checkstyle-result.xml>
with 8089 unique warnings and 0 duplicates.
[CHECKSTYLE] Successfully parsed file <https://builds.apache.org/job/Atlas-master-UnitTests/ws/graphdb/titan1/target/checkstyle-result.xml>
with 9056 unique warnings and 0 duplicates.
[CHECKSTYLE] Successfully parsed file <https://builds.apache.org/job/Atlas-master-UnitTests/ws/intg/target/checkstyle-result.xml>
with 17262 unique warnings and 0 duplicates.
[CHECKSTYLE] Successfully parsed file <https://builds.apache.org/job/Atlas-master-UnitTests/ws/notification/target/checkstyle-result.xml>
with 18827 unique warnings and 0 duplicates.
[CHECKSTYLE] Successfully parsed file <https://builds.apache.org/job/Atlas-master-UnitTests/ws/repository/target/checkstyle-result.xml>
with 39088 unique warnings and 0 duplicates.
[CHECKSTYLE] Successfully parsed file <https://builds.apache.org/job/Atlas-master-UnitTests/ws/server-api/target/checkstyle-result.xml>
with 39467 unique warnings and 0 duplicates.
[CHECKSTYLE] Successfully parsed file <https://builds.apache.org/job/Atlas-master-UnitTests/ws/shaded/hbase-client-shaded/target/checkstyle-result.xml>
with 39467 unique warnings and 0 duplicates.
[CHECKSTYLE] Successfully parsed file <https://builds.apache.org/job/Atlas-master-UnitTests/ws/shaded/hbase-server-shaded/target/checkstyle-result.xml>
with 39467 unique warnings and 0 duplicates.
[CHECKSTYLE] Successfully parsed file <https://builds.apache.org/job/Atlas-master-UnitTests/ws/target/checkstyle-result.xml>
with 39467 unique warnings and 0 duplicates.
[CHECKSTYLE] Successfully parsed file <https://builds.apache.org/job/Atlas-master-UnitTests/ws/typesystem/target/checkstyle-result.xml>
with 43685 unique warnings and 0 duplicates.
<Git Blamer> Using GitBlamer to create author and commit information for all warnings.
<Git Blamer> GIT_COMMIT=59f83fc0633f52179a48f0cbe70cbab079c63b72, workspace=<https://builds.apache.org/job/Atlas-master-UnitTests/ws/>
 > git rev-parse 59f83fc0633f52179a48f0cbe70cbab079c63b72^{commit} # timeout=10
<Git Blamer> Skipping file <https://builds.apache.org/job/Atlas-master-UnitTests/ws/graphdb/titan1/src/main/java/org/apache/atlas/repository/graphdb/titan1/graphson/AtlasGraphSONMode.java,>
no result found.
[CHECKSTYLE] Computing warning deltas based on reference build #59
[FINDBUGS] Collecting findbugs analysis files...
[FINDBUGS] Searching for all files in <https://builds.apache.org/job/Atlas-master-UnitTests/ws/>
that match the pattern **/target/findbugs.xml
[FINDBUGS] Parsing 15 files in <https://builds.apache.org/job/Atlas-master-UnitTests/ws/>
[FINDBUGS] Successfully parsed file <https://builds.apache.org/job/Atlas-master-UnitTests/ws/authorization/target/findbugs.xml>
with 0 unique warnings and 0 duplicates.
[FINDBUGS] Successfully parsed file <https://builds.apache.org/job/Atlas-master-UnitTests/ws/catalog/target/findbugs.xml>
with 0 unique warnings and 0 duplicates.
[FINDBUGS] Successfully parsed file <https://builds.apache.org/job/Atlas-master-UnitTests/ws/client/client-v1/target/findbugs.xml>
with 0 unique warnings and 0 duplicates.
[FINDBUGS] Successfully parsed file <https://builds.apache.org/job/Atlas-master-UnitTests/ws/client/client-v2/target/findbugs.xml>
with 0 unique warnings and 0 duplicates.
[FINDBUGS] Successfully parsed file <https://builds.apache.org/job/Atlas-master-UnitTests/ws/client/common/target/findbugs.xml>
with 0 unique warnings and 0 duplicates.
[FINDBUGS] Successfully parsed file <https://builds.apache.org/job/Atlas-master-UnitTests/ws/common/target/findbugs.xml>
with 0 unique warnings and 0 duplicates.
[FINDBUGS] Successfully parsed file <https://builds.apache.org/job/Atlas-master-UnitTests/ws/graphdb/api/target/findbugs.xml>
with 0 unique warnings and 0 duplicates.
[FINDBUGS] Successfully parsed file <https://builds.apache.org/job/Atlas-master-UnitTests/ws/graphdb/common/target/findbugs.xml>
with 0 unique warnings and 0 duplicates.
[FINDBUGS] Successfully parsed file <https://builds.apache.org/job/Atlas-master-UnitTests/ws/graphdb/titan0/target/findbugs.xml>
with 0 unique warnings and 0 duplicates.
[FINDBUGS] Successfully parsed file <https://builds.apache.org/job/Atlas-master-UnitTests/ws/graphdb/titan1/target/findbugs.xml>
with 0 unique warnings and 0 duplicates.
[FINDBUGS] Successfully parsed file <https://builds.apache.org/job/Atlas-master-UnitTests/ws/intg/target/findbugs.xml>
with 0 unique warnings and 0 duplicates.
[FINDBUGS] Successfully parsed file <https://builds.apache.org/job/Atlas-master-UnitTests/ws/notification/target/findbugs.xml>
with 0 unique warnings and 0 duplicates.
[FINDBUGS] Successfully parsed file <https://builds.apache.org/job/Atlas-master-UnitTests/ws/repository/target/findbugs.xml>
with 0 unique warnings and 0 duplicates.
[FINDBUGS] Successfully parsed file <https://builds.apache.org/job/Atlas-master-UnitTests/ws/server-api/target/findbugs.xml>
with 0 unique warnings and 0 duplicates.
[FINDBUGS] Successfully parsed file <https://builds.apache.org/job/Atlas-master-UnitTests/ws/typesystem/target/findbugs.xml>
with 0 unique warnings and 0 duplicates.
<Git Blamer> Using GitBlamer to create author and commit information for all warnings.
<Git Blamer> GIT_COMMIT=59f83fc0633f52179a48f0cbe70cbab079c63b72, workspace=<https://builds.apache.org/job/Atlas-master-UnitTests/ws/>
[FINDBUGS] Computing warning deltas based on reference build #59
Archiving artifacts
[Fast Archiver] Compressed 201.92 MB of artifacts by 52.1% relative to #59
TestNG Reports Processing: START
Looking for TestNG results report in workspace using pattern: **/target/surefire-reports/testng-results.xml,**/target/failsafe-reports/testng-results.xml
Saving reports...
Processing '/x1/jenkins/jenkins-home/jobs/Atlas-master-UnitTests/builds/132/testng/testng-results-1.xml'
Processing '/x1/jenkins/jenkins-home/jobs/Atlas-master-UnitTests/builds/132/testng/testng-results-2.xml'
Processing '/x1/jenkins/jenkins-home/jobs/Atlas-master-UnitTests/builds/132/testng/testng-results-3.xml'
Processing '/x1/jenkins/jenkins-home/jobs/Atlas-master-UnitTests/builds/132/testng/testng-results-4.xml'
Processing '/x1/jenkins/jenkins-home/jobs/Atlas-master-UnitTests/builds/132/testng/testng-results-5.xml'
Processing '/x1/jenkins/jenkins-home/jobs/Atlas-master-UnitTests/builds/132/testng/testng-results-6.xml'
Processing '/x1/jenkins/jenkins-home/jobs/Atlas-master-UnitTests/builds/132/testng/testng-results-7.xml'
Processing '/x1/jenkins/jenkins-home/jobs/Atlas-master-UnitTests/builds/132/testng/testng-results-8.xml'
Processing '/x1/jenkins/jenkins-home/jobs/Atlas-master-UnitTests/builds/132/testng/testng-results-9.xml'
Processing '/x1/jenkins/jenkins-home/jobs/Atlas-master-UnitTests/builds/132/testng/testng-results.xml'
Failed to parse XML: in epilog non whitespace content is not allowed but got t (position:
END_TAG seen ...</testng-results>\nt... @26:2) 
org.xmlpull.v1.XmlPullParserException: in epilog non whitespace content is not allowed but
got t (position: END_TAG seen ...</testng-results>\nt... @26:2) 
	at org.xmlpull.mxp1.MXParser.parseEpilog(MXParser.java:1630)
	at org.xmlpull.mxp1.MXParser.nextImpl(MXParser.java:1393)
	at org.xmlpull.mxp1.MXParser.nextToken(MXParser.java:1100)
	at hudson.plugins.testng.parser.ResultsParser.parse(ResultsParser.java:156)
	at hudson.plugins.testng.TestNGTestResultBuildAction.loadResults(TestNGTestResultBuildAction.java:130)
	at hudson.plugins.testng.Publisher.perform(Publisher.java:214)
	at hudson.tasks.BuildStepCompatibilityLayer.perform(BuildStepCompatibilityLayer.java:81)
	at hudson.tasks.BuildStepMonitor$1.perform(BuildStepMonitor.java:20)
	at hudson.model.AbstractBuild$AbstractBuildExecution.perform(AbstractBuild.java:736)
	at hudson.model.AbstractBuild$AbstractBuildExecution.performAllBuildSteps(AbstractBuild.java:682)
	at hudson.model.Build$BuildExecution.post2(Build.java:186)
	at hudson.model.AbstractBuild$AbstractBuildExecution.post(AbstractBuild.java:627)
	at hudson.model.Run.execute(Run.java:1762)
	at hudson.model.FreeStyleBuild.run(FreeStyleBuild.java:43)
	at hudson.model.ResourceController.execute(ResourceController.java:97)
	at hudson.model.Executor.run(Executor.java:419)
TestNG Reports Processing: FINISH

Mime
View raw message