atlas-dev mailing list archives

Site index · List index
Message view « Date » · « Thread »
Top « Date » · « Thread »
From Apache Jenkins Server <jenk...@builds.apache.org>
Subject Build failed in Jenkins: Atlas-master-IntegrationTests #150
Date Fri, 13 Oct 2017 01:09:25 GMT
See <https://builds.apache.org/job/Atlas-master-IntegrationTests/150/display/redirect?page=changes>

Changes:

[madhan] ATLAS-2195: fix to close a graph transaction left open during Atlas

------------------------------------------
[...truncated 480.96 KB...]
127.0.0.1 - - [13/Oct/2017:01:02:02 +0000] "GET /api/atlas/v2/types/typedef/name/class_trait
HTTP/1.1" 404 88 "-" "Java/1.8.0_144"
127.0.0.1 - - [13/Oct/2017:01:02:02 +0000] "POST /api/atlas/types HTTP/1.1" 201 104 "-" "Java/1.8.0_144"
127.0.0.1 - - [13/Oct/2017:01:02:02 +0000] "GET /api/atlas/v2/types/typedef/name/secure_trait
HTTP/1.1" 404 89 "-" "Java/1.8.0_144"
127.0.0.1 - - [13/Oct/2017:01:02:02 +0000] "POST /api/atlas/types HTTP/1.1" 201 105 "-" "Java/1.8.0_144"
127.0.0.1 - - [13/Oct/2017:01:02:03 +0000] "GET /api/atlas/v2/types/typedef/name/pii_trait
HTTP/1.1" 404 86 "-" "Java/1.8.0_144"
127.0.0.1 - - [13/Oct/2017:01:02:03 +0000] "POST /api/atlas/types HTTP/1.1" 201 102 "-" "Java/1.8.0_144"
127.0.0.1 - - [13/Oct/2017:01:02:03 +0000] "GET /api/atlas/v2/types/typedef/name/ssn_trait
HTTP/1.1" 404 86 "-" "Java/1.8.0_144"
127.0.0.1 - - [13/Oct/2017:01:02:03 +0000] "POST /api/atlas/types HTTP/1.1" 201 102 "-" "Java/1.8.0_144"
127.0.0.1 - - [13/Oct/2017:01:02:03 +0000] "GET /api/atlas/v2/types/typedef/name/salary_trait
HTTP/1.1" 404 89 "-" "Java/1.8.0_144"
127.0.0.1 - - [13/Oct/2017:01:02:03 +0000] "POST /api/atlas/types HTTP/1.1" 201 105 "-" "Java/1.8.0_144"
127.0.0.1 - - [13/Oct/2017:01:02:03 +0000] "GET /api/atlas/v2/types/typedef/name/sox_trait
HTTP/1.1" 404 86 "-" "Java/1.8.0_144"
127.0.0.1 - - [13/Oct/2017:01:02:03 +0000] "POST /api/atlas/types HTTP/1.1" 201 102 "-" "Java/1.8.0_144"
127.0.0.1 - - [13/Oct/2017:01:02:03 +0000] "GET /api/atlas/types?type=TRAIT HTTP/1.1" 200
197 "-" "Java/1.8.0_144"
127.0.0.1 - - [13/Oct/2017:01:02:03 +0000] "GET /api/atlas/v2/types/typedef/name/AJIJqCOwbBH
HTTP/1.1" 404 88 "-" "Java/1.8.0_144"
127.0.0.1 - - [13/Oct/2017:01:02:03 +0000] "POST /api/atlas/types HTTP/1.1" 201 104 "-" "Java/1.8.0_144"
127.0.0.1 - - [13/Oct/2017:01:02:04 +0000] "GET /api/atlas/v2/types/typedef/name/A1YvFdTb6Iwl
HTTP/1.1" 404 89 "-" "Java/1.8.0_144"
127.0.0.1 - - [13/Oct/2017:01:02:04 +0000] "POST /api/atlas/types HTTP/1.1" 201 105 "-" "Java/1.8.0_144"
127.0.0.1 - - [13/Oct/2017:01:02:04 +0000] "GET /api/atlas/v2/types/typedef/name/Bzh06byByeX
HTTP/1.1" 404 88 "-" "Java/1.8.0_144"
127.0.0.1 - - [13/Oct/2017:01:02:04 +0000] "POST /api/atlas/types HTTP/1.1" 201 104 "-" "Java/1.8.0_144"
127.0.0.1 - - [13/Oct/2017:01:02:04 +0000] "GET /api/atlas/v2/types/typedef/name/CXK88dbrpRw
HTTP/1.1" 404 88 "-" "Java/1.8.0_144"
127.0.0.1 - - [13/Oct/2017:01:02:04 +0000] "POST /api/atlas/types HTTP/1.1" 201 104 "-" "Java/1.8.0_144"
127.0.0.1 - - [13/Oct/2017:01:02:05 +0000] "GET /api/atlas/types?type=CLASS&supertype=AJIJqCOwbBH&notsupertype=Bzh06byByeX
HTTP/1.1" 200 108 "-" "Java/1.8.0_144"
127.0.0.1 - - [13/Oct/2017:01:02:05 +0000] "POST /api/atlas/types HTTP/1.1" 201 103 "-" "Java/1.8.0_144"
127.0.0.1 - - [13/Oct/2017:01:02:05 +0000] "PUT /api/atlas/types HTTP/1.1" 200 103 "-" "Java/1.8.0_144"
127.0.0.1 - - [13/Oct/2017:01:02:05 +0000] "GET /api/atlas/types/yrnAuZ1zNY HTTP/1.1" 200
671 "-" "Java/1.8.0_144"
127.0.0.1 - - [13/Oct/2017:01:02:26 +0000] "POST /api/atlas/types HTTP/1.1" 400 46 "-" "Java/1.8.0_144"
Tests run: 143, Failures: 16, Errors: 0, Skipped: 100, Time elapsed: 47.836 sec <<<
FAILURE! - in TestSuite
setUp(org.apache.atlas.web.integration.EntityDiscoveryJerseyResourceIT)  Time elapsed: 8.811
sec  <<< FAILURE!
org.apache.atlas.AtlasServiceException: Metadata service API org.apache.atlas.AtlasClient$API_V1@613a844b
failed with status 400 (Bad Request) Response Body ({"error":"Unknown datatype: hive_db"})
	at org.apache.atlas.web.integration.EntityDiscoveryJerseyResourceIT.setUp(EntityDiscoveryJerseyResourceIT.java:59)

setUp(org.apache.atlas.web.integration.EntityV2JerseyResourceIT)  Time elapsed: 1.47 sec 
<<< FAILURE!
org.apache.atlas.AtlasServiceException: Metadata service API org.apache.atlas.AtlasClientV2$API_V2@3236b399
failed with status 400 (Bad Request) Response Body ({"errorCode":"ATLAS-400-00-029","errorMessage":"Given
typename Process was invalid"})
	at org.apache.atlas.web.integration.EntityV2JerseyResourceIT.setUp(EntityV2JerseyResourceIT.java:80)

setUp(org.apache.atlas.web.integration.MetadataDiscoveryJerseyResourceIT)  Time elapsed: 0.808
sec  <<< FAILURE!
org.apache.atlas.AtlasServiceException: Metadata service API org.apache.atlas.AtlasClient$API_V1@3e9e600b
failed with status 400 (Bad Request) Response Body ({"error":"Given typename Process was invalid"})
	at org.apache.atlas.web.integration.MetadataDiscoveryJerseyResourceIT.createTypes(MetadataDiscoveryJerseyResourceIT.java:237)
	at org.apache.atlas.web.integration.MetadataDiscoveryJerseyResourceIT.setUp(MetadataDiscoveryJerseyResourceIT.java:63)

runQuickStart(org.apache.atlas.examples.QuickStartV2IT)  Time elapsed: 1.261 sec  <<<
FAILURE!
org.apache.atlas.AtlasServiceException: Metadata service API org.apache.atlas.AtlasClientV2$API_V2@3236b399
failed with status 400 (Bad Request) Response Body ({"errorCode":"ATLAS-400-00-029","errorMessage":"Given
typename DataSet was invalid"})
	at org.apache.atlas.examples.QuickStartV2IT.runQuickStart(QuickStartV2IT.java:49)

setUp(org.apache.atlas.notification.NotificationHookConsumerIT)  Time elapsed: 0.585 sec 
<<< FAILURE!
org.apache.atlas.AtlasServiceException: Metadata service API org.apache.atlas.AtlasClient$API_V1@3e9e600b
failed with status 400 (Bad Request) Response Body ({"error":"Given typename Process was invalid"})
	at org.apache.atlas.notification.NotificationHookConsumerIT.setUp(NotificationHookConsumerIT.java:55)

setUp(org.apache.atlas.web.integration.EntityLineageJerseyResourceIT)  Time elapsed: 0.655
sec  <<< FAILURE!
org.apache.atlas.AtlasServiceException: Metadata service API org.apache.atlas.AtlasClient$API_V1@3e9e600b
failed with status 400 (Bad Request) Response Body ({"error":"Given typename Process was invalid"})
	at org.apache.atlas.web.integration.EntityLineageJerseyResourceIT.setUp(EntityLineageJerseyResourceIT.java:60)

testInputsGraph(org.apache.atlas.web.integration.EntityLineageJerseyResourceIT)  Time elapsed:
0.001 sec  <<< FAILURE!
java.lang.IllegalArgumentException: Path segment is null

testInputsGraphForEntity(org.apache.atlas.web.integration.EntityLineageJerseyResourceIT) 
Time elapsed: 0.001 sec  <<< FAILURE!
java.lang.IllegalArgumentException: One or more of query value parameters are null

testOutputsGraph(org.apache.atlas.web.integration.EntityLineageJerseyResourceIT)  Time elapsed:
0.001 sec  <<< FAILURE!
java.lang.IllegalArgumentException: Path segment is null

testOutputsGraphForEntity(org.apache.atlas.web.integration.EntityLineageJerseyResourceIT)
 Time elapsed: 0 sec  <<< FAILURE!
java.lang.IllegalArgumentException: One or more of query value parameters are null

testSchema(org.apache.atlas.web.integration.EntityLineageJerseyResourceIT)  Time elapsed:
0 sec  <<< FAILURE!
java.lang.IllegalArgumentException: Path segment is null

testSchemaForDB(org.apache.atlas.web.integration.EntityLineageJerseyResourceIT)  Time elapsed:
0.002 sec  <<< FAILURE!
org.testng.TestException: 

Expected exception org.apache.atlas.AtlasServiceException but got java.lang.IllegalArgumentException:
Path segment is null
Caused by: java.lang.IllegalArgumentException: Path segment is null

testSchemaForEntity(org.apache.atlas.web.integration.EntityLineageJerseyResourceIT)  Time
elapsed: 0 sec  <<< FAILURE!
java.lang.IllegalArgumentException: One or more of query value parameters are null

setUp(org.apache.atlas.web.integration.DataSetLineageJerseyResourceIT)  Time elapsed: 0.568
sec  <<< FAILURE!
org.apache.atlas.AtlasServiceException: Metadata service API org.apache.atlas.AtlasClient$API_V1@3e9e600b
failed with status 400 (Bad Request) Response Body ({"error":"Given typename Process was invalid"})
	at org.apache.atlas.web.integration.DataSetLineageJerseyResourceIT.setUp(DataSetLineageJerseyResourceIT.java:56)

setUp(org.apache.atlas.web.integration.EntityJerseyResourceIT)  Time elapsed: 0.938 sec  <<<
FAILURE!
org.apache.atlas.AtlasServiceException: Metadata service API org.apache.atlas.AtlasClient$API_V1@3e9e600b
failed with status 400 (Bad Request) Response Body ({"error":"Given typename Process was invalid"})
	at org.apache.atlas.web.integration.EntityJerseyResourceIT.setUp(EntityJerseyResourceIT.java:87)

runQuickStart(org.apache.atlas.examples.QuickStartIT)  Time elapsed: 20.062 sec  <<<
FAILURE!
org.apache.atlas.AtlasServiceException: Metadata service API org.apache.atlas.AtlasClient$API_V1@3e9e600b
failed with status 400 (Bad Request) Response Body ({"error":"Given typename Process was invalid"})
	at org.apache.atlas.examples.QuickStartIT.runQuickStart(QuickStartIT.java:44)


Results :

Failed tests: 
  QuickStartIT.runQuickStart:44 » AtlasService Metadata service API org.apache.a...
  QuickStartV2IT.runQuickStart:49 » AtlasService Metadata service API org.apache...
  NotificationHookConsumerIT.setUp:55->BaseResourceIT.createTypeDefinitionsV1:357->BaseResourceIT.createType:204
» AtlasService
  DataSetLineageJerseyResourceIT.setUp:56->BaseResourceIT.createTypeDefinitionsV1:357->BaseResourceIT.createType:204
» AtlasService
  EntityDiscoveryJerseyResourceIT.setUp:59->BaseResourceIT.createInstance:215 » AtlasService
  EntityJerseyResourceIT.setUp:87->BaseResourceIT.createTypeDefinitionsV1:357->BaseResourceIT.createType:204
» AtlasService
  EntityLineageJerseyResourceIT.setUp:60->DataSetLineageJerseyResourceIT.setUp:56->BaseResourceIT.createTypeDefinitionsV1:357->BaseResourceIT.createType:204
» AtlasService
  EntityLineageJerseyResourceIT>DataSetLineageJerseyResourceIT.testInputsGraph:62 »
IllegalArgument
  EntityLineageJerseyResourceIT>DataSetLineageJerseyResourceIT.testInputsGraphForEntity:81
» IllegalArgument
  EntityLineageJerseyResourceIT>DataSetLineageJerseyResourceIT.testOutputsGraph:98 »
IllegalArgument
  EntityLineageJerseyResourceIT>DataSetLineageJerseyResourceIT.testOutputsGraphForEntity:117
» IllegalArgument
  EntityLineageJerseyResourceIT>DataSetLineageJerseyResourceIT.testSchema:134 » IllegalArgument
  EntityLineageJerseyResourceIT.testSchemaForDB » Test 
Expected exception org.a...
  EntityLineageJerseyResourceIT>DataSetLineageJerseyResourceIT.testSchemaForEntity:158
» IllegalArgument
  EntityV2JerseyResourceIT.setUp:80->BaseResourceIT.createTypeDefinitionsV2:454->BaseResourceIT.batchCreateTypes:157
» AtlasService
  MetadataDiscoveryJerseyResourceIT.setUp:63->createTypes:237->BaseResourceIT.createTypeDefinitionsV1:357->BaseResourceIT.createType:204
» AtlasService

Tests run: 142, Failures: 16, Errors: 0, Skipped: 99

[INFO] 
[INFO] --- jetty-maven-plugin:9.4.0.v20161208:stop (stop-jetty) @ atlas-webapp ---
[INFO] Waiting 10 seconds for jetty to stop
[INFO] Stopped ServerConnector@2b4b1716{HTTP/1.1,[http/1.1]}{0.0.0.0:31000}
[INFO] Stopped scavenging
[INFO] Closing Spring root WebApplicationContext
[INFO] Shutting down log4j
[INFO] Stopped o.e.j.m.p.JettyWebAppContext@465c65de{/,file://<https://builds.apache.org/job/Atlas-master-IntegrationTests/ws/webapp/target/atlas-webapp-1.0.0-SNAPSHOT/,UNAVAILABLE}{/home/jenkins/jenkins-slave/workspace/Atlas-master-IntegrationTests/webapp/target/atlas-webapp-1.0.0-SNAPSHOT.war}>
[INFO] Server reports itself as stopped
[INFO] 
[INFO] --- maven-source-plugin:2.4:jar-no-fork (attach-sources) @ atlas-webapp ---
[INFO] Building jar: <https://builds.apache.org/job/Atlas-master-IntegrationTests/ws/webapp/target/atlas-webapp-1.0.0-SNAPSHOT-sources.jar>
log4j:WARN No appenders could be found for logger (org.apache.zookeeper.ClientCnxn).
log4j:WARN Please initialize the log4j system properly.
log4j:WARN See http://logging.apache.org/log4j/1.2/faq.html#noconfig for more info.
[INFO] 
[INFO] --- maven-source-plugin:2.4:test-jar-no-fork (attach-sources) @ atlas-webapp ---
[INFO] Building jar: <https://builds.apache.org/job/Atlas-master-IntegrationTests/ws/webapp/target/atlas-webapp-1.0.0-SNAPSHOT-test-sources.jar>
[INFO] 
[INFO] --- maven-failsafe-plugin:2.19.1:verify (verify) @ atlas-webapp ---
[INFO] ------------------------------------------------------------------------
[INFO] Reactor Summary:
[INFO] 
[INFO] Apache Atlas Server Build Tools .................... SUCCESS [  1.228 s]
[INFO] apache-atlas ....................................... SUCCESS [ 10.400 s]
[INFO] Apache Atlas Integration ........................... SUCCESS [ 43.226 s]
[INFO] Apache Atlas Common ................................ SUCCESS [ 19.933 s]
[INFO] Apache Atlas Typesystem ............................ SUCCESS [01:40 min]
[INFO] Apache Atlas Client ................................ SUCCESS [  1.089 s]
[INFO] atlas-client-common ................................ SUCCESS [ 19.619 s]
[INFO] atlas-client-v1 .................................... SUCCESS [ 19.336 s]
[INFO] Apache Atlas Server API ............................ SUCCESS [ 18.268 s]
[INFO] Apache Atlas Notification .......................... SUCCESS [ 21.991 s]
[INFO] atlas-client-v2 .................................... SUCCESS [ 15.398 s]
[INFO] Apache Atlas Graph Database Projects ............... SUCCESS [  0.921 s]
[INFO] Apache Atlas Graph Database API .................... SUCCESS [ 17.091 s]
[INFO] Graph Database Common Code ......................... SUCCESS [ 15.212 s]
[INFO] Apache Atlas Titan 1.0.0 GraphDB Impl .............. SUCCESS [01:02 min]
[INFO] Shaded version of Apache hbase client .............. SUCCESS [ 11.363 s]
[INFO] Apache Atlas Titan 0.5.4 Graph DB Impl ............. SUCCESS [ 56.182 s]
[INFO] Apache Atlas Graph Database Implementation Dependencies SUCCESS [  1.179 s]
[INFO] Shaded version of Apache hbase server .............. SUCCESS [ 28.662 s]
[INFO] Apache Atlas Repository ............................ SUCCESS [02:39 min]
[INFO] Apache Atlas Authorization ......................... SUCCESS [ 17.268 s]
[INFO] Apache Atlas Business Catalog ...................... SUCCESS [ 22.892 s]
[INFO] Apache Atlas UI .................................... SUCCESS [01:50 min]
[INFO] Apache Atlas Web Application ....................... FAILURE [04:49 min]
[INFO] Apache Atlas Documentation ......................... SKIPPED
[INFO] Apache Atlas FileSystem Model ...................... SKIPPED
[INFO] Apache Atlas Plugin Classloader .................... SKIPPED
[INFO] Apache Atlas Hive Bridge Shim ...................... SKIPPED
[INFO] Apache Atlas Hive Bridge ........................... SKIPPED
[INFO] Apache Atlas Falcon Bridge Shim .................... SKIPPED
[INFO] Apache Atlas Falcon Bridge ......................... SKIPPED
[INFO] Apache Atlas Sqoop Bridge Shim ..................... SKIPPED
[INFO] Apache Atlas Sqoop Bridge .......................... SKIPPED
[INFO] Apache Atlas Storm Bridge Shim ..................... SKIPPED
[INFO] Apache Atlas Storm Bridge .......................... SKIPPED
[INFO] Apache Atlas Distribution .......................... SKIPPED
[INFO] ------------------------------------------------------------------------
[INFO] BUILD FAILURE
[INFO] ------------------------------------------------------------------------
[INFO] Total time: 17:48 min
[INFO] Finished at: 2017-10-13T01:02:33Z
[INFO] Final Memory: 351M/2516M
[INFO] ------------------------------------------------------------------------
[ERROR] Failed to execute goal org.apache.maven.plugins:maven-failsafe-plugin:2.19.1:verify
(verify) on project atlas-webapp: There are test failures.
[ERROR] 
[ERROR] Please refer to <https://builds.apache.org/job/Atlas-master-IntegrationTests/ws/webapp/target/failsafe-reports>
for the individual test results.
[ERROR] -> [Help 1]
[ERROR] 
[ERROR] To see the full stack trace of the errors, re-run Maven with the -e switch.
[ERROR] Re-run Maven using the -X switch to enable full debug logging.
[ERROR] 
[ERROR] For more information about the errors and possible solutions, please read the following
articles:
[ERROR] [Help 1] http://cwiki.apache.org/confluence/display/MAVEN/MojoFailureException
[ERROR] 
[ERROR] After correcting the problems, you can resume the build with the command
[ERROR]   mvn <goals> -rf :atlas-webapp
Build step 'Execute shell' marked build as failure
[CHECKSTYLE] Collecting checkstyle analysis files...
[CHECKSTYLE] Searching for all files in <https://builds.apache.org/job/Atlas-master-IntegrationTests/ws/>
that match the pattern **/target/checkstyle-result.xml
[CHECKSTYLE] Parsing 22 files in <https://builds.apache.org/job/Atlas-master-IntegrationTests/ws/>
[CHECKSTYLE] Successfully parsed file <https://builds.apache.org/job/Atlas-master-IntegrationTests/ws/authorization/target/checkstyle-result.xml>
with 467 unique warnings and 0 duplicates.
[CHECKSTYLE] Successfully parsed file <https://builds.apache.org/job/Atlas-master-IntegrationTests/ws/catalog/target/checkstyle-result.xml>
with 2604 unique warnings and 0 duplicates.
[CHECKSTYLE] Successfully parsed file <https://builds.apache.org/job/Atlas-master-IntegrationTests/ws/client/client-v1/target/checkstyle-result.xml>
with 3477 unique warnings and 0 duplicates.
[CHECKSTYLE] Successfully parsed file <https://builds.apache.org/job/Atlas-master-IntegrationTests/ws/client/client-v2/target/checkstyle-result.xml>
with 3802 unique warnings and 0 duplicates.
[CHECKSTYLE] Successfully parsed file <https://builds.apache.org/job/Atlas-master-IntegrationTests/ws/client/common/target/checkstyle-result.xml>
with 4262 unique warnings and 0 duplicates.
[CHECKSTYLE] Successfully parsed file <https://builds.apache.org/job/Atlas-master-IntegrationTests/ws/client/target/checkstyle-result.xml>
with 4262 unique warnings and 0 duplicates.
[CHECKSTYLE] Successfully parsed file <https://builds.apache.org/job/Atlas-master-IntegrationTests/ws/common/target/checkstyle-result.xml>
with 5227 unique warnings and 0 duplicates.
[CHECKSTYLE] Successfully parsed file <https://builds.apache.org/job/Atlas-master-IntegrationTests/ws/dashboardv2/target/checkstyle-result.xml>
with 5227 unique warnings and 0 duplicates.
[CHECKSTYLE] Successfully parsed file <https://builds.apache.org/job/Atlas-master-IntegrationTests/ws/graphdb/api/target/checkstyle-result.xml>
with 5500 unique warnings and 0 duplicates.
[CHECKSTYLE] Successfully parsed file <https://builds.apache.org/job/Atlas-master-IntegrationTests/ws/graphdb/common/target/checkstyle-result.xml>
with 5687 unique warnings and 0 duplicates.
[CHECKSTYLE] Successfully parsed file <https://builds.apache.org/job/Atlas-master-IntegrationTests/ws/graphdb/graphdb-impls/target/checkstyle-result.xml>
with 5687 unique warnings and 0 duplicates.
[CHECKSTYLE] Successfully parsed file <https://builds.apache.org/job/Atlas-master-IntegrationTests/ws/graphdb/target/checkstyle-result.xml>
with 5687 unique warnings and 0 duplicates.
[CHECKSTYLE] Successfully parsed file <https://builds.apache.org/job/Atlas-master-IntegrationTests/ws/graphdb/titan0/target/checkstyle-result.xml>
with 8089 unique warnings and 0 duplicates.
[CHECKSTYLE] Successfully parsed file <https://builds.apache.org/job/Atlas-master-IntegrationTests/ws/graphdb/titan1/target/checkstyle-result.xml>
with 9056 unique warnings and 0 duplicates.
[CHECKSTYLE] Successfully parsed file <https://builds.apache.org/job/Atlas-master-IntegrationTests/ws/intg/target/checkstyle-result.xml>
with 17270 unique warnings and 0 duplicates.
[CHECKSTYLE] Successfully parsed file <https://builds.apache.org/job/Atlas-master-IntegrationTests/ws/notification/target/checkstyle-result.xml>
with 18835 unique warnings and 0 duplicates.
[CHECKSTYLE] Successfully parsed file <https://builds.apache.org/job/Atlas-master-IntegrationTests/ws/repository/target/checkstyle-result.xml>
with 39087 unique warnings and 0 duplicates.
[CHECKSTYLE] Successfully parsed file <https://builds.apache.org/job/Atlas-master-IntegrationTests/ws/server-api/target/checkstyle-result.xml>
with 39466 unique warnings and 0 duplicates.
[CHECKSTYLE] Successfully parsed file <https://builds.apache.org/job/Atlas-master-IntegrationTests/ws/shaded/hbase-client-shaded/target/checkstyle-result.xml>
with 39466 unique warnings and 0 duplicates.
[CHECKSTYLE] Successfully parsed file <https://builds.apache.org/job/Atlas-master-IntegrationTests/ws/shaded/hbase-server-shaded/target/checkstyle-result.xml>
with 39466 unique warnings and 0 duplicates.
[CHECKSTYLE] Successfully parsed file <https://builds.apache.org/job/Atlas-master-IntegrationTests/ws/target/checkstyle-result.xml>
with 39466 unique warnings and 0 duplicates.
[CHECKSTYLE] Successfully parsed file <https://builds.apache.org/job/Atlas-master-IntegrationTests/ws/typesystem/target/checkstyle-result.xml>
with 43684 unique warnings and 0 duplicates.
<Git Blamer> Using GitBlamer to create author and commit information for all warnings.
<Git Blamer> GIT_COMMIT=48feaa3529cdcc29434d6f769c0247cc7d2de7b1, workspace=<https://builds.apache.org/job/Atlas-master-IntegrationTests/ws/>
 > git rev-parse 48feaa3529cdcc29434d6f769c0247cc7d2de7b1^{commit} # timeout=10
<Git Blamer> Skipping file <https://builds.apache.org/job/Atlas-master-IntegrationTests/ws/graphdb/titan1/src/main/java/org/apache/atlas/repository/graphdb/titan1/graphson/AtlasGraphSONMode.java,>
no result found.
[FINDBUGS] Collecting findbugs analysis files...
[FINDBUGS] Searching for all files in <https://builds.apache.org/job/Atlas-master-IntegrationTests/ws/>
that match the pattern **/target/findbugs.xml
[FINDBUGS] Parsing 15 files in <https://builds.apache.org/job/Atlas-master-IntegrationTests/ws/>
[FINDBUGS] Successfully parsed file <https://builds.apache.org/job/Atlas-master-IntegrationTests/ws/authorization/target/findbugs.xml>
with 0 unique warnings and 0 duplicates.
[FINDBUGS] Successfully parsed file <https://builds.apache.org/job/Atlas-master-IntegrationTests/ws/catalog/target/findbugs.xml>
with 0 unique warnings and 0 duplicates.
[FINDBUGS] Successfully parsed file <https://builds.apache.org/job/Atlas-master-IntegrationTests/ws/client/client-v1/target/findbugs.xml>
with 0 unique warnings and 0 duplicates.
[FINDBUGS] Successfully parsed file <https://builds.apache.org/job/Atlas-master-IntegrationTests/ws/client/client-v2/target/findbugs.xml>
with 0 unique warnings and 0 duplicates.
[FINDBUGS] Successfully parsed file <https://builds.apache.org/job/Atlas-master-IntegrationTests/ws/client/common/target/findbugs.xml>
with 0 unique warnings and 0 duplicates.
[FINDBUGS] Successfully parsed file <https://builds.apache.org/job/Atlas-master-IntegrationTests/ws/common/target/findbugs.xml>
with 0 unique warnings and 0 duplicates.
[FINDBUGS] Successfully parsed file <https://builds.apache.org/job/Atlas-master-IntegrationTests/ws/graphdb/api/target/findbugs.xml>
with 0 unique warnings and 0 duplicates.
[FINDBUGS] Successfully parsed file <https://builds.apache.org/job/Atlas-master-IntegrationTests/ws/graphdb/common/target/findbugs.xml>
with 0 unique warnings and 0 duplicates.
[FINDBUGS] Successfully parsed file <https://builds.apache.org/job/Atlas-master-IntegrationTests/ws/graphdb/titan0/target/findbugs.xml>
with 0 unique warnings and 0 duplicates.
[FINDBUGS] Successfully parsed file <https://builds.apache.org/job/Atlas-master-IntegrationTests/ws/graphdb/titan1/target/findbugs.xml>
with 0 unique warnings and 0 duplicates.
[FINDBUGS] Successfully parsed file <https://builds.apache.org/job/Atlas-master-IntegrationTests/ws/intg/target/findbugs.xml>
with 0 unique warnings and 0 duplicates.
[FINDBUGS] Successfully parsed file <https://builds.apache.org/job/Atlas-master-IntegrationTests/ws/notification/target/findbugs.xml>
with 0 unique warnings and 0 duplicates.
[FINDBUGS] Successfully parsed file <https://builds.apache.org/job/Atlas-master-IntegrationTests/ws/repository/target/findbugs.xml>
with 0 unique warnings and 0 duplicates.
[FINDBUGS] Successfully parsed file <https://builds.apache.org/job/Atlas-master-IntegrationTests/ws/server-api/target/findbugs.xml>
with 0 unique warnings and 0 duplicates.
[FINDBUGS] Successfully parsed file <https://builds.apache.org/job/Atlas-master-IntegrationTests/ws/typesystem/target/findbugs.xml>
with 0 unique warnings and 0 duplicates.
<Git Blamer> Using GitBlamer to create author and commit information for all warnings.
<Git Blamer> GIT_COMMIT=48feaa3529cdcc29434d6f769c0247cc7d2de7b1, workspace=<https://builds.apache.org/job/Atlas-master-IntegrationTests/ws/>
Archiving artifacts
[Fast Archiver] No prior successful build to compare, so performing full copy of artifacts
TestNG Reports Processing: START
Looking for TestNG results report in workspace using pattern: **/target/surefire-reports/testng-results.xml,**/target/failsafe-reports/testng-results.xml
Saving reports...
Processing '/x1/jenkins/jenkins-home/jobs/Atlas-master-IntegrationTests/builds/150/testng/testng-results.xml'
5.263158% of tests failed, which exceeded threshold of 0%. Marking build as UNSTABLE
TestNG Reports Processing: FINISH

Mime
View raw message