atlas-dev mailing list archives

Site index · List index
Message view « Date » · « Thread »
Top « Date » · « Thread »
From Apache Jenkins Server <jenk...@builds.apache.org>
Subject Build failed in Jenkins: Atlas-0.8-IntegrationTests #119
Date Wed, 25 Oct 2017 01:33:33 GMT
See <https://builds.apache.org/job/Atlas-0.8-IntegrationTests/119/display/redirect?page=changes>

Changes:

[ssubramanian] ATLAS-2224: Fix Atlas build-tools dependency

------------------------------------------
[...truncated 472.27 KB...]
127.0.0.1 - - [25/Oct/2017:01:03:37 +0000] "GET /api/atlas/v2/types/typedef/name/ETLX8Zd6SnCSF
HTTP/1.1" 404 - "-" "Java/1.8.0_144"
127.0.0.1 - - [25/Oct/2017:01:03:37 +0000] "GET /api/atlas/v2/types/typedef/name/DimensionNpkHzDlz9F
HTTP/1.1" 404 - "-" "Java/1.8.0_144"
127.0.0.1 - - [25/Oct/2017:01:03:37 +0000] "GET /api/atlas/v2/types/typedef/name/MetricbaUW95Mp9c
HTTP/1.1" 404 - "-" "Java/1.8.0_144"
127.0.0.1 - - [25/Oct/2017:01:03:37 +0000] "GET /api/atlas/v2/types/typedef/name/hive_db_v1
HTTP/1.1" 200 - "-" "Java/1.8.0_144"
127.0.0.1 - - [25/Oct/2017:01:03:37 +0000] "GET /api/atlas/v2/types/typedef/name/hive_column_v1
HTTP/1.1" 200 - "-" "Java/1.8.0_144"
127.0.0.1 - - [25/Oct/2017:01:03:37 +0000] "GET /api/atlas/v2/types/typedef/name/hive_table_v1
HTTP/1.1" 200 - "-" "Java/1.8.0_144"
127.0.0.1 - - [25/Oct/2017:01:03:37 +0000] "GET /api/atlas/v2/types/typedef/name/hive_process_v1
HTTP/1.1" 200 - "-" "Java/1.8.0_144"
127.0.0.1 - - [25/Oct/2017:01:03:37 +0000] "POST /api/atlas/types HTTP/1.1" 201 - "-" "Java/1.8.0_144"
127.0.0.1 - - [25/Oct/2017:01:03:37 +0000] "GET /api/atlas/v2/types/typedef/name/Fact HTTP/1.1"
404 - "-" "Java/1.8.0_144"
127.0.0.1 - - [25/Oct/2017:01:03:37 +0000] "GET /api/atlas/v2/types/typedef/name/ETL HTTP/1.1"
404 - "-" "Java/1.8.0_144"
127.0.0.1 - - [25/Oct/2017:01:03:37 +0000] "GET /api/atlas/v2/types/typedef/name/Dimension
HTTP/1.1" 404 - "-" "Java/1.8.0_144"
127.0.0.1 - - [25/Oct/2017:01:03:37 +0000] "GET /api/atlas/v2/types/typedef/name/Metric HTTP/1.1"
404 - "-" "Java/1.8.0_144"
127.0.0.1 - - [25/Oct/2017:01:03:37 +0000] "POST /api/atlas/types HTTP/1.1" 201 - "-" "Java/1.8.0_144"
127.0.0.1 - - [25/Oct/2017:01:03:37 +0000] "POST /api/atlas/entities HTTP/1.1" 201 - "-" "Java/1.8.0_144"
127.0.0.1 - - [25/Oct/2017:01:03:37 +0000] "POST /api/atlas/entities HTTP/1.1" 201 - "-" "Java/1.8.0_144"
127.0.0.1 - - [25/Oct/2017:01:03:37 +0000] "POST /api/atlas/entities HTTP/1.1" 201 - "-" "Java/1.8.0_144"
127.0.0.1 - - [25/Oct/2017:01:03:37 +0000] "POST /api/atlas/entities HTTP/1.1" 201 - "-" "Java/1.8.0_144"
127.0.0.1 - - [25/Oct/2017:01:03:37 +0000] "POST /api/atlas/entities HTTP/1.1" 201 - "-" "Java/1.8.0_144"
127.0.0.1 - - [25/Oct/2017:01:03:37 +0000] "POST /api/atlas/entities HTTP/1.1" 201 - "-" "Java/1.8.0_144"
127.0.0.1 - - [25/Oct/2017:01:03:37 +0000] "POST /api/atlas/entities HTTP/1.1" 201 - "-" "Java/1.8.0_144"
127.0.0.1 - - [25/Oct/2017:01:03:38 +0000] "POST /api/atlas/entities HTTP/1.1" 201 - "-" "Java/1.8.0_144"
127.0.0.1 - - [25/Oct/2017:01:03:38 +0000] "GET /api/atlas/lineage/hive/table/sales_fact_monthly_mvgIso0BlTgi/inputs/graph
HTTP/1.1" 200 - "-" "Java/1.8.0_144"
127.0.0.1 - - [25/Oct/2017:01:03:39 +0000] "GET /api/atlas/entities?type=hive_table_v1&property=qualifiedName&value=sales_fact_monthly_mvgIso0BlTgi
HTTP/1.1" 200 - "-" "Java/1.8.0_144"
127.0.0.1 - - [25/Oct/2017:01:03:39 +0000] "GET /api/atlas/lineage/3a650274-e19d-4e2f-8a6f-0bad2696f630/inputs/graph
HTTP/1.1" 200 - "-" "Java/1.8.0_144"
127.0.0.1 - - [25/Oct/2017:01:03:40 +0000] "GET /api/atlas/lineage/hive/table/sales_factDM8QjfRFzi/outputs/graph
HTTP/1.1" 200 - "-" "Java/1.8.0_144"
127.0.0.1 - - [25/Oct/2017:01:03:42 +0000] "GET /api/atlas/entities?type=hive_table_v1&property=qualifiedName&value=sales_factDM8QjfRFzi
HTTP/1.1" 200 - "-" "Java/1.8.0_144"
127.0.0.1 - - [25/Oct/2017:01:03:42 +0000] "GET /api/atlas/lineage/e41f95b1-5a4d-4e4f-bb2d-c1615a33c626/outputs/graph
HTTP/1.1" 200 - "-" "Java/1.8.0_144"
127.0.0.1 - - [25/Oct/2017:01:03:43 +0000] "GET /api/atlas/lineage/hive/table/sales_factDM8QjfRFzi/schema
HTTP/1.1" 200 - "-" "Java/1.8.0_144"
127.0.0.1 - - [25/Oct/2017:01:03:44 +0000] "GET /api/atlas/lineage/hive/table/Salesl1PQAXBmKP/schema
HTTP/1.1" 404 - "-" "Java/1.8.0_144"
127.0.0.1 - - [25/Oct/2017:01:03:44 +0000] "GET /api/atlas/entities?type=hive_table_v1&property=qualifiedName&value=sales_factDM8QjfRFzi
HTTP/1.1" 200 - "-" "Java/1.8.0_144"
127.0.0.1 - - [25/Oct/2017:01:03:44 +0000] "GET /api/atlas/lineage/e41f95b1-5a4d-4e4f-bb2d-c1615a33c626/schema
HTTP/1.1" 200 - "-" "Java/1.8.0_144"
127.0.0.1 - - [25/Oct/2017:01:03:45 +0000] "GET /api/atlas/lineage/hive/table/blah/schema
HTTP/1.1" 404 - "-" "Java/1.8.0_144"
127.0.0.1 - - [25/Oct/2017:01:03:45 +0000] "POST /api/atlas/v2/types/typedefs HTTP/1.1" 409
- "-" "Java/1.8.0_144"
127.0.0.1 - - [25/Oct/2017:01:03:45 +0000] "POST /api/atlas/admin/import HTTP/1.1" 200 - "-"
"Java/1.8.0_144"
127.0.0.1 - - [25/Oct/2017:01:03:48 +0000] "GET /api/atlas/v2/types/typedef/name/fooTag HTTP/1.1"
404 - "-" "Java/1.8.0_144"
127.0.0.1 - - [25/Oct/2017:01:03:48 +0000] "POST /api/atlas/v2/types/typedefs HTTP/1.1" 200
- "-" "Java/1.8.0_144"
127.0.0.1 - - [25/Oct/2017:01:03:48 +0000] "GET /api/atlas/v2/entity/uniqueAttribute/type/hdfs_path?attr:qualifiedName=test%241test%2B%2B-%2B%26%26%2B%7C%7C%2B%21%2B%28%2B%29%2B%7B%2B%7D%2B%5B%2B%5D%2B%5E%2B%3C%2B%3E%2B%3B%2B%3A%2B%22%2B%25%2B*%2B%60%2B%7E
HTTP/1.1" 404 - "-" "Java/1.8.0_144"
127.0.0.1 - - [25/Oct/2017:01:03:48 +0000] "POST /api/atlas/v2/entity HTTP/1.1" 200 - "-"
"Java/1.8.0_144"
127.0.0.1 - - [25/Oct/2017:01:03:53 +0000] "POST /api/atlas/v2/search/basic HTTP/1.1" 200
- "-" "Java/1.8.0_144"
127.0.0.1 - - [25/Oct/2017:01:03:53 +0000] "POST /api/atlas/v2/search/basic HTTP/1.1" 200
- "-" "Java/1.8.0_144"
127.0.0.1 - - [25/Oct/2017:01:03:53 +0000] "POST /api/atlas/v2/search/basic HTTP/1.1" 200
- "-" "Java/1.8.0_144"
127.0.0.1 - - [25/Oct/2017:01:03:53 +0000] "POST /api/atlas/v2/search/basic HTTP/1.1" 200
- "-" "Java/1.8.0_144"
127.0.0.1 - - [25/Oct/2017:01:03:53 +0000] "POST /api/atlas/v2/search/basic HTTP/1.1" 200
- "-" "Java/1.8.0_144"
127.0.0.1 - - [25/Oct/2017:01:03:53 +0000] "POST /api/atlas/v2/search/basic HTTP/1.1" 200
- "-" "Java/1.8.0_144"
127.0.0.1 - - [25/Oct/2017:01:03:53 +0000] "POST /api/atlas/v2/search/basic HTTP/1.1" 200
- "-" "Java/1.8.0_144"
127.0.0.1 - - [25/Oct/2017:01:03:53 +0000] "POST /api/atlas/v2/search/basic HTTP/1.1" 200
- "-" "Java/1.8.0_144"
127.0.0.1 - - [25/Oct/2017:01:03:53 +0000] "POST /api/atlas/v2/search/basic HTTP/1.1" 200
- "-" "Java/1.8.0_144"
127.0.0.1 - - [25/Oct/2017:01:03:53 +0000] "POST /api/atlas/v2/search/basic HTTP/1.1" 200
- "-" "Java/1.8.0_144"
127.0.0.1 - - [25/Oct/2017:01:03:53 +0000] "POST /api/atlas/v2/search/basic HTTP/1.1" 200
- "-" "Java/1.8.0_144"
127.0.0.1 - - [25/Oct/2017:01:03:53 +0000] "POST /api/atlas/v2/search/basic HTTP/1.1" 200
- "-" "Java/1.8.0_144"
127.0.0.1 - - [25/Oct/2017:01:03:53 +0000] "POST /api/atlas/v2/search/basic HTTP/1.1" 200
- "-" "Java/1.8.0_144"
127.0.0.1 - - [25/Oct/2017:01:03:53 +0000] "POST /api/atlas/v2/search/basic HTTP/1.1" 200
- "-" "Java/1.8.0_144"
127.0.0.1 - - [25/Oct/2017:01:03:53 +0000] "POST /api/atlas/v2/search/basic HTTP/1.1" 200
- "-" "Java/1.8.0_144"
127.0.0.1 - - [25/Oct/2017:01:03:53 +0000] "POST /api/atlas/v2/search/basic HTTP/1.1" 200
- "-" "Java/1.8.0_144"
127.0.0.1 - - [25/Oct/2017:01:03:53 +0000] "POST /api/atlas/v2/search/basic HTTP/1.1" 200
- "-" "Java/1.8.0_144"
127.0.0.1 - - [25/Oct/2017:01:03:53 +0000] "POST /api/atlas/v2/search/basic HTTP/1.1" 200
- "-" "Java/1.8.0_144"
127.0.0.1 - - [25/Oct/2017:01:03:54 +0000] "GET /api/atlas/v2/types/typedef/name/tableType
HTTP/1.1" 200 - "-" "Java/1.8.0_144"
127.0.0.1 - - [25/Oct/2017:01:03:54 +0000] "GET /api/atlas/v2/types/typedef/name/serdeType
HTTP/1.1" 200 - "-" "Java/1.8.0_144"
127.0.0.1 - - [25/Oct/2017:01:03:54 +0000] "GET /api/atlas/v2/types/typedef/name/classification
HTTP/1.1" 200 - "-" "Java/1.8.0_144"
127.0.0.1 - - [25/Oct/2017:01:03:54 +0000] "GET /api/atlas/v2/types/typedef/name/pii HTTP/1.1"
200 - "-" "Java/1.8.0_144"
127.0.0.1 - - [25/Oct/2017:01:03:54 +0000] "GET /api/atlas/v2/types/typedef/name/phi HTTP/1.1"
200 - "-" "Java/1.8.0_144"
127.0.0.1 - - [25/Oct/2017:01:03:54 +0000] "GET /api/atlas/v2/types/typedef/name/pci HTTP/1.1"
200 - "-" "Java/1.8.0_144"
127.0.0.1 - - [25/Oct/2017:01:03:54 +0000] "GET /api/atlas/v2/types/typedef/name/sox HTTP/1.1"
200 - "-" "Java/1.8.0_144"
127.0.0.1 - - [25/Oct/2017:01:03:54 +0000] "GET /api/atlas/v2/types/typedef/name/sec HTTP/1.1"
200 - "-" "Java/1.8.0_144"
127.0.0.1 - - [25/Oct/2017:01:03:54 +0000] "GET /api/atlas/v2/types/typedef/name/finance HTTP/1.1"
200 - "-" "Java/1.8.0_144"
127.0.0.1 - - [25/Oct/2017:01:03:54 +0000] "GET /api/atlas/v2/types/typedef/name/FactuwdY3VhiLY
HTTP/1.1" 404 - "-" "Java/1.8.0_144"
127.0.0.1 - - [25/Oct/2017:01:03:54 +0000] "GET /api/atlas/v2/types/typedef/name/ETLtDdLyK77HH
HTTP/1.1" 404 - "-" "Java/1.8.0_144"
127.0.0.1 - - [25/Oct/2017:01:03:54 +0000] "GET /api/atlas/v2/types/typedef/name/DimensionuHynHjgli2
HTTP/1.1" 404 - "-" "Java/1.8.0_144"
127.0.0.1 - - [25/Oct/2017:01:03:54 +0000] "GET /api/atlas/v2/types/typedef/name/MetrictOdbJkR2au
HTTP/1.1" 404 - "-" "Java/1.8.0_144"
127.0.0.1 - - [25/Oct/2017:01:03:54 +0000] "GET /api/atlas/v2/types/typedef/name/hive_db_v1
HTTP/1.1" 200 - "-" "Java/1.8.0_144"
127.0.0.1 - - [25/Oct/2017:01:03:54 +0000] "GET /api/atlas/v2/types/typedef/name/hive_column_v1
HTTP/1.1" 200 - "-" "Java/1.8.0_144"
127.0.0.1 - - [25/Oct/2017:01:03:54 +0000] "GET /api/atlas/v2/types/typedef/name/hive_table_v1
HTTP/1.1" 200 - "-" "Java/1.8.0_144"
127.0.0.1 - - [25/Oct/2017:01:03:54 +0000] "GET /api/atlas/v2/types/typedef/name/hive_process_v1
HTTP/1.1" 200 - "-" "Java/1.8.0_144"
127.0.0.1 - - [25/Oct/2017:01:03:54 +0000] "POST /api/atlas/types HTTP/1.1" 201 - "-" "Java/1.8.0_144"
127.0.0.1 - - [25/Oct/2017:01:03:54 +0000] "GET /api/atlas/v2/types/typedef/name/Classification
HTTP/1.1" 404 - "-" "Java/1.8.0_144"
127.0.0.1 - - [25/Oct/2017:01:03:54 +0000] "GET /api/atlas/v2/types/typedef/name/dsl_test_type
HTTP/1.1" 404 - "-" "Java/1.8.0_144"
127.0.0.1 - - [25/Oct/2017:01:03:54 +0000] "POST /api/atlas/types HTTP/1.1" 201 - "-" "Java/1.8.0_144"
127.0.0.1 - - [25/Oct/2017:01:03:54 +0000] "POST /api/atlas/entities HTTP/1.1" 201 - "-" "Java/1.8.0_144"
127.0.0.1 - - [25/Oct/2017:01:03:54 +0000] "GET /api/atlas/discovery/search/dsl?query=from+hive_db_v1+name%3D%22dbxbxCMVQcsm%22
HTTP/1.1" 200 - "-" "Java/1.8.0_144"
127.0.0.1 - - [25/Oct/2017:01:03:55 +0000] "GET /api/atlas/discovery/search/dsl?query=from+blah
HTTP/1.1" 400 - "-" "Java/1.8.0_144"
127.0.0.1 - - [25/Oct/2017:01:03:55 +0000] "GET /api/atlas/discovery/search/dsl?query=from+hive_db_v1+name%3D%22dbxbxCMVQcsm%22
HTTP/1.1" 200 - "-" "Java/1.8.0_144"
127.0.0.1 - - [25/Oct/2017:01:03:55 +0000] "GET /api/atlas/discovery/search/dsl?query=from+hive_db_v1+name%3D%22dbxbxCMVQcsm%22&limit=10&offset=0
HTTP/1.1" 200 - "-" "Java/1.8.0_144"
127.0.0.1 - - [25/Oct/2017:01:03:56 +0000] "GET /api/atlas/discovery/search/dsl?query=from+hive_db_v1+name%3D%22dbxbxCMVQcsm%22&limit=-1&offset=-1
HTTP/1.1" 200 - "-" "Java/1.8.0_144"
127.0.0.1 - - [25/Oct/2017:01:03:57 +0000] "GET /api/atlas/discovery/search/dsl?query=from+hive_db_v1+name%3D%22dbxbxCMVQcsm%22&limit=1&offset=0
HTTP/1.1" 200 - "-" "Java/1.8.0_144"
127.0.0.1 - - [25/Oct/2017:01:03:57 +0000] "GET /api/atlas/discovery/search/dsl?query=from+hive_db_v1+name%3D%22dbxbxCMVQcsm%22&limit=10&offset=1
HTTP/1.1" 200 - "-" "Java/1.8.0_144"
127.0.0.1 - - [25/Oct/2017:01:03:58 +0000] "GET /api/atlas/discovery/search/dsl?query=from+hive_db_v1+name%3D%22dbxbxCMVQcsm%22&limit=0&offset=10
HTTP/1.1" 400 - "-" "Java/1.8.0_144"
127.0.0.1 - - [25/Oct/2017:01:03:58 +0000] "GET /api/atlas/discovery/search/dsl?query=from+hive_db_v1+name%3D%22dbxbxCMVQcsm%22&limit=2147483647&offset=10
HTTP/1.1" 400 - "-" "Java/1.8.0_144"
127.0.0.1 - - [25/Oct/2017:01:03:58 +0000] "GET /api/atlas/discovery/search/dsl?query=from+hive_db_v1+name%3D%22dbxbxCMVQcsm%22&limit=10&offset=-2
HTTP/1.1" 400 - "-" "Java/1.8.0_144"
127.0.0.1 - - [25/Oct/2017:01:03:58 +0000] "GET /api/atlas/discovery/search?query=* HTTP/1.1"
200 - "-" "Java/1.8.0_144"
127.0.0.1 - - [25/Oct/2017:01:03:58 +0000] "GET /api/atlas/discovery/search?query=from+hive_db_v1+name%3D%22dbxbxCMVQcsm%22
HTTP/1.1" 200 - "-" "Java/1.8.0_144"
127.0.0.1 - - [25/Oct/2017:01:03:59 +0000] "GET /api/atlas/discovery/search/gremlin?query=g.V.has('type',+'hive_table_v1').toList()
HTTP/1.1" 200 - "-" "Java/1.8.0_144"
Tests run: 146, Failures: 1, Errors: 0, Skipped: 105, Time elapsed: 45.718 sec <<<
FAILURE! - in TestSuite
runQuickStart(org.apache.atlas.examples.QuickStartV2IT)  Time elapsed: 0.466 sec  <<<
FAILURE!
org.apache.atlas.AtlasServiceException: Metadata service API org.apache.atlas.AtlasClientV2$API_V2@39611be2
failed with status 409 (Conflict) Response Body ({"errorCode":"ATLAS-409-00-001","errorMessage":"Given
type Dimension already exists"})
	at org.apache.atlas.AtlasBaseClient.callAPIWithResource(AtlasBaseClient.java:387)
	at org.apache.atlas.AtlasBaseClient.callAPIWithResource(AtlasBaseClient.java:320)
	at org.apache.atlas.AtlasBaseClient.callAPI(AtlasBaseClient.java:208)
	at org.apache.atlas.AtlasClientV2.createAtlasTypeDefs(AtlasClientV2.java:219)
	at org.apache.atlas.examples.QuickStartV2.createTypes(QuickStartV2.java:191)
	at org.apache.atlas.examples.QuickStartV2.runQuickstart(QuickStartV2.java:147)
	at org.apache.atlas.examples.QuickStartV2IT.runQuickStart(QuickStartV2IT.java:49)


Results :

Failed tests: 
  QuickStartV2IT.runQuickStart:49 » AtlasService Metadata service API org.apache...

Tests run: 145, Failures: 1, Errors: 0, Skipped: 104

[INFO] 
[INFO] --- jetty-maven-plugin:9.2.12.v20150709:stop (stop-jetty) @ atlas-webapp ---
[INFO] Waiting 10 seconds for jetty to stop
[INFO] Stopped ServerConnector@204b4012{HTTP/1.1}{0.0.0.0:31000}
[INFO] Closing Spring root WebApplicationContext
[INFO] Shutting down log4j
[INFO] Not cleaning cached beans: no such field javax.el.BeanELResolver.properties
[INFO] Stopped o.e.j.m.p.JettyWebAppContext@b365990{/,<https://builds.apache.org/job/Atlas-0.8-IntegrationTests/ws/webapp/target/atlas-webapp-0.8.2-SNAPSHOT/,UNAVAILABLE}{/home/jenkins/jenkins-slave/workspace/Atlas-0.8-IntegrationTests/webapp/target/atlas-webapp-0.8.2-SNAPSHOT.war}>
[INFO] Server reports itself as stopped
[INFO] 
[INFO] --- maven-source-plugin:2.4:jar-no-fork (attach-sources) @ atlas-webapp ---
[INFO] Building jar: <https://builds.apache.org/job/Atlas-0.8-IntegrationTests/ws/webapp/target/atlas-webapp-0.8.2-SNAPSHOT-sources.jar>
log4j:WARN No appenders could be found for logger (org.apache.zookeeper.ClientCnxn).
log4j:WARN Please initialize the log4j system properly.
log4j:WARN See http://logging.apache.org/log4j/1.2/faq.html#noconfig for more info.
[INFO] 
[INFO] --- maven-source-plugin:2.4:test-jar-no-fork (attach-sources) @ atlas-webapp ---
[INFO] Building jar: <https://builds.apache.org/job/Atlas-0.8-IntegrationTests/ws/webapp/target/atlas-webapp-0.8.2-SNAPSHOT-test-sources.jar>
[INFO] 
[INFO] --- maven-failsafe-plugin:2.18.1:verify (verify) @ atlas-webapp ---
[INFO] Failsafe report directory: <https://builds.apache.org/job/Atlas-0.8-IntegrationTests/ws/webapp/target/failsafe-reports>
[INFO] ------------------------------------------------------------------------
[INFO] Reactor Summary:
[INFO] 
[INFO] Apache Atlas Server Build Tools .................... SUCCESS [  0.859 s]
[INFO] apache-atlas ....................................... SUCCESS [  5.988 s]
[INFO] Apache Atlas Integration ........................... SUCCESS [ 23.081 s]
[INFO] Apache Atlas Common ................................ SUCCESS [  8.772 s]
[INFO] Apache Atlas Typesystem ............................ SUCCESS [ 47.053 s]
[INFO] Apache Atlas Client ................................ SUCCESS [  0.707 s]
[INFO] atlas-client-common ................................ SUCCESS [  8.005 s]
[INFO] atlas-client-v1 .................................... SUCCESS [  6.693 s]
[INFO] Apache Atlas Server API ............................ SUCCESS [  5.937 s]
[INFO] Apache Atlas Notification .......................... SUCCESS [ 10.872 s]
[INFO] atlas-client-v2 .................................... SUCCESS [  5.213 s]
[INFO] Apache Atlas Graph Database Projects ............... SUCCESS [  0.437 s]
[INFO] Apache Atlas Graph Database API .................... SUCCESS [  4.484 s]
[INFO] Graph Database Common Code ......................... SUCCESS [  5.203 s]
[INFO] Apache Atlas Titan 1.0.0 GraphDB Impl .............. SUCCESS [ 39.351 s]
[INFO] Shaded version of Apache hbase client .............. SUCCESS [  7.615 s]
[INFO] Apache Atlas Titan 0.5.4 Graph DB Impl ............. SUCCESS [ 35.839 s]
[INFO] Apache Atlas Graph Database Implementation Dependencies SUCCESS [  0.567 s]
[INFO] Shaded version of Apache hbase server .............. SUCCESS [ 21.976 s]
[INFO] Apache Atlas Repository ............................ SUCCESS [01:20 min]
[INFO] Apache Atlas Authorization ......................... SUCCESS [  6.411 s]
[INFO] Apache Atlas Business Catalog ...................... SUCCESS [ 10.585 s]
[INFO] Apache Atlas UI .................................... SUCCESS [01:20 min]
[INFO] Apache Atlas Web Application ....................... FAILURE [02:11 min]
[INFO] Apache Atlas Documentation ......................... SKIPPED
[INFO] Apache Atlas FileSystem Model ...................... SKIPPED
[INFO] Apache Atlas Plugin Classloader .................... SKIPPED
[INFO] Apache Atlas Hive Bridge Shim ...................... SKIPPED
[INFO] Apache Atlas Hive Bridge ........................... SKIPPED
[INFO] Apache Atlas Falcon Bridge Shim .................... SKIPPED
[INFO] Apache Atlas Falcon Bridge ......................... SKIPPED
[INFO] Apache Atlas Sqoop Bridge Shim ..................... SKIPPED
[INFO] Apache Atlas Sqoop Bridge .......................... SKIPPED
[INFO] Apache Atlas Storm Bridge Shim ..................... SKIPPED
[INFO] Apache Atlas Storm Bridge .......................... SKIPPED
[INFO] Apache Atlas Hbase Bridge Shim ..................... SKIPPED
[INFO] Apache Atlas Hbase Bridge .......................... SKIPPED
[INFO] Apache Atlas Distribution .......................... SKIPPED
[INFO] ------------------------------------------------------------------------
[INFO] BUILD FAILURE
[INFO] ------------------------------------------------------------------------
[INFO] Total time: 09:09 min
[INFO] Finished at: 2017-10-25T01:04:03Z
[INFO] Final Memory: 352M/2765M
[INFO] ------------------------------------------------------------------------
[ERROR] Failed to execute goal org.apache.maven.plugins:maven-failsafe-plugin:2.18.1:verify
(verify) on project atlas-webapp: There are test failures.
[ERROR] 
[ERROR] Please refer to <https://builds.apache.org/job/Atlas-0.8-IntegrationTests/ws/webapp/target/failsafe-reports>
for the individual test results.
[ERROR] -> [Help 1]
[ERROR] 
[ERROR] To see the full stack trace of the errors, re-run Maven with the -e switch.
[ERROR] Re-run Maven using the -X switch to enable full debug logging.
[ERROR] 
[ERROR] For more information about the errors and possible solutions, please read the following
articles:
[ERROR] [Help 1] http://cwiki.apache.org/confluence/display/MAVEN/MojoFailureException
[ERROR] 
[ERROR] After correcting the problems, you can resume the build with the command
[ERROR]   mvn <goals> -rf :atlas-webapp
Build step 'Execute shell' marked build as failure
[CHECKSTYLE] Collecting checkstyle analysis files...
[CHECKSTYLE] Searching for all files in <https://builds.apache.org/job/Atlas-0.8-IntegrationTests/ws/>
that match the pattern **/target/checkstyle-result.xml
[CHECKSTYLE] Parsing 22 files in <https://builds.apache.org/job/Atlas-0.8-IntegrationTests/ws/>
[CHECKSTYLE] Successfully parsed file <https://builds.apache.org/job/Atlas-0.8-IntegrationTests/ws/authorization/target/checkstyle-result.xml>
with 467 unique warnings and 0 duplicates.
[CHECKSTYLE] Successfully parsed file <https://builds.apache.org/job/Atlas-0.8-IntegrationTests/ws/catalog/target/checkstyle-result.xml>
with 2604 unique warnings and 0 duplicates.
[CHECKSTYLE] Successfully parsed file <https://builds.apache.org/job/Atlas-0.8-IntegrationTests/ws/client/client-v1/target/checkstyle-result.xml>
with 3480 unique warnings and 0 duplicates.
[CHECKSTYLE] Successfully parsed file <https://builds.apache.org/job/Atlas-0.8-IntegrationTests/ws/client/client-v2/target/checkstyle-result.xml>
with 3805 unique warnings and 0 duplicates.
[CHECKSTYLE] Successfully parsed file <https://builds.apache.org/job/Atlas-0.8-IntegrationTests/ws/client/common/target/checkstyle-result.xml>
with 4295 unique warnings and 0 duplicates.
[CHECKSTYLE] Successfully parsed file <https://builds.apache.org/job/Atlas-0.8-IntegrationTests/ws/client/target/checkstyle-result.xml>
with 4295 unique warnings and 0 duplicates.
[CHECKSTYLE] Successfully parsed file <https://builds.apache.org/job/Atlas-0.8-IntegrationTests/ws/common/target/checkstyle-result.xml>
with 5254 unique warnings and 0 duplicates.
[CHECKSTYLE] Successfully parsed file <https://builds.apache.org/job/Atlas-0.8-IntegrationTests/ws/dashboardv2/target/checkstyle-result.xml>
with 5254 unique warnings and 0 duplicates.
[CHECKSTYLE] Successfully parsed file <https://builds.apache.org/job/Atlas-0.8-IntegrationTests/ws/graphdb/api/target/checkstyle-result.xml>
with 5527 unique warnings and 0 duplicates.
[CHECKSTYLE] Successfully parsed file <https://builds.apache.org/job/Atlas-0.8-IntegrationTests/ws/graphdb/common/target/checkstyle-result.xml>
with 5714 unique warnings and 0 duplicates.
[CHECKSTYLE] Successfully parsed file <https://builds.apache.org/job/Atlas-0.8-IntegrationTests/ws/graphdb/graphdb-impls/target/checkstyle-result.xml>
with 5714 unique warnings and 0 duplicates.
[CHECKSTYLE] Successfully parsed file <https://builds.apache.org/job/Atlas-0.8-IntegrationTests/ws/graphdb/target/checkstyle-result.xml>
with 5714 unique warnings and 0 duplicates.
[CHECKSTYLE] Successfully parsed file <https://builds.apache.org/job/Atlas-0.8-IntegrationTests/ws/graphdb/titan0/target/checkstyle-result.xml>
with 8169 unique warnings and 0 duplicates.
[CHECKSTYLE] Successfully parsed file <https://builds.apache.org/job/Atlas-0.8-IntegrationTests/ws/graphdb/titan1/target/checkstyle-result.xml>
with 9136 unique warnings and 0 duplicates.
[CHECKSTYLE] Successfully parsed file <https://builds.apache.org/job/Atlas-0.8-IntegrationTests/ws/intg/target/checkstyle-result.xml>
with 15850 unique warnings and 0 duplicates.
[CHECKSTYLE] Successfully parsed file <https://builds.apache.org/job/Atlas-0.8-IntegrationTests/ws/notification/target/checkstyle-result.xml>
with 17415 unique warnings and 0 duplicates.
[CHECKSTYLE] Successfully parsed file <https://builds.apache.org/job/Atlas-0.8-IntegrationTests/ws/repository/target/checkstyle-result.xml>
with 36354 unique warnings and 0 duplicates.
[CHECKSTYLE] Successfully parsed file <https://builds.apache.org/job/Atlas-0.8-IntegrationTests/ws/server-api/target/checkstyle-result.xml>
with 36747 unique warnings and 0 duplicates.
[CHECKSTYLE] Successfully parsed file <https://builds.apache.org/job/Atlas-0.8-IntegrationTests/ws/shaded/hbase-client-shaded/target/checkstyle-result.xml>
with 36747 unique warnings and 0 duplicates.
[CHECKSTYLE] Successfully parsed file <https://builds.apache.org/job/Atlas-0.8-IntegrationTests/ws/shaded/hbase-server-shaded/target/checkstyle-result.xml>
with 36747 unique warnings and 0 duplicates.
[CHECKSTYLE] Successfully parsed file <https://builds.apache.org/job/Atlas-0.8-IntegrationTests/ws/target/checkstyle-result.xml>
with 36747 unique warnings and 0 duplicates.
[CHECKSTYLE] Successfully parsed file <https://builds.apache.org/job/Atlas-0.8-IntegrationTests/ws/typesystem/target/checkstyle-result.xml>
with 40965 unique warnings and 0 duplicates.
<Git Blamer> Using GitBlamer to create author and commit information for all warnings.
<Git Blamer> GIT_COMMIT=52923ffc10e40f2c5127651e8164306c8fab8133, workspace=<https://builds.apache.org/job/Atlas-0.8-IntegrationTests/ws/>
 > git rev-parse 52923ffc10e40f2c5127651e8164306c8fab8133^{commit} # timeout=10
<Git Blamer> Skipping file <https://builds.apache.org/job/Atlas-0.8-IntegrationTests/ws/typesystem/src/main/java/org/apache/atlas/typesystem/IStruct.java,>
no result found.
[FINDBUGS] Collecting findbugs analysis files...
[FINDBUGS] Searching for all files in <https://builds.apache.org/job/Atlas-0.8-IntegrationTests/ws/>
that match the pattern **/target/findbugs.xml
[FINDBUGS] Parsing 15 files in <https://builds.apache.org/job/Atlas-0.8-IntegrationTests/ws/>
[FINDBUGS] Successfully parsed file <https://builds.apache.org/job/Atlas-0.8-IntegrationTests/ws/authorization/target/findbugs.xml>
with 0 unique warnings and 0 duplicates.
[FINDBUGS] Successfully parsed file <https://builds.apache.org/job/Atlas-0.8-IntegrationTests/ws/catalog/target/findbugs.xml>
with 0 unique warnings and 0 duplicates.
[FINDBUGS] Successfully parsed file <https://builds.apache.org/job/Atlas-0.8-IntegrationTests/ws/client/client-v1/target/findbugs.xml>
with 0 unique warnings and 0 duplicates.
[FINDBUGS] Successfully parsed file <https://builds.apache.org/job/Atlas-0.8-IntegrationTests/ws/client/client-v2/target/findbugs.xml>
with 0 unique warnings and 0 duplicates.
[FINDBUGS] Successfully parsed file <https://builds.apache.org/job/Atlas-0.8-IntegrationTests/ws/client/common/target/findbugs.xml>
with 0 unique warnings and 0 duplicates.
[FINDBUGS] Successfully parsed file <https://builds.apache.org/job/Atlas-0.8-IntegrationTests/ws/common/target/findbugs.xml>
with 0 unique warnings and 0 duplicates.
[FINDBUGS] Successfully parsed file <https://builds.apache.org/job/Atlas-0.8-IntegrationTests/ws/graphdb/api/target/findbugs.xml>
with 0 unique warnings and 0 duplicates.
[FINDBUGS] Successfully parsed file <https://builds.apache.org/job/Atlas-0.8-IntegrationTests/ws/graphdb/common/target/findbugs.xml>
with 0 unique warnings and 0 duplicates.
[FINDBUGS] Successfully parsed file <https://builds.apache.org/job/Atlas-0.8-IntegrationTests/ws/graphdb/titan0/target/findbugs.xml>
with 0 unique warnings and 0 duplicates.
[FINDBUGS] Successfully parsed file <https://builds.apache.org/job/Atlas-0.8-IntegrationTests/ws/graphdb/titan1/target/findbugs.xml>
with 0 unique warnings and 0 duplicates.
[FINDBUGS] Successfully parsed file <https://builds.apache.org/job/Atlas-0.8-IntegrationTests/ws/intg/target/findbugs.xml>
with 0 unique warnings and 0 duplicates.
[FINDBUGS] Successfully parsed file <https://builds.apache.org/job/Atlas-0.8-IntegrationTests/ws/notification/target/findbugs.xml>
with 0 unique warnings and 0 duplicates.
[FINDBUGS] Successfully parsed file <https://builds.apache.org/job/Atlas-0.8-IntegrationTests/ws/repository/target/findbugs.xml>
with 0 unique warnings and 0 duplicates.
[FINDBUGS] Successfully parsed file <https://builds.apache.org/job/Atlas-0.8-IntegrationTests/ws/server-api/target/findbugs.xml>
with 0 unique warnings and 0 duplicates.
[FINDBUGS] Successfully parsed file <https://builds.apache.org/job/Atlas-0.8-IntegrationTests/ws/typesystem/target/findbugs.xml>
with 0 unique warnings and 0 duplicates.
<Git Blamer> Using GitBlamer to create author and commit information for all warnings.
<Git Blamer> GIT_COMMIT=52923ffc10e40f2c5127651e8164306c8fab8133, workspace=<https://builds.apache.org/job/Atlas-0.8-IntegrationTests/ws/>
Archiving artifacts
[Fast Archiver] No prior successful build to compare, so performing full copy of artifacts
TestNG Reports Processing: START
Looking for TestNG results report in workspace using pattern: **/target/surefire-reports/testng-results.xml,**/target/failsafe-reports/testng-results.xml
Saving reports...
Processing '/x1/jenkins/jenkins-home/jobs/Atlas-0.8-IntegrationTests/builds/119/testng/testng-results.xml'
TestNG Reports Processing: FINISH

Mime
View raw message