atlas-dev mailing list archives

Site index · List index
Message view « Date » · « Thread »
Top « Date » · « Thread »
From Apache Jenkins Server <jenk...@builds.apache.org>
Subject Build failed in Jenkins: Atlas-0.8-IntegrationTests #118
Date Tue, 24 Oct 2017 11:29:53 GMT
See <https://builds.apache.org/job/Atlas-0.8-IntegrationTests/118/display/redirect?page=changes>

Changes:

[apoorvnaik] ATLAS-2218: Webapp UT and IT separation

[apoorvnaik] ATLAS-1805:Provide an Atlas hook to send Hbase Namespace/Table/column

------------------------------------------
[...truncated 528.88 KB...]
127.0.0.1 - - [24/Oct/2017:11:17:31 +0000] "GET /api/atlas/v2/types/typedef/name/hive_db_v2
HTTP/1.1" 404 - "-" "Java/1.8.0_144"
127.0.0.1 - - [24/Oct/2017:11:17:31 +0000] "GET /api/atlas/v2/types/typedef/name/hive_column_v2
HTTP/1.1" 404 - "-" "Java/1.8.0_144"
127.0.0.1 - - [24/Oct/2017:11:17:31 +0000] "GET /api/atlas/v2/types/typedef/name/hive_table_v2
HTTP/1.1" 404 - "-" "Java/1.8.0_144"
127.0.0.1 - - [24/Oct/2017:11:17:31 +0000] "GET /api/atlas/v2/types/typedef/name/hive_process_v2
HTTP/1.1" 404 - "-" "Java/1.8.0_144"
127.0.0.1 - - [24/Oct/2017:11:17:31 +0000] "GET /api/atlas/v2/types/typedef/name/classification
HTTP/1.1" 200 - "-" "Java/1.8.0_144"
127.0.0.1 - - [24/Oct/2017:11:17:31 +0000] "GET /api/atlas/v2/types/typedef/name/pii HTTP/1.1"
200 - "-" "Java/1.8.0_144"
127.0.0.1 - - [24/Oct/2017:11:17:31 +0000] "GET /api/atlas/v2/types/typedef/name/phi HTTP/1.1"
200 - "-" "Java/1.8.0_144"
127.0.0.1 - - [24/Oct/2017:11:17:31 +0000] "GET /api/atlas/v2/types/typedef/name/pci HTTP/1.1"
200 - "-" "Java/1.8.0_144"
127.0.0.1 - - [24/Oct/2017:11:17:31 +0000] "GET /api/atlas/v2/types/typedef/name/sox HTTP/1.1"
200 - "-" "Java/1.8.0_144"
127.0.0.1 - - [24/Oct/2017:11:17:31 +0000] "GET /api/atlas/v2/types/typedef/name/sec HTTP/1.1"
200 - "-" "Java/1.8.0_144"
127.0.0.1 - - [24/Oct/2017:11:17:31 +0000] "GET /api/atlas/v2/types/typedef/name/finance HTTP/1.1"
200 - "-" "Java/1.8.0_144"
127.0.0.1 - - [24/Oct/2017:11:17:31 +0000] "POST /api/atlas/v2/types/typedefs HTTP/1.1" 200
- "-" "Java/1.8.0_144"
127.0.0.1 - - [24/Oct/2017:11:17:31 +0000] "POST /api/atlas/v2/entity HTTP/1.1" 200 - "-"
"Java/1.8.0_144"
127.0.0.1 - - [24/Oct/2017:11:17:31 +0000] "POST /api/atlas/v2/entity HTTP/1.1" 200 - "-"
"Java/1.8.0_144"
127.0.0.1 - - [24/Oct/2017:11:17:31 +0000] "GET /api/atlas/v2/entity/guid/94adf616-f295-4049-9b0e-263f0527a116
HTTP/1.1" 200 - "-" "Java/1.8.0_144"
127.0.0.1 - - [24/Oct/2017:11:17:31 +0000] "POST /api/atlas/v2/entity HTTP/1.1" 200 - "-"
"Java/1.8.0_144"
127.0.0.1 - - [24/Oct/2017:11:17:32 +0000] "POST /api/atlas/v2/entity/guid/random/classifications
HTTP/1.1" 404 - "-" "Java/1.8.0_144"
127.0.0.1 - - [24/Oct/2017:11:17:32 +0000] "POST /api/atlas/v2/entity/bulk HTTP/1.1" 200 -
"-" "Java/1.8.0_144"
127.0.0.1 - - [24/Oct/2017:11:17:32 +0000] "POST /api/atlas/v2/entity HTTP/1.1" 200 - "-"
"Java/1.8.0_144"
127.0.0.1 - - [24/Oct/2017:11:17:32 +0000] "POST /api/atlas/v2/entity HTTP/1.1" 200 - "-"
"Java/1.8.0_144"
127.0.0.1 - - [24/Oct/2017:11:17:32 +0000] "DELETE /api/atlas/v2/entity/bulk?guid=1bfde0f3-aa19-48a3-80e2-a3763ba94b42&guid=4efd791a-6d04-4590-911c-58327195a922
HTTP/1.1" 200 - "-" "Java/1.8.0_144"
127.0.0.1 - - [24/Oct/2017:11:17:32 +0000] "POST /api/atlas/v2/entity HTTP/1.1" 200 - "-"
"Java/1.8.0_144"
127.0.0.1 - - [24/Oct/2017:11:17:32 +0000] "DELETE /api/atlas/v2/entity/uniqueAttribute/type/hive_db_v2?attr:name=dbmgJ7cf1vV7%E6%A9%93%EA%8E%B0%E5%9E%A6%EE%8E%A4%E1%8A%8A%E4%98%80%EB%96%84%E8%B9%B5%E7%AF%BA%ED%9A%BF
HTTP/1.1" 200 - "-" "Java/1.8.0_144"
127.0.0.1 - - [24/Oct/2017:11:17:32 +0000] "DELETE /api/atlas/v2/entity/guid/random/classification/blah_trait
HTTP/1.1" 400 - "-" "Java/1.8.0_144"
127.0.0.1 - - [24/Oct/2017:11:17:32 +0000] "GET /api/atlas/discovery/search/dsl?query=hive_db_v2+where+name%3D'dbmgJ7cf1vV7'&limit=10&offset=0
HTTP/1.1" 200 - "-" "Java/1.8.0_144"
127.0.0.1 - - [24/Oct/2017:11:17:33 +0000] "GET /api/atlas/discovery/search/dsl?query=hive_db_v2+where+name%3D'dbmgJ7cf1vV7'&limit=10&offset=0
HTTP/1.1" 200 - "-" "Java/1.8.0_144"
127.0.0.1 - - [24/Oct/2017:11:17:33 +0000] "POST /api/atlas/v2/entity HTTP/1.1" 200 - "-"
"Java/1.8.0_144"
127.0.0.1 - - [24/Oct/2017:11:17:33 +0000] "GET /api/atlas/discovery/search/dsl?query=hive_db_v2+where+name%3D'dbmgJ7cf1vV7'&limit=10&offset=0
HTTP/1.1" 200 - "-" "Java/1.8.0_144"
127.0.0.1 - - [24/Oct/2017:11:17:34 +0000] "POST /api/atlas/v2/types/typedefs HTTP/1.1" 200
- "-" "Java/1.8.0_144"
127.0.0.1 - - [24/Oct/2017:11:17:34 +0000] "POST /api/atlas/v2/entity HTTP/1.1" 200 - "-"
"Java/1.8.0_144"
127.0.0.1 - - [24/Oct/2017:11:17:34 +0000] "PUT /api/atlas/v2/types/typedefs HTTP/1.1" 200
- "-" "Java/1.8.0_144"
127.0.0.1 - - [24/Oct/2017:11:17:34 +0000] "GET /api/atlas/v2/entity/guid/e275bf05-ddeb-4462-9943-a21ff257d27a
HTTP/1.1" 200 - "-" "Java/1.8.0_144"
127.0.0.1 - - [24/Oct/2017:11:17:34 +0000] "POST /api/atlas/v2/entity HTTP/1.1" 404 - "-"
"Java/1.8.0_144"
127.0.0.1 - - [24/Oct/2017:11:17:34 +0000] "POST /api/atlas/v2/entity HTTP/1.1" 200 - "-"
"Java/1.8.0_144"
127.0.0.1 - - [24/Oct/2017:11:17:34 +0000] "POST /api/atlas/v2/entity HTTP/1.1" 200 - "-"
"Java/1.8.0_144"
127.0.0.1 - - [24/Oct/2017:11:17:34 +0000] "GET /api/atlas/v2/entity/uniqueAttribute/type/hive_db_v2?attr:name=dbmgJ7cf1vV7
HTTP/1.1" 200 - "-" "Java/1.8.0_144"
127.0.0.1 - - [24/Oct/2017:11:17:34 +0000] "GET /api/atlas/v2/entity/guid/blah HTTP/1.1" 404
- "-" "Java/1.8.0_144"
127.0.0.1 - - [24/Oct/2017:11:17:34 +0000] "POST /api/atlas/v2/entity HTTP/1.1" 200 - "-"
"Java/1.8.0_144"
127.0.0.1 - - [24/Oct/2017:11:17:34 +0000] "GET /api/atlas/entities/2f80b6f8-beca-4ab7-91ab-ba9b3a360374/audit?count=10
HTTP/1.1" 200 - "-" "Java/1.8.0_144"
127.0.0.1 - - [24/Oct/2017:11:17:34 +0000] "POST /api/atlas/v2/entity HTTP/1.1" 200 - "-"
"Java/1.8.0_144"
127.0.0.1 - - [24/Oct/2017:11:17:34 +0000] "POST /api/atlas/v2/entity HTTP/1.1" 200 - "-"
"Java/1.8.0_144"
127.0.0.1 - - [24/Oct/2017:11:17:35 +0000] "GET /api/atlas/v2/types/typedef/name/Bb7zN2wMwg
HTTP/1.1" 404 - "-" "Java/1.8.0_144"
127.0.0.1 - - [24/Oct/2017:11:17:35 +0000] "POST /api/atlas/v2/types/typedefs HTTP/1.1" 200
- "-" "Java/1.8.0_144"
127.0.0.1 - - [24/Oct/2017:11:17:35 +0000] "POST /api/atlas/v2/entity HTTP/1.1" 200 - "-"
"Java/1.8.0_144"
127.0.0.1 - - [24/Oct/2017:11:17:35 +0000] "GET /api/atlas/v2/entity/guid/ca279650-81f2-4291-88c5-d3ab4c8f6bcd
HTTP/1.1" 200 - "-" "Java/1.8.0_144"
127.0.0.1 - - [24/Oct/2017:11:17:35 +0000] "GET /api/atlas/v2/entity/guid/94adf616-f295-4049-9b0e-263f0527a116
HTTP/1.1" 200 - "-" "Java/1.8.0_144"
127.0.0.1 - - [24/Oct/2017:11:17:35 +0000] "POST /api/atlas/v2/entity HTTP/1.1" 200 - "-"
"Java/1.8.0_144"
127.0.0.1 - - [24/Oct/2017:11:17:35 +0000] "GET /api/atlas/v2/entity/guid/94adf616-f295-4049-9b0e-263f0527a116
HTTP/1.1" 200 - "-" "Java/1.8.0_144"
127.0.0.1 - - [24/Oct/2017:11:17:35 +0000] "GET /api/atlas/v2/entity/guid/94adf616-f295-4049-9b0e-263f0527a116
HTTP/1.1" 200 - "-" "Java/1.8.0_144"
127.0.0.1 - - [24/Oct/2017:11:17:35 +0000] "POST /api/atlas/v2/entity HTTP/1.1" 200 - "-"
"Java/1.8.0_144"
127.0.0.1 - - [24/Oct/2017:11:17:35 +0000] "GET /api/atlas/v2/entity/guid/94adf616-f295-4049-9b0e-263f0527a116
HTTP/1.1" 200 - "-" "Java/1.8.0_144"
127.0.0.1 - - [24/Oct/2017:11:17:35 +0000] "GET /api/atlas/v2/entity/guid/94adf616-f295-4049-9b0e-263f0527a116
HTTP/1.1" 200 - "-" "Java/1.8.0_144"
127.0.0.1 - - [24/Oct/2017:11:17:35 +0000] "POST /api/atlas/v2/entity HTTP/1.1" 200 - "-"
"Java/1.8.0_144"
127.0.0.1 - - [24/Oct/2017:11:17:35 +0000] "GET /api/atlas/v2/entity/guid/94adf616-f295-4049-9b0e-263f0527a116
HTTP/1.1" 200 - "-" "Java/1.8.0_144"
127.0.0.1 - - [24/Oct/2017:11:17:35 +0000] "GET /api/atlas/v2/types/typedef/name/PII_TraitIsIogL1k8a
HTTP/1.1" 404 - "-" "Java/1.8.0_144"
127.0.0.1 - - [24/Oct/2017:11:17:35 +0000] "POST /api/atlas/v2/types/typedefs HTTP/1.1" 200
- "-" "Java/1.8.0_144"
127.0.0.1 - - [24/Oct/2017:11:17:35 +0000] "DELETE /api/atlas/v2/entity/guid/94adf616-f295-4049-9b0e-263f0527a116/classification/PII_TraitIsIogL1k8a
HTTP/1.1" 404 - "-" "Java/1.8.0_144"
127.0.0.1 - - [24/Oct/2017:11:17:35 +0000] "GET /api/atlas/v2/types/typedef/name/PII_TraitqboKVQQnxU
HTTP/1.1" 404 - "-" "Java/1.8.0_144"
127.0.0.1 - - [24/Oct/2017:11:17:35 +0000] "POST /api/atlas/v2/types/typedefs HTTP/1.1" 200
- "-" "Java/1.8.0_144"
127.0.0.1 - - [24/Oct/2017:11:17:35 +0000] "GET /api/atlas/v2/types/classificationdef/name/PII_TraitqboKVQQnxU
HTTP/1.1" 200 - "-" "Java/1.8.0_144"
127.0.0.1 - - [24/Oct/2017:11:17:35 +0000] "POST /api/atlas/v2/entity/guid/94adf616-f295-4049-9b0e-263f0527a116/classifications
HTTP/1.1" 204 - "-" "Java/1.8.0_144"
127.0.0.1 - - [24/Oct/2017:11:17:35 +0000] "GET /api/atlas/v2/entity/guid/94adf616-f295-4049-9b0e-263f0527a116/classifications
HTTP/1.1" 200 - "-" "Java/1.8.0_144"
127.0.0.1 - - [24/Oct/2017:11:17:35 +0000] "GET /api/atlas/v2/entity/guid/94adf616-f295-4049-9b0e-263f0527a116/classifications
HTTP/1.1" 200 - "-" "Java/1.8.0_144"
127.0.0.1 - - [24/Oct/2017:11:17:35 +0000] "POST /api/atlas/v2/entity HTTP/1.1" 200 - "-"
"Java/1.8.0_144"
127.0.0.1 - - [24/Oct/2017:11:17:35 +0000] "GET /api/atlas/v2/entity/guid/94adf616-f295-4049-9b0e-263f0527a116
HTTP/1.1" 200 - "-" "Java/1.8.0_144"
127.0.0.1 - - [24/Oct/2017:11:17:35 +0000] "PUT /api/atlas/v2/entity/uniqueAttribute/type/hive_table_v2?attr:qualifiedName=tablehyHMcEUPSX
HTTP/1.1" 200 - "-" "Java/1.8.0_144"
127.0.0.1 - - [24/Oct/2017:11:17:35 +0000] "GET /api/atlas/v2/entity/guid/94adf616-f295-4049-9b0e-263f0527a116
HTTP/1.1" 200 - "-" "Java/1.8.0_144"
127.0.0.1 - - [24/Oct/2017:11:17:35 +0000] "GET /api/atlas/v2/types/typedef/name/PII_Traitmvt7T0uo9v
HTTP/1.1" 404 - "-" "Java/1.8.0_144"
127.0.0.1 - - [24/Oct/2017:11:17:35 +0000] "POST /api/atlas/v2/types/typedefs HTTP/1.1" 200
- "-" "Java/1.8.0_144"
127.0.0.1 - - [24/Oct/2017:11:17:35 +0000] "POST /api/atlas/v2/entity/guid/94adf616-f295-4049-9b0e-263f0527a116/classifications
HTTP/1.1" 204 - "-" "Java/1.8.0_144"
127.0.0.1 - - [24/Oct/2017:11:17:35 +0000] "GET /api/atlas/entities/94adf616-f295-4049-9b0e-263f0527a116/audit?count=100
HTTP/1.1" 200 - "-" "Java/1.8.0_144"
127.0.0.1 - - [24/Oct/2017:11:17:35 +0000] "GET /api/atlas/v2/types/typedef/name/PII_TraitdZJP9KDgAR
HTTP/1.1" 404 - "-" "Java/1.8.0_144"
127.0.0.1 - - [24/Oct/2017:11:17:35 +0000] "POST /api/atlas/v2/types/typedefs HTTP/1.1" 200
- "-" "Java/1.8.0_144"
127.0.0.1 - - [24/Oct/2017:11:17:35 +0000] "POST /api/atlas/v2/entity/guid/94adf616-f295-4049-9b0e-263f0527a116/classifications
HTTP/1.1" 204 - "-" "Java/1.8.0_144"
127.0.0.1 - - [24/Oct/2017:11:17:36 +0000] "GET /api/atlas/v2/entity/guid/94adf616-f295-4049-9b0e-263f0527a116
HTTP/1.1" 200 - "-" "Java/1.8.0_144"
127.0.0.1 - - [24/Oct/2017:11:17:36 +0000] "DELETE /api/atlas/v2/entity/guid/94adf616-f295-4049-9b0e-263f0527a116/classification/PII_Traitmvt7T0uo9v
HTTP/1.1" 204 - "-" "Java/1.8.0_144"
127.0.0.1 - - [24/Oct/2017:11:17:36 +0000] "GET /api/atlas/entities/94adf616-f295-4049-9b0e-263f0527a116/audit?count=100
HTTP/1.1" 200 - "-" "Java/1.8.0_144"
Tests run: 137, Failures: 2, Errors: 0, Skipped: 5, Time elapsed: 118.21 sec <<<
FAILURE! - in TestSuite
runQuickStart(org.apache.atlas.examples.QuickStartV2IT)  Time elapsed: 0.704 sec  <<<
FAILURE!
org.apache.atlas.AtlasServiceException: Metadata service API org.apache.atlas.AtlasClientV2$API_V2@1eac1f5
failed with status 409 (Conflict) Response Body ({"errorCode":"ATLAS-409-00-001","errorMessage":"Given
type Dimension already exists"})
	at org.apache.atlas.AtlasBaseClient.callAPIWithResource(AtlasBaseClient.java:387)
	at org.apache.atlas.AtlasBaseClient.callAPIWithResource(AtlasBaseClient.java:320)
	at org.apache.atlas.AtlasBaseClient.callAPI(AtlasBaseClient.java:208)
	at org.apache.atlas.AtlasClientV2.createAtlasTypeDefs(AtlasClientV2.java:219)
	at org.apache.atlas.examples.QuickStartV2.createTypes(QuickStartV2.java:191)
	at org.apache.atlas.examples.QuickStartV2.runQuickstart(QuickStartV2.java:147)
	at org.apache.atlas.examples.QuickStartV2IT.runQuickStart(QuickStartV2IT.java:49)

testDiscoveryWithSearchParameters(org.apache.atlas.web.integration.BasicSearchIT)  Time elapsed:
0.295 sec  <<< FAILURE!
java.lang.AssertionError: expected [3] but found [21]
	at org.testng.Assert.fail(Assert.java:94)
	at org.testng.Assert.failNotEquals(Assert.java:496)
	at org.testng.Assert.assertEquals(Assert.java:125)
	at org.testng.Assert.assertEquals(Assert.java:372)
	at org.testng.Assert.assertEquals(Assert.java:382)
	at org.apache.atlas.web.integration.BasicSearchIT.testDiscoveryWithSearchParameters(BasicSearchIT.java:127)


Results :

Failed tests: 
  QuickStartV2IT.runQuickStart:49 » AtlasService Metadata service API org.apache...
org.apache.atlas.web.integration.BasicSearchIT.testDiscoveryWithSearchParameters(org.apache.atlas.web.integration.BasicSearchIT)
  Run 1: BasicSearchIT.testDiscoveryWithSearchParameters:127 expected [3] but found [21]
  Run 2: PASS
  Run 3: PASS


Tests run: 135, Failures: 2, Errors: 0, Skipped: 5

[INFO] 
[INFO] --- jetty-maven-plugin:9.2.12.v20150709:stop (stop-jetty) @ atlas-webapp ---
[INFO] Waiting 10 seconds for jetty to stop
[INFO] Stopped ServerConnector@73fbb689{HTTP/1.1}{0.0.0.0:31000}
[INFO] Closing Spring root WebApplicationContext
[INFO] Shutting down log4j
[INFO] Not cleaning cached beans: no such field javax.el.BeanELResolver.properties
[INFO] Stopped o.e.j.m.p.JettyWebAppContext@57a646f9{/,<https://builds.apache.org/job/Atlas-0.8-IntegrationTests/ws/webapp/target/atlas-webapp-0.8.2-SNAPSHOT/,UNAVAILABLE}{/home/jenkins/jenkins-slave/workspace/Atlas-0.8-IntegrationTests/webapp/target/atlas-webapp-0.8.2-SNAPSHOT.war}>
[INFO] Server reports itself as stopped
[INFO] 
[INFO] --- maven-source-plugin:2.4:jar-no-fork (attach-sources) @ atlas-webapp ---
[INFO] Building jar: <https://builds.apache.org/job/Atlas-0.8-IntegrationTests/ws/webapp/target/atlas-webapp-0.8.2-SNAPSHOT-sources.jar>
[INFO] 
[INFO] --- maven-source-plugin:2.4:test-jar-no-fork (attach-sources) @ atlas-webapp ---
[INFO] Building jar: <https://builds.apache.org/job/Atlas-0.8-IntegrationTests/ws/webapp/target/atlas-webapp-0.8.2-SNAPSHOT-test-sources.jar>
[INFO] 
[INFO] --- maven-failsafe-plugin:2.18.1:verify (verify) @ atlas-webapp ---
[INFO] Failsafe report directory: <https://builds.apache.org/job/Atlas-0.8-IntegrationTests/ws/webapp/target/failsafe-reports>
[INFO] ------------------------------------------------------------------------
[INFO] Reactor Summary:
[INFO] 
[INFO] Apache Atlas Server Build Tools .................... SUCCESS [  1.056 s]
[INFO] apache-atlas ....................................... SUCCESS [  5.193 s]
[INFO] Apache Atlas Integration ........................... SUCCESS [ 20.565 s]
[INFO] Apache Atlas Common ................................ SUCCESS [  9.077 s]
[INFO] Apache Atlas Typesystem ............................ SUCCESS [ 51.412 s]
[INFO] Apache Atlas Client ................................ SUCCESS [  0.834 s]
[INFO] atlas-client-common ................................ SUCCESS [  8.541 s]
[INFO] atlas-client-v1 .................................... SUCCESS [  7.819 s]
[INFO] Apache Atlas Server API ............................ SUCCESS [  6.697 s]
[INFO] Apache Atlas Notification .......................... SUCCESS [ 10.785 s]
[INFO] atlas-client-v2 .................................... SUCCESS [  6.274 s]
[INFO] Apache Atlas Graph Database Projects ............... SUCCESS [  0.587 s]
[INFO] Apache Atlas Graph Database API .................... SUCCESS [  5.767 s]
[INFO] Graph Database Common Code ......................... SUCCESS [  6.964 s]
[INFO] Apache Atlas Titan 1.0.0 GraphDB Impl .............. SUCCESS [ 39.866 s]
[INFO] Shaded version of Apache hbase client .............. SUCCESS [  8.445 s]
[INFO] Apache Atlas Titan 0.5.4 Graph DB Impl ............. SUCCESS [ 38.544 s]
[INFO] Apache Atlas Graph Database Implementation Dependencies SUCCESS [  0.668 s]
[INFO] Shaded version of Apache hbase server .............. SUCCESS [ 22.856 s]
[INFO] Apache Atlas Repository ............................ SUCCESS [01:30 min]
[INFO] Apache Atlas Authorization ......................... SUCCESS [  7.939 s]
[INFO] Apache Atlas Business Catalog ...................... SUCCESS [ 11.260 s]
[INFO] Apache Atlas UI .................................... SUCCESS [01:26 min]
[INFO] Apache Atlas Web Application ....................... FAILURE [03:32 min]
[INFO] Apache Atlas Documentation ......................... SKIPPED
[INFO] Apache Atlas FileSystem Model ...................... SKIPPED
[INFO] Apache Atlas Plugin Classloader .................... SKIPPED
[INFO] Apache Atlas Hive Bridge Shim ...................... SKIPPED
[INFO] Apache Atlas Hive Bridge ........................... SKIPPED
[INFO] Apache Atlas Falcon Bridge Shim .................... SKIPPED
[INFO] Apache Atlas Falcon Bridge ......................... SKIPPED
[INFO] Apache Atlas Sqoop Bridge Shim ..................... SKIPPED
[INFO] Apache Atlas Sqoop Bridge .......................... SKIPPED
[INFO] Apache Atlas Storm Bridge Shim ..................... SKIPPED
[INFO] Apache Atlas Storm Bridge .......................... SKIPPED
[INFO] Apache Atlas Hbase Bridge Shim ..................... SKIPPED
[INFO] Apache Atlas Hbase Bridge .......................... SKIPPED
[INFO] Apache Atlas Distribution .......................... SKIPPED
[INFO] ------------------------------------------------------------------------
[INFO] BUILD FAILURE
[INFO] ------------------------------------------------------------------------
[INFO] Total time: 11:02 min
[INFO] Finished at: 2017-10-24T11:17:39Z
[INFO] Final Memory: 368M/2748M
[INFO] ------------------------------------------------------------------------
log4j:WARN No appenders could be found for logger (org.apache.zookeeper.ClientCnxn).
log4j:WARN Please initialize the log4j system properly.
log4j:WARN See http://logging.apache.org/log4j/1.2/faq.html#noconfig for more info.
[ERROR] Failed to execute goal org.apache.maven.plugins:maven-failsafe-plugin:2.18.1:verify
(verify) on project atlas-webapp: There are test failures.
[ERROR] 
[ERROR] Please refer to <https://builds.apache.org/job/Atlas-0.8-IntegrationTests/ws/webapp/target/failsafe-reports>
for the individual test results.
[ERROR] -> [Help 1]
[ERROR] 
[ERROR] To see the full stack trace of the errors, re-run Maven with the -e switch.
[ERROR] Re-run Maven using the -X switch to enable full debug logging.
[ERROR] 
[ERROR] For more information about the errors and possible solutions, please read the following
articles:
[ERROR] [Help 1] http://cwiki.apache.org/confluence/display/MAVEN/MojoFailureException
[ERROR] 
[ERROR] After correcting the problems, you can resume the build with the command
[ERROR]   mvn <goals> -rf :atlas-webapp
Build step 'Execute shell' marked build as failure
[CHECKSTYLE] Collecting checkstyle analysis files...
[CHECKSTYLE] Searching for all files in <https://builds.apache.org/job/Atlas-0.8-IntegrationTests/ws/>
that match the pattern **/target/checkstyle-result.xml
[CHECKSTYLE] Parsing 22 files in <https://builds.apache.org/job/Atlas-0.8-IntegrationTests/ws/>
[CHECKSTYLE] Successfully parsed file <https://builds.apache.org/job/Atlas-0.8-IntegrationTests/ws/authorization/target/checkstyle-result.xml>
with 467 unique warnings and 0 duplicates.
[CHECKSTYLE] Successfully parsed file <https://builds.apache.org/job/Atlas-0.8-IntegrationTests/ws/catalog/target/checkstyle-result.xml>
with 2604 unique warnings and 0 duplicates.
[CHECKSTYLE] Successfully parsed file <https://builds.apache.org/job/Atlas-0.8-IntegrationTests/ws/client/client-v1/target/checkstyle-result.xml>
with 3480 unique warnings and 0 duplicates.
[CHECKSTYLE] Successfully parsed file <https://builds.apache.org/job/Atlas-0.8-IntegrationTests/ws/client/client-v2/target/checkstyle-result.xml>
with 3805 unique warnings and 0 duplicates.
[CHECKSTYLE] Successfully parsed file <https://builds.apache.org/job/Atlas-0.8-IntegrationTests/ws/client/common/target/checkstyle-result.xml>
with 4295 unique warnings and 0 duplicates.
[CHECKSTYLE] Successfully parsed file <https://builds.apache.org/job/Atlas-0.8-IntegrationTests/ws/client/target/checkstyle-result.xml>
with 4295 unique warnings and 0 duplicates.
[CHECKSTYLE] Successfully parsed file <https://builds.apache.org/job/Atlas-0.8-IntegrationTests/ws/common/target/checkstyle-result.xml>
with 5254 unique warnings and 0 duplicates.
[CHECKSTYLE] Successfully parsed file <https://builds.apache.org/job/Atlas-0.8-IntegrationTests/ws/dashboardv2/target/checkstyle-result.xml>
with 5254 unique warnings and 0 duplicates.
[CHECKSTYLE] Successfully parsed file <https://builds.apache.org/job/Atlas-0.8-IntegrationTests/ws/graphdb/api/target/checkstyle-result.xml>
with 5527 unique warnings and 0 duplicates.
[CHECKSTYLE] Successfully parsed file <https://builds.apache.org/job/Atlas-0.8-IntegrationTests/ws/graphdb/common/target/checkstyle-result.xml>
with 5714 unique warnings and 0 duplicates.
[CHECKSTYLE] Successfully parsed file <https://builds.apache.org/job/Atlas-0.8-IntegrationTests/ws/graphdb/graphdb-impls/target/checkstyle-result.xml>
with 5714 unique warnings and 0 duplicates.
[CHECKSTYLE] Successfully parsed file <https://builds.apache.org/job/Atlas-0.8-IntegrationTests/ws/graphdb/target/checkstyle-result.xml>
with 5714 unique warnings and 0 duplicates.
[CHECKSTYLE] Successfully parsed file <https://builds.apache.org/job/Atlas-0.8-IntegrationTests/ws/graphdb/titan0/target/checkstyle-result.xml>
with 8169 unique warnings and 0 duplicates.
[CHECKSTYLE] Successfully parsed file <https://builds.apache.org/job/Atlas-0.8-IntegrationTests/ws/graphdb/titan1/target/checkstyle-result.xml>
with 9136 unique warnings and 0 duplicates.
[CHECKSTYLE] Successfully parsed file <https://builds.apache.org/job/Atlas-0.8-IntegrationTests/ws/intg/target/checkstyle-result.xml>
with 15850 unique warnings and 0 duplicates.
[CHECKSTYLE] Successfully parsed file <https://builds.apache.org/job/Atlas-0.8-IntegrationTests/ws/notification/target/checkstyle-result.xml>
with 17415 unique warnings and 0 duplicates.
[CHECKSTYLE] Successfully parsed file <https://builds.apache.org/job/Atlas-0.8-IntegrationTests/ws/repository/target/checkstyle-result.xml>
with 36354 unique warnings and 0 duplicates.
[CHECKSTYLE] Successfully parsed file <https://builds.apache.org/job/Atlas-0.8-IntegrationTests/ws/server-api/target/checkstyle-result.xml>
with 36747 unique warnings and 0 duplicates.
[CHECKSTYLE] Successfully parsed file <https://builds.apache.org/job/Atlas-0.8-IntegrationTests/ws/shaded/hbase-client-shaded/target/checkstyle-result.xml>
with 36747 unique warnings and 0 duplicates.
[CHECKSTYLE] Successfully parsed file <https://builds.apache.org/job/Atlas-0.8-IntegrationTests/ws/shaded/hbase-server-shaded/target/checkstyle-result.xml>
with 36747 unique warnings and 0 duplicates.
[CHECKSTYLE] Successfully parsed file <https://builds.apache.org/job/Atlas-0.8-IntegrationTests/ws/target/checkstyle-result.xml>
with 36747 unique warnings and 0 duplicates.
[CHECKSTYLE] Successfully parsed file <https://builds.apache.org/job/Atlas-0.8-IntegrationTests/ws/typesystem/target/checkstyle-result.xml>
with 40965 unique warnings and 0 duplicates.
<Git Blamer> Using GitBlamer to create author and commit information for all warnings.
<Git Blamer> GIT_COMMIT=183e92394a1fd64a69290d79dd85b372330d5f9a, workspace=<https://builds.apache.org/job/Atlas-0.8-IntegrationTests/ws/>
 > git rev-parse 183e92394a1fd64a69290d79dd85b372330d5f9a^{commit} # timeout=10
[FINDBUGS] Collecting findbugs analysis files...
[FINDBUGS] Searching for all files in <https://builds.apache.org/job/Atlas-0.8-IntegrationTests/ws/>
that match the pattern **/target/findbugs.xml
[FINDBUGS] Parsing 15 files in <https://builds.apache.org/job/Atlas-0.8-IntegrationTests/ws/>
[FINDBUGS] Successfully parsed file <https://builds.apache.org/job/Atlas-0.8-IntegrationTests/ws/authorization/target/findbugs.xml>
with 0 unique warnings and 0 duplicates.
[FINDBUGS] Successfully parsed file <https://builds.apache.org/job/Atlas-0.8-IntegrationTests/ws/catalog/target/findbugs.xml>
with 0 unique warnings and 0 duplicates.
[FINDBUGS] Successfully parsed file <https://builds.apache.org/job/Atlas-0.8-IntegrationTests/ws/client/client-v1/target/findbugs.xml>
with 0 unique warnings and 0 duplicates.
[FINDBUGS] Successfully parsed file <https://builds.apache.org/job/Atlas-0.8-IntegrationTests/ws/client/client-v2/target/findbugs.xml>
with 0 unique warnings and 0 duplicates.
[FINDBUGS] Successfully parsed file <https://builds.apache.org/job/Atlas-0.8-IntegrationTests/ws/client/common/target/findbugs.xml>
with 0 unique warnings and 0 duplicates.
[FINDBUGS] Successfully parsed file <https://builds.apache.org/job/Atlas-0.8-IntegrationTests/ws/common/target/findbugs.xml>
with 0 unique warnings and 0 duplicates.
[FINDBUGS] Successfully parsed file <https://builds.apache.org/job/Atlas-0.8-IntegrationTests/ws/graphdb/api/target/findbugs.xml>
with 0 unique warnings and 0 duplicates.
[FINDBUGS] Successfully parsed file <https://builds.apache.org/job/Atlas-0.8-IntegrationTests/ws/graphdb/common/target/findbugs.xml>
with 0 unique warnings and 0 duplicates.
[FINDBUGS] Successfully parsed file <https://builds.apache.org/job/Atlas-0.8-IntegrationTests/ws/graphdb/titan0/target/findbugs.xml>
with 0 unique warnings and 0 duplicates.
[FINDBUGS] Successfully parsed file <https://builds.apache.org/job/Atlas-0.8-IntegrationTests/ws/graphdb/titan1/target/findbugs.xml>
with 0 unique warnings and 0 duplicates.
[FINDBUGS] Successfully parsed file <https://builds.apache.org/job/Atlas-0.8-IntegrationTests/ws/intg/target/findbugs.xml>
with 0 unique warnings and 0 duplicates.
[FINDBUGS] Successfully parsed file <https://builds.apache.org/job/Atlas-0.8-IntegrationTests/ws/notification/target/findbugs.xml>
with 0 unique warnings and 0 duplicates.
[FINDBUGS] Successfully parsed file <https://builds.apache.org/job/Atlas-0.8-IntegrationTests/ws/repository/target/findbugs.xml>
with 0 unique warnings and 0 duplicates.
[FINDBUGS] Successfully parsed file <https://builds.apache.org/job/Atlas-0.8-IntegrationTests/ws/server-api/target/findbugs.xml>
with 0 unique warnings and 0 duplicates.
[FINDBUGS] Successfully parsed file <https://builds.apache.org/job/Atlas-0.8-IntegrationTests/ws/typesystem/target/findbugs.xml>
with 0 unique warnings and 0 duplicates.
<Git Blamer> Using GitBlamer to create author and commit information for all warnings.
<Git Blamer> GIT_COMMIT=183e92394a1fd64a69290d79dd85b372330d5f9a, workspace=<https://builds.apache.org/job/Atlas-0.8-IntegrationTests/ws/>
Archiving artifacts
[Fast Archiver] No prior successful build to compare, so performing full copy of artifacts
TestNG Reports Processing: START
Looking for TestNG results report in workspace using pattern: **/target/surefire-reports/testng-results.xml,**/target/failsafe-reports/testng-results.xml
Saving reports...
Processing '/x1/jenkins/jenkins-home/jobs/Atlas-0.8-IntegrationTests/builds/118/testng/testng-results.xml'
0.735294% of tests failed, which exceeded threshold of 0%. Marking build as UNSTABLE
TestNG Reports Processing: FINISH

Mime
View raw message