atlas-dev mailing list archives

Site index · List index
Message view « Date » · « Thread »
Top « Date » · « Thread »
From Apache Jenkins Server <jenk...@builds.apache.org>
Subject Build failed in Jenkins: Atlas-0.8-IntegrationTests #105
Date Wed, 11 Oct 2017 00:59:56 GMT
See <https://builds.apache.org/job/Atlas-0.8-IntegrationTests/105/display/redirect?page=changes>

Changes:

[madhan] ATLAS-2198: fix for Hive Hook OOM for large notification messages

------------------------------------------
[...truncated 467.74 KB...]
Caused by: com.sun.jersey.api.client.ClientHandlerException: java.net.ConnectException: Connection
refused (Connection refused)
Caused by: java.net.ConnectException: Connection refused (Connection refused)

setUp(org.apache.atlas.web.integration.DataSetLineageJerseyResourceIT)  Time elapsed: 0.18
sec  <<< FAILURE!
com.sun.jersey.api.client.ClientHandlerException: java.net.ConnectException: Connection refused
(Connection refused)
	at org.apache.atlas.web.integration.DataSetLineageJerseyResourceIT.setUp(DataSetLineageJerseyResourceIT.java:56)
Caused by: java.net.ConnectException: Connection refused (Connection refused)
	at org.apache.atlas.web.integration.DataSetLineageJerseyResourceIT.setUp(DataSetLineageJerseyResourceIT.java:56)

setUp(org.apache.atlas.web.integration.EntityJerseyResourceIT)  Time elapsed: 0.182 sec  <<<
FAILURE!
com.sun.jersey.api.client.ClientHandlerException: java.net.ConnectException: Connection refused
(Connection refused)
	at org.apache.atlas.web.integration.EntityJerseyResourceIT.setUp(EntityJerseyResourceIT.java:87)
Caused by: java.net.ConnectException: Connection refused (Connection refused)
	at org.apache.atlas.web.integration.EntityJerseyResourceIT.setUp(EntityJerseyResourceIT.java:87)

testDuplicateCreate(org.apache.atlas.web.integration.TypedefsJerseyResourceIT)  Time elapsed:
0.008 sec  <<< FAILURE!
com.sun.jersey.api.client.ClientHandlerException: java.net.ConnectException: Connection refused
(Connection refused)
	at org.apache.atlas.web.integration.TypedefsJerseyResourceIT.testDuplicateCreate(TypedefsJerseyResourceIT.java:112)
Caused by: java.net.ConnectException: Connection refused (Connection refused)
	at org.apache.atlas.web.integration.TypedefsJerseyResourceIT.testDuplicateCreate(TypedefsJerseyResourceIT.java:112)

testInvalidGets(org.apache.atlas.web.integration.TypedefsJerseyResourceIT)  Time elapsed:
0.001 sec  <<< FAILURE!
com.sun.jersey.api.client.ClientHandlerException: java.net.ConnectException: Connection refused
(Connection refused)
	at org.apache.atlas.web.integration.TypedefsJerseyResourceIT.testInvalidGets(TypedefsJerseyResourceIT.java:197)
Caused by: java.net.ConnectException: Connection refused (Connection refused)
	at org.apache.atlas.web.integration.TypedefsJerseyResourceIT.testInvalidGets(TypedefsJerseyResourceIT.java:197)

testListTypesByFilter(org.apache.atlas.web.integration.TypedefsJerseyResourceIT)  Time elapsed:
0.006 sec  <<< FAILURE!
com.sun.jersey.api.client.ClientHandlerException: java.net.ConnectException: Connection refused
(Connection refused)
	at org.apache.atlas.web.integration.TypedefsJerseyResourceIT.testListTypesByFilter(TypedefsJerseyResourceIT.java:277)
Caused by: java.net.ConnectException: Connection refused (Connection refused)
	at org.apache.atlas.web.integration.TypedefsJerseyResourceIT.testListTypesByFilter(TypedefsJerseyResourceIT.java:277)

testUpdate(org.apache.atlas.web.integration.TypedefsJerseyResourceIT)  Time elapsed: 0.001
sec  <<< FAILURE!
com.sun.jersey.api.client.ClientHandlerException: java.net.ConnectException: Connection refused
(Connection refused)
	at org.apache.atlas.web.integration.TypedefsJerseyResourceIT.testUpdate(TypedefsJerseyResourceIT.java:133)
Caused by: java.net.ConnectException: Connection refused (Connection refused)
	at org.apache.atlas.web.integration.TypedefsJerseyResourceIT.testUpdate(TypedefsJerseyResourceIT.java:133)

testDuplicateSubmit(org.apache.atlas.web.integration.TypesJerseyResourceIT)  Time elapsed:
0.003 sec  <<< FAILURE!
com.sun.jersey.api.client.ClientHandlerException: java.net.ConnectException: Connection refused
(Connection refused)
	at org.apache.atlas.web.integration.TypesJerseyResourceIT.testDuplicateSubmit(TypesJerseyResourceIT.java:102)
Caused by: java.net.ConnectException: Connection refused (Connection refused)
	at org.apache.atlas.web.integration.TypesJerseyResourceIT.testDuplicateSubmit(TypesJerseyResourceIT.java:102)

testGetDefinitionForNonexistentType(org.apache.atlas.web.integration.TypesJerseyResourceIT)
 Time elapsed: 0.001 sec  <<< FAILURE!
org.testng.TestException: 

Expected exception org.apache.atlas.AtlasServiceException but got com.sun.jersey.api.client.ClientHandlerException:
java.net.ConnectException: Connection refused (Connection refused)
	at org.apache.atlas.web.integration.TypesJerseyResourceIT.testGetDefinitionForNonexistentType(TypesJerseyResourceIT.java:167)
Caused by: java.net.ConnectException: Connection refused (Connection refused)
	at org.apache.atlas.web.integration.TypesJerseyResourceIT.testGetDefinitionForNonexistentType(TypesJerseyResourceIT.java:167)

testGetTraitNames(org.apache.atlas.web.integration.TypesJerseyResourceIT)  Time elapsed: 0.042
sec  <<< FAILURE!
com.sun.jersey.api.client.ClientHandlerException: java.net.ConnectException: Connection refused
(Connection refused)
	at org.apache.atlas.web.integration.TypesJerseyResourceIT.addTraits(TypesJerseyResourceIT.java:226)
	at org.apache.atlas.web.integration.TypesJerseyResourceIT.testGetTraitNames(TypesJerseyResourceIT.java:188)
Caused by: java.net.ConnectException: Connection refused (Connection refused)
	at org.apache.atlas.web.integration.TypesJerseyResourceIT.addTraits(TypesJerseyResourceIT.java:226)
	at org.apache.atlas.web.integration.TypesJerseyResourceIT.testGetTraitNames(TypesJerseyResourceIT.java:188)

testListTypesByFilter(org.apache.atlas.web.integration.TypesJerseyResourceIT)  Time elapsed:
0.017 sec  <<< FAILURE!
com.sun.jersey.api.client.ClientHandlerException: java.net.ConnectException: Connection refused
(Connection refused)
	at org.apache.atlas.web.integration.TypesJerseyResourceIT.testListTypesByFilter(TypesJerseyResourceIT.java:206)
Caused by: java.net.ConnectException: Connection refused (Connection refused)
	at org.apache.atlas.web.integration.TypesJerseyResourceIT.testListTypesByFilter(TypesJerseyResourceIT.java:206)

testUpdate(org.apache.atlas.web.integration.TypesJerseyResourceIT)  Time elapsed: 0.002 sec
 <<< FAILURE!
com.sun.jersey.api.client.ClientHandlerException: java.net.ConnectException: Connection refused
(Connection refused)
	at org.apache.atlas.web.integration.TypesJerseyResourceIT.testUpdate(TypesJerseyResourceIT.java:117)
Caused by: java.net.ConnectException: Connection refused (Connection refused)
	at org.apache.atlas.web.integration.TypesJerseyResourceIT.testUpdate(TypesJerseyResourceIT.java:117)


Results :

Failed tests: 
  QuickStartIT.runQuickStart:44 » ClientHandler java.net.ConnectException: Conne...
  QuickStartV2IT.runQuickStart:49 » ClientHandler java.net.ConnectException: Con...
  NotificationHookConsumerIT.setUp:55->BaseResourceIT.createTypeDefinitionsV1:357->BaseResourceIT.createType:172
» ClientHandler
  AdminJerseyResourceIT.testGetVersion:40 » ClientHandler java.net.ConnectExcept...
  DataSetLineageJerseyResourceIT.setUp:56->BaseResourceIT.createTypeDefinitionsV1:357->BaseResourceIT.createType:172
» ClientHandler
  EntityDiscoveryJerseyResourceIT.setUp:58->createTypes:209->BaseResourceIT.createType:186
» ClientHandler
  EntityJerseyResourceIT.setUp:87->BaseResourceIT.createTypeDefinitionsV1:357->BaseResourceIT.createType:172
» ClientHandler
  EntityLineageJerseyResourceIT.setUp:60->DataSetLineageJerseyResourceIT.setUp:56->BaseResourceIT.createTypeDefinitionsV1:357->BaseResourceIT.createType:172
» ClientHandler
  EntityLineageJerseyResourceIT>DataSetLineageJerseyResourceIT.testInputsGraph:62 »
IllegalArgument
  EntityLineageJerseyResourceIT>DataSetLineageJerseyResourceIT.testInputsGraphForEntity:81
» IllegalArgument
  EntityLineageJerseyResourceIT>DataSetLineageJerseyResourceIT.testOutputsGraph:98 »
IllegalArgument
  EntityLineageJerseyResourceIT>DataSetLineageJerseyResourceIT.testOutputsGraphForEntity:117
» IllegalArgument
  EntityLineageJerseyResourceIT>DataSetLineageJerseyResourceIT.testSchema:134 » IllegalArgument
  EntityLineageJerseyResourceIT.testSchemaForDB » Test 
Expected exception org.a...
  EntityLineageJerseyResourceIT>DataSetLineageJerseyResourceIT.testSchemaForEntity:158
» IllegalArgument
  EntityLineageJerseyResourceIT.testSchemaForInvalidTable » Test 
Expected excep...
  EntityV2JerseyResourceIT.setUp:80->BaseResourceIT.createTypeDefinitionsV2:454->BaseResourceIT.batchCreateTypes:126
» ClientHandler
  MetadataDiscoveryJerseyResourceIT.setUp:63->createTypes:237->BaseResourceIT.createTypeDefinitionsV1:357->BaseResourceIT.createType:172
» ClientHandler
  TypedefsJerseyResourceIT.testCreate:84->BaseResourceIT.createType:162->BaseResourceIT.batchCreateTypes:142
» ClientHandler
  TypedefsJerseyResourceIT.testDuplicateCreate:112 » ClientHandler java.net.Conn...
  TypedefsJerseyResourceIT.testInvalidGets:197 » ClientHandler java.net.ConnectE...
  TypedefsJerseyResourceIT.testListTypesByFilter:277 » ClientHandler java.net.Co...
  TypedefsJerseyResourceIT.testUpdate:133 » ClientHandler java.net.ConnectExcept...
  TypesJerseyResourceIT.testDuplicateSubmit:102 » ClientHandler java.net.Connect...
  TypesJerseyResourceIT.testGetDefinitionForNonexistentType » Test 
Expected exc...
  TypesJerseyResourceIT.testGetTraitNames:188->addTraits:226->BaseResourceIT.createType:208->BaseResourceIT.createType:186
» ClientHandler
  TypesJerseyResourceIT.testListTypesByFilter:206->BaseResourceIT.createType:208->BaseResourceIT.createType:193
» ClientHandler
  TypesJerseyResourceIT.testSubmit:79 » ClientHandler java.net.ConnectException:...
  TypesJerseyResourceIT.testUpdate:117 » ClientHandler java.net.ConnectException...

Tests run: 142, Failures: 29, Errors: 0, Skipped: 102

[INFO] 
[INFO] --- jetty-maven-plugin:9.2.12.v20150709:stop (stop-jetty) @ atlas-webapp ---
[INFO] Waiting 10 seconds for jetty to stop
[INFO] Stopped ServerConnector@1a2549d7{HTTP/1.1}{0.0.0.0:31000}
[INFO] Closing Spring root WebApplicationContext
[INFO] Shutting down log4j
[INFO] Not cleaning cached beans: no such field javax.el.BeanELResolver.properties
[INFO] Stopped o.e.j.m.p.JettyWebAppContext@252260e4{/,<https://builds.apache.org/job/Atlas-0.8-IntegrationTests/ws/webapp/target/atlas-webapp-0.8.2-SNAPSHOT/,UNAVAILABLE}{/home/jenkins/jenkins-slave/workspace/Atlas-0.8-IntegrationTests/webapp/target/atlas-webapp-0.8.2-SNAPSHOT.war}>
[INFO] Server reports itself as stopped
[INFO] 
[INFO] --- maven-source-plugin:2.4:jar-no-fork (attach-sources) @ atlas-webapp ---
[INFO] Building jar: <https://builds.apache.org/job/Atlas-0.8-IntegrationTests/ws/webapp/target/atlas-webapp-0.8.2-SNAPSHOT-sources.jar>
[INFO] 
[INFO] --- maven-source-plugin:2.4:test-jar-no-fork (attach-sources) @ atlas-webapp ---
log4j:WARN No appenders could be found for logger (org.apache.zookeeper.ClientCnxn).
log4j:WARN Please initialize the log4j system properly.
log4j:WARN See http://logging.apache.org/log4j/1.2/faq.html#noconfig for more info.
[INFO] Building jar: <https://builds.apache.org/job/Atlas-0.8-IntegrationTests/ws/webapp/target/atlas-webapp-0.8.2-SNAPSHOT-test-sources.jar>
[INFO] 
[INFO] --- maven-failsafe-plugin:2.19.1:verify (verify) @ atlas-webapp ---
[INFO] ------------------------------------------------------------------------
[INFO] Reactor Summary:
[INFO] 
[INFO] Apache Atlas Server Build Tools .................... SUCCESS [  1.108 s]
[INFO] apache-atlas ....................................... SUCCESS [  5.522 s]
[INFO] Apache Atlas Integration ........................... SUCCESS [ 21.765 s]
[INFO] Apache Atlas Common ................................ SUCCESS [  8.915 s]
[INFO] Apache Atlas Typesystem ............................ SUCCESS [ 49.866 s]
[INFO] Apache Atlas Client ................................ SUCCESS [  0.742 s]
[INFO] atlas-client-common ................................ SUCCESS [  8.156 s]
[INFO] atlas-client-v1 .................................... SUCCESS [  7.640 s]
[INFO] Apache Atlas Server API ............................ SUCCESS [  6.285 s]
[INFO] Apache Atlas Notification .......................... SUCCESS [ 10.483 s]
[INFO] atlas-client-v2 .................................... SUCCESS [  5.867 s]
[INFO] Apache Atlas Graph Database Projects ............... SUCCESS [  0.572 s]
[INFO] Apache Atlas Graph Database API .................... SUCCESS [  5.400 s]
[INFO] Graph Database Common Code ......................... SUCCESS [  5.809 s]
[INFO] Apache Atlas Titan 1.0.0 GraphDB Impl .............. SUCCESS [ 42.837 s]
[INFO] Shaded version of Apache hbase client .............. SUCCESS [  8.721 s]
[INFO] Apache Atlas Titan 0.5.4 Graph DB Impl ............. SUCCESS [ 40.888 s]
[INFO] Apache Atlas Graph Database Implementation Dependencies SUCCESS [  0.764 s]
[INFO] Shaded version of Apache hbase server .............. SUCCESS [ 24.384 s]
[INFO] Apache Atlas Repository ............................ SUCCESS [01:25 min]
[INFO] Apache Atlas Authorization ......................... SUCCESS [  7.688 s]
[INFO] Apache Atlas Business Catalog ...................... SUCCESS [ 11.647 s]
[INFO] Apache Atlas UI .................................... SUCCESS [01:26 min]
[INFO] Apache Atlas Web Application ....................... FAILURE [01:42 min]
[INFO] Apache Atlas Documentation ......................... SKIPPED
[INFO] Apache Atlas FileSystem Model ...................... SKIPPED
[INFO] Apache Atlas Plugin Classloader .................... SKIPPED
[INFO] Apache Atlas Hive Bridge Shim ...................... SKIPPED
[INFO] Apache Atlas Hive Bridge ........................... SKIPPED
[INFO] Apache Atlas Falcon Bridge Shim .................... SKIPPED
[INFO] Apache Atlas Falcon Bridge ......................... SKIPPED
[INFO] Apache Atlas Sqoop Bridge Shim ..................... SKIPPED
[INFO] Apache Atlas Sqoop Bridge .......................... SKIPPED
[INFO] Apache Atlas Storm Bridge Shim ..................... SKIPPED
[INFO] Apache Atlas Storm Bridge .......................... SKIPPED
[INFO] Apache Atlas Distribution .......................... SKIPPED
[INFO] ------------------------------------------------------------------------
[INFO] BUILD FAILURE
[INFO] ------------------------------------------------------------------------
[INFO] Total time: 09:11 min
[INFO] Finished at: 2017-10-11T00:55:56Z
[INFO] Final Memory: 347M/2598M
[INFO] ------------------------------------------------------------------------
[ERROR] Failed to execute goal org.apache.maven.plugins:maven-failsafe-plugin:2.19.1:verify
(verify) on project atlas-webapp: There are test failures.
[ERROR] 
[ERROR] Please refer to <https://builds.apache.org/job/Atlas-0.8-IntegrationTests/ws/webapp/target/failsafe-reports>
for the individual test results.
[ERROR] -> [Help 1]
[ERROR] 
[ERROR] To see the full stack trace of the errors, re-run Maven with the -e switch.
[ERROR] Re-run Maven using the -X switch to enable full debug logging.
[ERROR] 
[ERROR] For more information about the errors and possible solutions, please read the following
articles:
[ERROR] [Help 1] http://cwiki.apache.org/confluence/display/MAVEN/MojoFailureException
[ERROR] 
[ERROR] After correcting the problems, you can resume the build with the command
[ERROR]   mvn <goals> -rf :atlas-webapp
Build step 'Execute shell' marked build as failure
[CHECKSTYLE] Collecting checkstyle analysis files...
[CHECKSTYLE] Searching for all files in <https://builds.apache.org/job/Atlas-0.8-IntegrationTests/ws/>
that match the pattern **/target/checkstyle-result.xml
[CHECKSTYLE] Parsing 22 files in <https://builds.apache.org/job/Atlas-0.8-IntegrationTests/ws/>
[CHECKSTYLE] Successfully parsed file <https://builds.apache.org/job/Atlas-0.8-IntegrationTests/ws/authorization/target/checkstyle-result.xml>
with 467 unique warnings and 0 duplicates.
[CHECKSTYLE] Successfully parsed file <https://builds.apache.org/job/Atlas-0.8-IntegrationTests/ws/catalog/target/checkstyle-result.xml>
with 2604 unique warnings and 0 duplicates.
[CHECKSTYLE] Successfully parsed file <https://builds.apache.org/job/Atlas-0.8-IntegrationTests/ws/client/client-v1/target/checkstyle-result.xml>
with 3478 unique warnings and 0 duplicates.
[CHECKSTYLE] Successfully parsed file <https://builds.apache.org/job/Atlas-0.8-IntegrationTests/ws/client/client-v2/target/checkstyle-result.xml>
with 3803 unique warnings and 0 duplicates.
[CHECKSTYLE] Successfully parsed file <https://builds.apache.org/job/Atlas-0.8-IntegrationTests/ws/client/common/target/checkstyle-result.xml>
with 4263 unique warnings and 0 duplicates.
[CHECKSTYLE] Successfully parsed file <https://builds.apache.org/job/Atlas-0.8-IntegrationTests/ws/client/target/checkstyle-result.xml>
with 4263 unique warnings and 0 duplicates.
[CHECKSTYLE] Successfully parsed file <https://builds.apache.org/job/Atlas-0.8-IntegrationTests/ws/common/target/checkstyle-result.xml>
with 5222 unique warnings and 0 duplicates.
[CHECKSTYLE] Successfully parsed file <https://builds.apache.org/job/Atlas-0.8-IntegrationTests/ws/dashboardv2/target/checkstyle-result.xml>
with 5222 unique warnings and 0 duplicates.
[CHECKSTYLE] Successfully parsed file <https://builds.apache.org/job/Atlas-0.8-IntegrationTests/ws/graphdb/api/target/checkstyle-result.xml>
with 5495 unique warnings and 0 duplicates.
[CHECKSTYLE] Successfully parsed file <https://builds.apache.org/job/Atlas-0.8-IntegrationTests/ws/graphdb/common/target/checkstyle-result.xml>
with 5682 unique warnings and 0 duplicates.
[CHECKSTYLE] Successfully parsed file <https://builds.apache.org/job/Atlas-0.8-IntegrationTests/ws/graphdb/graphdb-impls/target/checkstyle-result.xml>
with 5682 unique warnings and 0 duplicates.
[CHECKSTYLE] Successfully parsed file <https://builds.apache.org/job/Atlas-0.8-IntegrationTests/ws/graphdb/target/checkstyle-result.xml>
with 5682 unique warnings and 0 duplicates.
[CHECKSTYLE] Successfully parsed file <https://builds.apache.org/job/Atlas-0.8-IntegrationTests/ws/graphdb/titan0/target/checkstyle-result.xml>
with 8084 unique warnings and 0 duplicates.
[CHECKSTYLE] Successfully parsed file <https://builds.apache.org/job/Atlas-0.8-IntegrationTests/ws/graphdb/titan1/target/checkstyle-result.xml>
with 9051 unique warnings and 0 duplicates.
[CHECKSTYLE] Successfully parsed file <https://builds.apache.org/job/Atlas-0.8-IntegrationTests/ws/intg/target/checkstyle-result.xml>
with 15773 unique warnings and 0 duplicates.
[CHECKSTYLE] Successfully parsed file <https://builds.apache.org/job/Atlas-0.8-IntegrationTests/ws/notification/target/checkstyle-result.xml>
with 17338 unique warnings and 0 duplicates.
[CHECKSTYLE] Successfully parsed file <https://builds.apache.org/job/Atlas-0.8-IntegrationTests/ws/repository/target/checkstyle-result.xml>
with 36214 unique warnings and 0 duplicates.
[CHECKSTYLE] Successfully parsed file <https://builds.apache.org/job/Atlas-0.8-IntegrationTests/ws/server-api/target/checkstyle-result.xml>
with 36593 unique warnings and 0 duplicates.
[CHECKSTYLE] Successfully parsed file <https://builds.apache.org/job/Atlas-0.8-IntegrationTests/ws/shaded/hbase-client-shaded/target/checkstyle-result.xml>
with 36593 unique warnings and 0 duplicates.
[CHECKSTYLE] Successfully parsed file <https://builds.apache.org/job/Atlas-0.8-IntegrationTests/ws/shaded/hbase-server-shaded/target/checkstyle-result.xml>
with 36593 unique warnings and 0 duplicates.
[CHECKSTYLE] Successfully parsed file <https://builds.apache.org/job/Atlas-0.8-IntegrationTests/ws/target/checkstyle-result.xml>
with 36593 unique warnings and 0 duplicates.
[CHECKSTYLE] Successfully parsed file <https://builds.apache.org/job/Atlas-0.8-IntegrationTests/ws/typesystem/target/checkstyle-result.xml>
with 40811 unique warnings and 0 duplicates.
<Git Blamer> Using GitBlamer to create author and commit information for all warnings.
<Git Blamer> GIT_COMMIT=c33f52833d740da983db14b0d907870753c18e91, workspace=<https://builds.apache.org/job/Atlas-0.8-IntegrationTests/ws/>
 > git rev-parse c33f52833d740da983db14b0d907870753c18e91^{commit} # timeout=10
<Git Blamer> Skipping file <https://builds.apache.org/job/Atlas-0.8-IntegrationTests/ws/typesystem/src/main/java/org/apache/atlas/typesystem/IStruct.java,>
no result found.
[FINDBUGS] Collecting findbugs analysis files...
[FINDBUGS] Searching for all files in <https://builds.apache.org/job/Atlas-0.8-IntegrationTests/ws/>
that match the pattern **/target/findbugs.xml
[FINDBUGS] Parsing 15 files in <https://builds.apache.org/job/Atlas-0.8-IntegrationTests/ws/>
[FINDBUGS] Successfully parsed file <https://builds.apache.org/job/Atlas-0.8-IntegrationTests/ws/authorization/target/findbugs.xml>
with 0 unique warnings and 0 duplicates.
[FINDBUGS] Successfully parsed file <https://builds.apache.org/job/Atlas-0.8-IntegrationTests/ws/catalog/target/findbugs.xml>
with 0 unique warnings and 0 duplicates.
[FINDBUGS] Successfully parsed file <https://builds.apache.org/job/Atlas-0.8-IntegrationTests/ws/client/client-v1/target/findbugs.xml>
with 0 unique warnings and 0 duplicates.
[FINDBUGS] Successfully parsed file <https://builds.apache.org/job/Atlas-0.8-IntegrationTests/ws/client/client-v2/target/findbugs.xml>
with 0 unique warnings and 0 duplicates.
[FINDBUGS] Successfully parsed file <https://builds.apache.org/job/Atlas-0.8-IntegrationTests/ws/client/common/target/findbugs.xml>
with 0 unique warnings and 0 duplicates.
[FINDBUGS] Successfully parsed file <https://builds.apache.org/job/Atlas-0.8-IntegrationTests/ws/common/target/findbugs.xml>
with 0 unique warnings and 0 duplicates.
[FINDBUGS] Successfully parsed file <https://builds.apache.org/job/Atlas-0.8-IntegrationTests/ws/graphdb/api/target/findbugs.xml>
with 0 unique warnings and 0 duplicates.
[FINDBUGS] Successfully parsed file <https://builds.apache.org/job/Atlas-0.8-IntegrationTests/ws/graphdb/common/target/findbugs.xml>
with 0 unique warnings and 0 duplicates.
[FINDBUGS] Successfully parsed file <https://builds.apache.org/job/Atlas-0.8-IntegrationTests/ws/graphdb/titan0/target/findbugs.xml>
with 0 unique warnings and 0 duplicates.
[FINDBUGS] Successfully parsed file <https://builds.apache.org/job/Atlas-0.8-IntegrationTests/ws/graphdb/titan1/target/findbugs.xml>
with 0 unique warnings and 0 duplicates.
[FINDBUGS] Successfully parsed file <https://builds.apache.org/job/Atlas-0.8-IntegrationTests/ws/intg/target/findbugs.xml>
with 0 unique warnings and 0 duplicates.
[FINDBUGS] Successfully parsed file <https://builds.apache.org/job/Atlas-0.8-IntegrationTests/ws/notification/target/findbugs.xml>
with 0 unique warnings and 0 duplicates.
[FINDBUGS] Successfully parsed file <https://builds.apache.org/job/Atlas-0.8-IntegrationTests/ws/repository/target/findbugs.xml>
with 0 unique warnings and 0 duplicates.
[FINDBUGS] Successfully parsed file <https://builds.apache.org/job/Atlas-0.8-IntegrationTests/ws/server-api/target/findbugs.xml>
with 0 unique warnings and 0 duplicates.
[FINDBUGS] Successfully parsed file <https://builds.apache.org/job/Atlas-0.8-IntegrationTests/ws/typesystem/target/findbugs.xml>
with 0 unique warnings and 0 duplicates.
<Git Blamer> Using GitBlamer to create author and commit information for all warnings.
<Git Blamer> GIT_COMMIT=c33f52833d740da983db14b0d907870753c18e91, workspace=<https://builds.apache.org/job/Atlas-0.8-IntegrationTests/ws/>
Archiving artifacts
[Fast Archiver] No prior successful build to compare, so performing full copy of artifacts
TestNG Reports Processing: START
Looking for TestNG results report in workspace using pattern: **/target/surefire-reports/testng-results.xml,**/target/failsafe-reports/testng-results.xml
Saving reports...
Processing '/x1/jenkins/jenkins-home/jobs/Atlas-0.8-IntegrationTests/builds/105/testng/testng-results.xml'
15.037594% of tests failed, which exceeded threshold of 0%. Marking build as UNSTABLE
TestNG Reports Processing: FINISH

Mime
View raw message