atlas-dev mailing list archives

Site index · List index
Message view « Date » · « Thread »
Top « Date » · « Thread »
From Apache Jenkins Server <jenk...@builds.apache.org>
Subject Build failed in Jenkins: Atlas-0.8-IntegrationTests #124
Date Mon, 30 Oct 2017 14:59:12 GMT
See <https://builds.apache.org/job/Atlas-0.8-IntegrationTests/124/display/redirect?page=changes>

Changes:

[kbhatt] ATLAS-2208 : Include historical entities in Schema tab checked by

[kbhatt] ATLAS-2236 : UI - Basic Search Post request send attribute filters even

------------------------------------------
[...truncated 546.90 KB...]
127.0.0.1 - - [30/Oct/2017:14:51:53 +0000] "GET /api/atlas/v2/types/typedef/name/hive_db_v1
HTTP/1.1" 200 - "-" "Java/1.8.0_152"
127.0.0.1 - - [30/Oct/2017:14:51:53 +0000] "GET /api/atlas/v2/types/typedef/name/hive_column_v1
HTTP/1.1" 200 - "-" "Java/1.8.0_152"
127.0.0.1 - - [30/Oct/2017:14:51:53 +0000] "GET /api/atlas/v2/types/typedef/name/hive_table_v1
HTTP/1.1" 200 - "-" "Java/1.8.0_152"
127.0.0.1 - - [30/Oct/2017:14:51:53 +0000] "GET /api/atlas/v2/types/typedef/name/hive_process_v1
HTTP/1.1" 200 - "-" "Java/1.8.0_152"
127.0.0.1 - - [30/Oct/2017:14:51:53 +0000] "POST /api/atlas/types HTTP/1.1" 201 - "-" "Java/1.8.0_152"
127.0.0.1 - - [30/Oct/2017:14:51:53 +0000] "GET /api/atlas/v2/types/typedef/name/Fact HTTP/1.1"
200 - "-" "Java/1.8.0_152"
127.0.0.1 - - [30/Oct/2017:14:51:53 +0000] "GET /api/atlas/v2/types/typedef/name/ETL HTTP/1.1"
200 - "-" "Java/1.8.0_152"
127.0.0.1 - - [30/Oct/2017:14:51:53 +0000] "GET /api/atlas/v2/types/typedef/name/Dimension
HTTP/1.1" 200 - "-" "Java/1.8.0_152"
127.0.0.1 - - [30/Oct/2017:14:51:53 +0000] "GET /api/atlas/v2/types/typedef/name/Metric HTTP/1.1"
200 - "-" "Java/1.8.0_152"
127.0.0.1 - - [30/Oct/2017:14:51:53 +0000] "POST /api/atlas/types HTTP/1.1" 201 - "-" "Java/1.8.0_152"
127.0.0.1 - - [30/Oct/2017:14:51:53 +0000] "POST /api/atlas/entities HTTP/1.1" 201 - "-" "Java/1.8.0_152"
127.0.0.1 - - [30/Oct/2017:14:51:54 +0000] "POST /api/atlas/entities HTTP/1.1" 201 - "-" "Java/1.8.0_152"
127.0.0.1 - - [30/Oct/2017:14:51:54 +0000] "POST /api/atlas/entities HTTP/1.1" 201 - "-" "Java/1.8.0_152"
127.0.0.1 - - [30/Oct/2017:14:51:54 +0000] "POST /api/atlas/entities HTTP/1.1" 201 - "-" "Java/1.8.0_152"
127.0.0.1 - - [30/Oct/2017:14:51:54 +0000] "POST /api/atlas/entities HTTP/1.1" 201 - "-" "Java/1.8.0_152"
127.0.0.1 - - [30/Oct/2017:14:51:54 +0000] "POST /api/atlas/entities HTTP/1.1" 201 - "-" "Java/1.8.0_152"
127.0.0.1 - - [30/Oct/2017:14:51:54 +0000] "POST /api/atlas/entities HTTP/1.1" 201 - "-" "Java/1.8.0_152"
127.0.0.1 - - [30/Oct/2017:14:51:54 +0000] "POST /api/atlas/entities HTTP/1.1" 201 - "-" "Java/1.8.0_152"
127.0.0.1 - - [30/Oct/2017:14:51:54 +0000] "GET /api/atlas/lineage/hive/table/sales_factvcUcsZfaS8/schema
HTTP/1.1" 200 - "-" "Java/1.8.0_152"
127.0.0.1 - - [30/Oct/2017:14:51:55 +0000] "GET /api/atlas/lineage/hive/table/sales_factvcUcsZfaS8/outputs/graph
HTTP/1.1" 200 - "-" "Java/1.8.0_152"
127.0.0.1 - - [30/Oct/2017:14:51:57 +0000] "GET /api/atlas/entities?type=hive_table_v1&property=qualifiedName&value=sales_factvcUcsZfaS8
HTTP/1.1" 200 - "-" "Java/1.8.0_152"
127.0.0.1 - - [30/Oct/2017:14:51:57 +0000] "GET /api/atlas/lineage/b04aa5cb-93c2-4a6c-af97-3e081d582bcc/outputs/graph
HTTP/1.1" 200 - "-" "Java/1.8.0_152"
127.0.0.1 - - [30/Oct/2017:14:51:58 +0000] "GET /api/atlas/lineage/hive/table/sales_fact_monthly_mvnkj3o5Lf17/inputs/graph
HTTP/1.1" 200 - "-" "Java/1.8.0_152"
127.0.0.1 - - [30/Oct/2017:14:52:01 +0000] "GET /api/atlas/lineage/hive/table/SalesZsAnmheXI3/schema
HTTP/1.1" 404 - "-" "Java/1.8.0_152"
127.0.0.1 - - [30/Oct/2017:14:52:01 +0000] "GET /api/atlas/entities?type=hive_table_v1&property=qualifiedName&value=sales_factvcUcsZfaS8
HTTP/1.1" 200 - "-" "Java/1.8.0_152"
127.0.0.1 - - [30/Oct/2017:14:52:01 +0000] "GET /api/atlas/lineage/b04aa5cb-93c2-4a6c-af97-3e081d582bcc/schema
HTTP/1.1" 200 - "-" "Java/1.8.0_152"
127.0.0.1 - - [30/Oct/2017:14:52:01 +0000] "GET /api/atlas/lineage/hive/table/blah/schema
HTTP/1.1" 404 - "-" "Java/1.8.0_152"
127.0.0.1 - - [30/Oct/2017:14:52:01 +0000] "GET /api/atlas/entities?type=hive_table_v1&property=qualifiedName&value=sales_fact_monthly_mvnkj3o5Lf17
HTTP/1.1" 200 - "-" "Java/1.8.0_152"
127.0.0.1 - - [30/Oct/2017:14:52:01 +0000] "GET /api/atlas/lineage/a27fbff3-e93d-4a0c-a0fe-d33d7a979526/inputs/graph
HTTP/1.1" 200 - "-" "Java/1.8.0_152"
127.0.0.1 - - [30/Oct/2017:14:52:03 +0000] "GET /api/atlas/admin/version HTTP/1.1" 200 - "-"
"Java/1.8.0_152"
127.0.0.1 - - [30/Oct/2017:14:52:09 +0000] "GET /api/atlas/v2/types/typedef/name/database
HTTP/1.1" 200 - "-" "Java/1.8.0_152"
127.0.0.1 - - [30/Oct/2017:14:52:09 +0000] "GET /api/atlas/v2/types/typedef/name/table HTTP/1.1"
404 - "-" "Java/1.8.0_152"
127.0.0.1 - - [30/Oct/2017:14:52:09 +0000] "GET /api/atlas/v2/types/typedef/name/fetl HTTP/1.1"
404 - "-" "Java/1.8.0_152"
127.0.0.1 - - [30/Oct/2017:14:52:09 +0000] "POST /api/atlas/v2/types/typedefs HTTP/1.1" 200
- "-" "Java/1.8.0_152"
127.0.0.1 - - [30/Oct/2017:14:52:09 +0000] "GET /api/atlas/v2/types/classificationdef/name/fetl
HTTP/1.1" 200 - "-" "Java/1.8.0_152"
127.0.0.1 - - [30/Oct/2017:14:52:09 +0000] "GET /api/atlas/v2/types/entitydef/name/database
HTTP/1.1" 200 - "-" "Java/1.8.0_152"
127.0.0.1 - - [30/Oct/2017:14:52:09 +0000] "GET /api/atlas/v2/types/entitydef/name/table HTTP/1.1"
200 - "-" "Java/1.8.0_152"
127.0.0.1 - - [30/Oct/2017:14:52:09 +0000] "POST /api/atlas/v2/types/typedefs HTTP/1.1" 200
- "-" "Java/1.8.0_152"
127.0.0.1 - - [30/Oct/2017:14:52:09 +0000] "POST /api/atlas/v2/types/typedefs HTTP/1.1" 409
- "-" "Java/1.8.0_152"
127.0.0.1 - - [30/Oct/2017:14:52:09 +0000] "GET /api/atlas/v2/types/enumdef/name/blah HTTP/1.1"
404 - "-" "Java/1.8.0_152"
127.0.0.1 - - [30/Oct/2017:14:52:09 +0000] "GET /api/atlas/v2/types/enumdef/guid/blah HTTP/1.1"
404 - "-" "Java/1.8.0_152"
127.0.0.1 - - [30/Oct/2017:14:52:09 +0000] "GET /api/atlas/v2/types/structdef/name/blah HTTP/1.1"
404 - "-" "Java/1.8.0_152"
127.0.0.1 - - [30/Oct/2017:14:52:09 +0000] "GET /api/atlas/v2/types/structdef/guid/blah HTTP/1.1"
404 - "-" "Java/1.8.0_152"
127.0.0.1 - - [30/Oct/2017:14:52:09 +0000] "GET /api/atlas/v2/types/classificationdef/name/blah
HTTP/1.1" 404 - "-" "Java/1.8.0_152"
127.0.0.1 - - [30/Oct/2017:14:52:09 +0000] "GET /api/atlas/v2/types/classificationdef/guid/blah
HTTP/1.1" 404 - "-" "Java/1.8.0_152"
127.0.0.1 - - [30/Oct/2017:14:52:09 +0000] "GET /api/atlas/v2/types/entitydef/name/blah HTTP/1.1"
404 - "-" "Java/1.8.0_152"
127.0.0.1 - - [30/Oct/2017:14:52:09 +0000] "GET /api/atlas/v2/types/entitydef/guid/blah HTTP/1.1"
404 - "-" "Java/1.8.0_152"
127.0.0.1 - - [30/Oct/2017:14:52:09 +0000] "POST /api/atlas/v2/types/typedefs HTTP/1.1" 200
- "-" "Java/1.8.0_152"
127.0.0.1 - - [30/Oct/2017:14:52:09 +0000] "GET /api/atlas/v2/types/typedefs?supertype=AXIwvXd1AHT&type=CLASS
HTTP/1.1" 200 - "-" "Java/1.8.0_152"
127.0.0.1 - - [30/Oct/2017:14:52:09 +0000] "GET /api/atlas/v2/types/typedefs?supertype=AXIwvXd1AHT&type=CLASS&notsupertype=BcfoIDo4KEq
HTTP/1.1" 200 - "-" "Java/1.8.0_152"
127.0.0.1 - - [30/Oct/2017:14:52:09 +0000] "POST /api/atlas/v2/types/typedefs HTTP/1.1" 200
- "-" "Java/1.8.0_152"
127.0.0.1 - - [30/Oct/2017:14:52:10 +0000] "PUT /api/atlas/v2/types/typedefs HTTP/1.1" 200
- "-" "Java/1.8.0_152"
127.0.0.1 - - [30/Oct/2017:14:52:10 +0000] "GET /api/atlas/v2/types/typedefs?type=ENTITY HTTP/1.1"
200 - "-" "Java/1.8.0_152"
127.0.0.1 - - [30/Oct/2017:14:52:10 +0000] "GET /api/atlas/admin/session HTTP/1.1" 401 317
"-" "Java/1.8.0_152"
127.0.0.1 - - [30/Oct/2017:14:52:10 +0000] "GET /api/atlas/v1/taxonomies HTTP/1.1" 403 493
"-" "Java/1.8.0_152"
127.0.0.1 - - [30/Oct/2017:14:52:10 +0000] "GET /api/atlas/admin/session HTTP/1.1" 200 - "-"
"Java/1.8.0_152"
127.0.0.1 - - [30/Oct/2017:14:52:10 +0000] "GET /api/atlas/admin/status HTTP/1.1" 200 - "-"
"Java/1.8.0_152"
127.0.0.1 - - [30/Oct/2017:14:52:16 +0000] "GET /api/atlas/v2/types/classificationdef/name/fetl
HTTP/1.1" 200 - "-" "Java/1.8.0_152"
127.0.0.1 - - [30/Oct/2017:14:52:16 +0000] "GET /api/atlas/v2/types/entitydef/name/database
HTTP/1.1" 200 - "-" "Java/1.8.0_152"
127.0.0.1 - - [30/Oct/2017:14:52:16 +0000] "GET /api/atlas/v2/types/entitydef/name/table HTTP/1.1"
200 - "-" "Java/1.8.0_152"
127.0.0.1 - - [30/Oct/2017:14:52:16 +0000] "GET /api/atlas/v2/types/typedef/name/tableType
HTTP/1.1" 200 - "-" "Java/1.8.0_152"
127.0.0.1 - - [30/Oct/2017:14:52:16 +0000] "GET /api/atlas/v2/types/typedef/name/serdeType
HTTP/1.1" 200 - "-" "Java/1.8.0_152"
127.0.0.1 - - [30/Oct/2017:14:52:16 +0000] "GET /api/atlas/v2/types/typedef/name/classification
HTTP/1.1" 200 - "-" "Java/1.8.0_152"
127.0.0.1 - - [30/Oct/2017:14:52:16 +0000] "GET /api/atlas/v2/types/typedef/name/pii HTTP/1.1"
200 - "-" "Java/1.8.0_152"
127.0.0.1 - - [30/Oct/2017:14:52:16 +0000] "GET /api/atlas/v2/types/typedef/name/phi HTTP/1.1"
200 - "-" "Java/1.8.0_152"
127.0.0.1 - - [30/Oct/2017:14:52:16 +0000] "GET /api/atlas/v2/types/typedef/name/pci HTTP/1.1"
200 - "-" "Java/1.8.0_152"
127.0.0.1 - - [30/Oct/2017:14:52:16 +0000] "GET /api/atlas/v2/types/typedef/name/sox HTTP/1.1"
200 - "-" "Java/1.8.0_152"
127.0.0.1 - - [30/Oct/2017:14:52:16 +0000] "GET /api/atlas/v2/types/typedef/name/sec HTTP/1.1"
200 - "-" "Java/1.8.0_152"
127.0.0.1 - - [30/Oct/2017:14:52:16 +0000] "GET /api/atlas/v2/types/typedef/name/finance HTTP/1.1"
200 - "-" "Java/1.8.0_152"
127.0.0.1 - - [30/Oct/2017:14:52:16 +0000] "GET /api/atlas/v2/types/typedef/name/Factjqf7aLW8xw
HTTP/1.1" 404 - "-" "Java/1.8.0_152"
127.0.0.1 - - [30/Oct/2017:14:52:16 +0000] "GET /api/atlas/v2/types/typedef/name/ETLry0JnS2PKY
HTTP/1.1" 404 - "-" "Java/1.8.0_152"
127.0.0.1 - - [30/Oct/2017:14:52:16 +0000] "GET /api/atlas/v2/types/typedef/name/Dimensionb5FeYykx26
HTTP/1.1" 404 - "-" "Java/1.8.0_152"
127.0.0.1 - - [30/Oct/2017:14:52:16 +0000] "GET /api/atlas/v2/types/typedef/name/MetricQEtvYuIYQ7
HTTP/1.1" 404 - "-" "Java/1.8.0_152"
127.0.0.1 - - [30/Oct/2017:14:52:16 +0000] "GET /api/atlas/v2/types/typedef/name/hive_db_v1
HTTP/1.1" 200 - "-" "Java/1.8.0_152"
127.0.0.1 - - [30/Oct/2017:14:52:16 +0000] "GET /api/atlas/v2/types/typedef/name/hive_column_v1
HTTP/1.1" 200 - "-" "Java/1.8.0_152"
127.0.0.1 - - [30/Oct/2017:14:52:16 +0000] "GET /api/atlas/v2/types/typedef/name/hive_table_v1
HTTP/1.1" 200 - "-" "Java/1.8.0_152"
127.0.0.1 - - [30/Oct/2017:14:52:16 +0000] "GET /api/atlas/v2/types/typedef/name/hive_process_v1
HTTP/1.1" 200 - "-" "Java/1.8.0_152"
127.0.0.1 - - [30/Oct/2017:14:52:16 +0000] "POST /api/atlas/types HTTP/1.1" 201 - "-" "Java/1.8.0_152"
127.0.0.1 - - [30/Oct/2017:14:52:17 +0000] "GET /api/atlas/discovery/search/dsl?query=hive_db+where+qualifiedName%3D'dbC7r733v1to'&limit=10&offset=0
HTTP/1.1" 200 - "-" "Java/1.8.0_152"
127.0.0.1 - - [30/Oct/2017:14:52:18 +0000] "GET /api/atlas/entities?type=hive_db&property=qualifiedName&value=dbC7r733v1to
HTTP/1.1" 200 - "-" "Java/1.8.0_152"
127.0.0.1 - - [30/Oct/2017:14:52:18 +0000] "GET /api/atlas/entities/7f18261c-b5b7-49df-a34c-6bea5dfc1dbf/audit?count=1
HTTP/1.1" 200 - "-" "Java/1.8.0_152"
127.0.0.1 - - [30/Oct/2017:14:52:18 +0000] "POST /api/atlas/entities HTTP/1.1" 201 - "-" "Java/1.8.0_152"
127.0.0.1 - - [30/Oct/2017:14:52:19 +0000] "GET /api/atlas/entities/2a9b3322-b512-45b5-b493-b3ca512442a1
HTTP/1.1" 200 - "-" "Java/1.8.0_152"
127.0.0.1 - - [30/Oct/2017:14:52:21 +0000] "GET /api/atlas/discovery/search/dsl?query=hive_db+where+name%3D'dbk6HTWW7c46'&limit=10&offset=0
HTTP/1.1" 200 - "-" "Java/1.8.0_152"
127.0.0.1 - - [30/Oct/2017:14:52:22 +0000] "POST /api/atlas/entities HTTP/1.1" 201 - "-" "Java/1.8.0_152"
127.0.0.1 - - [30/Oct/2017:14:52:23 +0000] "GET /api/atlas/discovery/search/dsl?query=hive_db+where+qualifiedName%3D'dbBdizDJRV6e'&limit=10&offset=0
HTTP/1.1" 200 - "-" "Java/1.8.0_152"
127.0.0.1 - - [30/Oct/2017:14:52:25 +0000] "GET /api/atlas/entities?type=hive_db&property=qualifiedName&value=dbBdizDJRV6e
HTTP/1.1" 200 - "-" "Java/1.8.0_152"
127.0.0.1 - - [30/Oct/2017:14:52:25 +0000] "POST /api/atlas/entities HTTP/1.1" 201 - "-" "Java/1.8.0_152"
127.0.0.1 - - [30/Oct/2017:14:52:26 +0000] "GET /api/atlas/entities?type=hive_db&property=qualifiedName&value=dbigRzu6ZJrh
HTTP/1.1" 200 - "-" "Java/1.8.0_152"
127.0.0.1 - - [30/Oct/2017:14:52:26 +0000] "GET /api/atlas/entities?type=hive_db&property=qualifiedName&value=dbigRzu6ZJrh
HTTP/1.1" 200 - "-" "Java/1.8.0_152"
127.0.0.1 - - [30/Oct/2017:14:52:26 +0000] "POST /api/atlas/entities HTTP/1.1" 201 - "-" "Java/1.8.0_152"
127.0.0.1 - - [30/Oct/2017:14:52:27 +0000] "GET /api/atlas/discovery/search/dsl?query=hive_db+where+qualifiedName%3D'dbtIzSL2F9MM'&limit=10&offset=0
HTTP/1.1" 200 - "-" "Java/1.8.0_152"
127.0.0.1 - - [30/Oct/2017:14:52:27 +0000] "GET /api/atlas/discovery/search/dsl?query=hive_db+where+qualifiedName%3D'dbeoPEz09efB'&limit=10&offset=0
HTTP/1.1" 200 - "-" "Java/1.8.0_152"
Tests run: 136, Failures: 1, Errors: 0, Skipped: 2, Time elapsed: 186.67 sec <<<
FAILURE! - in TestSuite
testSubmit(org.apache.atlas.web.integration.TypesJerseyResourceIT)  Time elapsed: 0.19 sec
 <<< FAILURE!
org.apache.atlas.AtlasServiceException: Metadata service API org.apache.atlas.AtlasClient$API_V1@3240cf9
failed with status 400 (Bad Request) Response Body ({"error":"table.database: invalid inverseRef
constraint. Inverse attribute database.database does not exist"})
	at org.apache.atlas.AtlasBaseClient.callAPIWithResource(AtlasBaseClient.java:387)
	at org.apache.atlas.AtlasBaseClient.callAPIWithResource(AtlasBaseClient.java:320)
	at org.apache.atlas.AtlasBaseClient.callAPI(AtlasBaseClient.java:208)
	at org.apache.atlas.AtlasClient.callAPIWithBody(AtlasClient.java:942)
	at org.apache.atlas.web.integration.TypesJerseyResourceIT.testSubmit(TypesJerseyResourceIT.java:84)


Results :

Failed tests: 
  TypesJerseyResourceIT.testSubmit:84 » AtlasService Metadata service API org.ap...

Tests run: 136, Failures: 1, Errors: 0, Skipped: 2

[INFO] 
[INFO] --- jetty-maven-plugin:9.2.12.v20150709:stop (stop-jetty) @ atlas-webapp ---
[INFO] Waiting 10 seconds for jetty to stop
[INFO] Stopped ServerConnector@7a8e06bb{HTTP/1.1}{0.0.0.0:31000}
[INFO] Closing Spring root WebApplicationContext
[INFO] Shutting down log4j
[INFO] Not cleaning cached beans: no such field javax.el.BeanELResolver.properties
[INFO] Stopped o.e.j.m.p.JettyWebAppContext@31df1f19{/,<https://builds.apache.org/job/Atlas-0.8-IntegrationTests/ws/webapp/target/atlas-webapp-0.8.2-SNAPSHOT/,UNAVAILABLE}{/home/jenkins/jenkins-slave/workspace/Atlas-0.8-IntegrationTests/webapp/target/atlas-webapp-0.8.2-SNAPSHOT.war}>
[INFO] Server reports itself as stopped
[INFO] 
[INFO] --- maven-source-plugin:2.4:jar-no-fork (attach-sources) @ atlas-webapp ---
[INFO] Building jar: <https://builds.apache.org/job/Atlas-0.8-IntegrationTests/ws/webapp/target/atlas-webapp-0.8.2-SNAPSHOT-sources.jar>
log4j:WARN No appenders could be found for logger (org.apache.zookeeper.ClientCnxn).
log4j:WARN Please initialize the log4j system properly.
log4j:WARN See http://logging.apache.org/log4j/1.2/faq.html#noconfig for more info.
[INFO] 
[INFO] --- maven-source-plugin:2.4:test-jar-no-fork (attach-sources) @ atlas-webapp ---
[INFO] Building jar: <https://builds.apache.org/job/Atlas-0.8-IntegrationTests/ws/webapp/target/atlas-webapp-0.8.2-SNAPSHOT-test-sources.jar>
[INFO] 
[INFO] --- maven-failsafe-plugin:2.18.1:verify (verify) @ atlas-webapp ---
[INFO] Failsafe report directory: <https://builds.apache.org/job/Atlas-0.8-IntegrationTests/ws/webapp/target/failsafe-reports>
[INFO] ------------------------------------------------------------------------
[INFO] Reactor Summary:
[INFO] 
[INFO] Apache Atlas Server Build Tools .................... SUCCESS [  1.504 s]
[INFO] apache-atlas ....................................... SUCCESS [  6.442 s]
[INFO] Apache Atlas Integration ........................... SUCCESS [ 23.368 s]
[INFO] Apache Atlas Common ................................ SUCCESS [  8.262 s]
[INFO] Apache Atlas Typesystem ............................ SUCCESS [ 48.990 s]
[INFO] Apache Atlas Client ................................ SUCCESS [  0.943 s]
[INFO] atlas-client-common ................................ SUCCESS [  8.310 s]
[INFO] atlas-client-v1 .................................... SUCCESS [  7.452 s]
[INFO] Apache Atlas Server API ............................ SUCCESS [  6.770 s]
[INFO] Apache Atlas Notification .......................... SUCCESS [ 11.459 s]
[INFO] atlas-client-v2 .................................... SUCCESS [  6.623 s]
[INFO] Apache Atlas Graph Database Projects ............... SUCCESS [  0.516 s]
[INFO] Apache Atlas Graph Database API .................... SUCCESS [  5.889 s]
[INFO] Graph Database Common Code ......................... SUCCESS [  5.912 s]
[INFO] Apache Atlas Titan 1.0.0 GraphDB Impl .............. SUCCESS [ 40.865 s]
[INFO] Shaded version of Apache hbase client .............. SUCCESS [  8.223 s]
[INFO] Apache Atlas Titan 0.5.4 Graph DB Impl ............. SUCCESS [ 38.658 s]
[INFO] Apache Atlas Graph Database Implementation Dependencies SUCCESS [  0.784 s]
[INFO] Shaded version of Apache hbase server .............. SUCCESS [ 23.247 s]
[INFO] Apache Atlas Repository ............................ SUCCESS [01:28 min]
[INFO] Apache Atlas Authorization ......................... SUCCESS [  7.298 s]
[INFO] Apache Atlas Business Catalog ...................... SUCCESS [ 16.300 s]
[INFO] Apache Atlas UI .................................... SUCCESS [01:53 min]
[INFO] Apache Atlas Web Application ....................... FAILURE [05:11 min]
[INFO] Apache Atlas Documentation ......................... SKIPPED
[INFO] Apache Atlas FileSystem Model ...................... SKIPPED
[INFO] Apache Atlas Plugin Classloader .................... SKIPPED
[INFO] Apache Atlas Hive Bridge Shim ...................... SKIPPED
[INFO] Apache Atlas Hive Bridge ........................... SKIPPED
[INFO] Apache Atlas Falcon Bridge Shim .................... SKIPPED
[INFO] Apache Atlas Falcon Bridge ......................... SKIPPED
[INFO] Apache Atlas Sqoop Bridge Shim ..................... SKIPPED
[INFO] Apache Atlas Sqoop Bridge .......................... SKIPPED
[INFO] Apache Atlas Storm Bridge Shim ..................... SKIPPED
[INFO] Apache Atlas Storm Bridge .......................... SKIPPED
[INFO] Apache Atlas Hbase Bridge Shim ..................... SKIPPED
[INFO] Apache Atlas Hbase Bridge .......................... SKIPPED
[INFO] Apache Atlas Distribution .......................... SKIPPED
[INFO] ------------------------------------------------------------------------
[INFO] BUILD FAILURE
[INFO] ------------------------------------------------------------------------
[INFO] Total time: 13:12 min
[INFO] Finished at: 2017-10-30T14:52:35Z
[INFO] Final Memory: 377M/2649M
[INFO] ------------------------------------------------------------------------
[ERROR] Failed to execute goal org.apache.maven.plugins:maven-failsafe-plugin:2.18.1:verify
(verify) on project atlas-webapp: There are test failures.
[ERROR] 
[ERROR] Please refer to <https://builds.apache.org/job/Atlas-0.8-IntegrationTests/ws/webapp/target/failsafe-reports>
for the individual test results.
[ERROR] -> [Help 1]
[ERROR] 
[ERROR] To see the full stack trace of the errors, re-run Maven with the -e switch.
[ERROR] Re-run Maven using the -X switch to enable full debug logging.
[ERROR] 
[ERROR] For more information about the errors and possible solutions, please read the following
articles:
[ERROR] [Help 1] http://cwiki.apache.org/confluence/display/MAVEN/MojoFailureException
[ERROR] 
[ERROR] After correcting the problems, you can resume the build with the command
[ERROR]   mvn <goals> -rf :atlas-webapp
Build step 'Execute shell' marked build as failure
[CHECKSTYLE] Collecting checkstyle analysis files...
[CHECKSTYLE] Searching for all files in <https://builds.apache.org/job/Atlas-0.8-IntegrationTests/ws/>
that match the pattern **/target/checkstyle-result.xml
[CHECKSTYLE] Parsing 22 files in <https://builds.apache.org/job/Atlas-0.8-IntegrationTests/ws/>
[CHECKSTYLE] Successfully parsed file <https://builds.apache.org/job/Atlas-0.8-IntegrationTests/ws/authorization/target/checkstyle-result.xml>
with 467 unique warnings and 0 duplicates.
[CHECKSTYLE] Successfully parsed file <https://builds.apache.org/job/Atlas-0.8-IntegrationTests/ws/catalog/target/checkstyle-result.xml>
with 2604 unique warnings and 0 duplicates.
[CHECKSTYLE] Successfully parsed file <https://builds.apache.org/job/Atlas-0.8-IntegrationTests/ws/client/client-v1/target/checkstyle-result.xml>
with 3480 unique warnings and 0 duplicates.
[CHECKSTYLE] Successfully parsed file <https://builds.apache.org/job/Atlas-0.8-IntegrationTests/ws/client/client-v2/target/checkstyle-result.xml>
with 3805 unique warnings and 0 duplicates.
[CHECKSTYLE] Successfully parsed file <https://builds.apache.org/job/Atlas-0.8-IntegrationTests/ws/client/common/target/checkstyle-result.xml>
with 4295 unique warnings and 0 duplicates.
[CHECKSTYLE] Successfully parsed file <https://builds.apache.org/job/Atlas-0.8-IntegrationTests/ws/client/target/checkstyle-result.xml>
with 4295 unique warnings and 0 duplicates.
[CHECKSTYLE] Successfully parsed file <https://builds.apache.org/job/Atlas-0.8-IntegrationTests/ws/common/target/checkstyle-result.xml>
with 5254 unique warnings and 0 duplicates.
[CHECKSTYLE] Successfully parsed file <https://builds.apache.org/job/Atlas-0.8-IntegrationTests/ws/dashboardv2/target/checkstyle-result.xml>
with 5254 unique warnings and 0 duplicates.
[CHECKSTYLE] Successfully parsed file <https://builds.apache.org/job/Atlas-0.8-IntegrationTests/ws/graphdb/api/target/checkstyle-result.xml>
with 5527 unique warnings and 0 duplicates.
[CHECKSTYLE] Successfully parsed file <https://builds.apache.org/job/Atlas-0.8-IntegrationTests/ws/graphdb/common/target/checkstyle-result.xml>
with 5714 unique warnings and 0 duplicates.
[CHECKSTYLE] Successfully parsed file <https://builds.apache.org/job/Atlas-0.8-IntegrationTests/ws/graphdb/graphdb-impls/target/checkstyle-result.xml>
with 5714 unique warnings and 0 duplicates.
[CHECKSTYLE] Successfully parsed file <https://builds.apache.org/job/Atlas-0.8-IntegrationTests/ws/graphdb/target/checkstyle-result.xml>
with 5714 unique warnings and 0 duplicates.
[CHECKSTYLE] Successfully parsed file <https://builds.apache.org/job/Atlas-0.8-IntegrationTests/ws/graphdb/titan0/target/checkstyle-result.xml>
with 8169 unique warnings and 0 duplicates.
[CHECKSTYLE] Successfully parsed file <https://builds.apache.org/job/Atlas-0.8-IntegrationTests/ws/graphdb/titan1/target/checkstyle-result.xml>
with 9136 unique warnings and 0 duplicates.
[CHECKSTYLE] Successfully parsed file <https://builds.apache.org/job/Atlas-0.8-IntegrationTests/ws/intg/target/checkstyle-result.xml>
with 15850 unique warnings and 0 duplicates.
[CHECKSTYLE] Successfully parsed file <https://builds.apache.org/job/Atlas-0.8-IntegrationTests/ws/notification/target/checkstyle-result.xml>
with 17415 unique warnings and 0 duplicates.
[CHECKSTYLE] Successfully parsed file <https://builds.apache.org/job/Atlas-0.8-IntegrationTests/ws/repository/target/checkstyle-result.xml>
with 36354 unique warnings and 0 duplicates.
[CHECKSTYLE] Successfully parsed file <https://builds.apache.org/job/Atlas-0.8-IntegrationTests/ws/server-api/target/checkstyle-result.xml>
with 36747 unique warnings and 0 duplicates.
[CHECKSTYLE] Successfully parsed file <https://builds.apache.org/job/Atlas-0.8-IntegrationTests/ws/shaded/hbase-client-shaded/target/checkstyle-result.xml>
with 36747 unique warnings and 0 duplicates.
[CHECKSTYLE] Successfully parsed file <https://builds.apache.org/job/Atlas-0.8-IntegrationTests/ws/shaded/hbase-server-shaded/target/checkstyle-result.xml>
with 36747 unique warnings and 0 duplicates.
[CHECKSTYLE] Successfully parsed file <https://builds.apache.org/job/Atlas-0.8-IntegrationTests/ws/target/checkstyle-result.xml>
with 36747 unique warnings and 0 duplicates.
[CHECKSTYLE] Successfully parsed file <https://builds.apache.org/job/Atlas-0.8-IntegrationTests/ws/typesystem/target/checkstyle-result.xml>
with 40965 unique warnings and 0 duplicates.
<Git Blamer> Using GitBlamer to create author and commit information for all warnings.
<Git Blamer> GIT_COMMIT=2583d59ee39bb94ec5f14e02789ebf23c02ebe0f, workspace=<https://builds.apache.org/job/Atlas-0.8-IntegrationTests/ws/>
 > git rev-parse 2583d59ee39bb94ec5f14e02789ebf23c02ebe0f^{commit} # timeout=10
[FINDBUGS] Collecting findbugs analysis files...
[FINDBUGS] Searching for all files in <https://builds.apache.org/job/Atlas-0.8-IntegrationTests/ws/>
that match the pattern **/target/findbugs.xml
[FINDBUGS] Parsing 15 files in <https://builds.apache.org/job/Atlas-0.8-IntegrationTests/ws/>
[FINDBUGS] Successfully parsed file <https://builds.apache.org/job/Atlas-0.8-IntegrationTests/ws/authorization/target/findbugs.xml>
with 0 unique warnings and 0 duplicates.
[FINDBUGS] Successfully parsed file <https://builds.apache.org/job/Atlas-0.8-IntegrationTests/ws/catalog/target/findbugs.xml>
with 0 unique warnings and 0 duplicates.
[FINDBUGS] Successfully parsed file <https://builds.apache.org/job/Atlas-0.8-IntegrationTests/ws/client/client-v1/target/findbugs.xml>
with 0 unique warnings and 0 duplicates.
[FINDBUGS] Successfully parsed file <https://builds.apache.org/job/Atlas-0.8-IntegrationTests/ws/client/client-v2/target/findbugs.xml>
with 0 unique warnings and 0 duplicates.
[FINDBUGS] Successfully parsed file <https://builds.apache.org/job/Atlas-0.8-IntegrationTests/ws/client/common/target/findbugs.xml>
with 0 unique warnings and 0 duplicates.
[FINDBUGS] Successfully parsed file <https://builds.apache.org/job/Atlas-0.8-IntegrationTests/ws/common/target/findbugs.xml>
with 0 unique warnings and 0 duplicates.
[FINDBUGS] Successfully parsed file <https://builds.apache.org/job/Atlas-0.8-IntegrationTests/ws/graphdb/api/target/findbugs.xml>
with 0 unique warnings and 0 duplicates.
[FINDBUGS] Successfully parsed file <https://builds.apache.org/job/Atlas-0.8-IntegrationTests/ws/graphdb/common/target/findbugs.xml>
with 0 unique warnings and 0 duplicates.
[FINDBUGS] Successfully parsed file <https://builds.apache.org/job/Atlas-0.8-IntegrationTests/ws/graphdb/titan0/target/findbugs.xml>
with 0 unique warnings and 0 duplicates.
[FINDBUGS] Successfully parsed file <https://builds.apache.org/job/Atlas-0.8-IntegrationTests/ws/graphdb/titan1/target/findbugs.xml>
with 0 unique warnings and 0 duplicates.
[FINDBUGS] Successfully parsed file <https://builds.apache.org/job/Atlas-0.8-IntegrationTests/ws/intg/target/findbugs.xml>
with 0 unique warnings and 0 duplicates.
[FINDBUGS] Successfully parsed file <https://builds.apache.org/job/Atlas-0.8-IntegrationTests/ws/notification/target/findbugs.xml>
with 0 unique warnings and 0 duplicates.
[FINDBUGS] Successfully parsed file <https://builds.apache.org/job/Atlas-0.8-IntegrationTests/ws/repository/target/findbugs.xml>
with 0 unique warnings and 0 duplicates.
[FINDBUGS] Successfully parsed file <https://builds.apache.org/job/Atlas-0.8-IntegrationTests/ws/server-api/target/findbugs.xml>
with 0 unique warnings and 0 duplicates.
[FINDBUGS] Successfully parsed file <https://builds.apache.org/job/Atlas-0.8-IntegrationTests/ws/typesystem/target/findbugs.xml>
with 0 unique warnings and 0 duplicates.
<Git Blamer> Using GitBlamer to create author and commit information for all warnings.
<Git Blamer> GIT_COMMIT=2583d59ee39bb94ec5f14e02789ebf23c02ebe0f, workspace=<https://builds.apache.org/job/Atlas-0.8-IntegrationTests/ws/>
Archiving artifacts
[Fast Archiver] No prior successful build to compare, so performing full copy of artifacts
TestNG Reports Processing: START
Looking for TestNG results report in workspace using pattern: **/target/surefire-reports/testng-results.xml,**/target/failsafe-reports/testng-results.xml
Saving reports...
Processing '/x1/jenkins/jenkins-home/jobs/Atlas-0.8-IntegrationTests/builds/124/testng/testng-results.xml'
0.735294% of tests failed, which exceeded threshold of 0%. Marking build as UNSTABLE
TestNG Reports Processing: FINISH

Mime
View raw message