atlas-dev mailing list archives

Site index · List index
Message view « Date » · « Thread »
Top « Date » · « Thread »
From Apache Jenkins Server <jenk...@builds.apache.org>
Subject Build failed in Jenkins: Atlas-master-IntegrationTests #165
Date Wed, 25 Oct 2017 01:29:32 GMT
See <https://builds.apache.org/job/Atlas-master-IntegrationTests/165/display/redirect?page=changes>

Changes:

[ssubramanian] ATLAS-2223: Fix hbase-bridge and hbase-bridge-shim pom version from

[ssubramanian] ATLAS-2224: Fix Atlas build-tools dependency

[ssubramanian] ATLAS-2224: Fix Atlas build-tools dependency - part2

------------------------------------------
[...truncated 528.23 KB...]
127.0.0.1 - - [25/Oct/2017:01:01:46 +0000] "GET /api/atlas/v2/types/typedef/name/CXjQsQkhrU8
HTTP/1.1" 404 88 "-" "Java/1.8.0_144"
127.0.0.1 - - [25/Oct/2017:01:01:46 +0000] "POST /api/atlas/types HTTP/1.1" 201 105 "-" "Java/1.8.0_144"
127.0.0.1 - - [25/Oct/2017:01:01:46 +0000] "GET /api/atlas/types?type=CLASS&supertype=Arcg7r06YO9&notsupertype=BYAwFe9nLxO
HTTP/1.1" 200 109 "-" "Java/1.8.0_144"
127.0.0.1 - - [25/Oct/2017:01:01:46 +0000] "GET /api/atlas/types/database HTTP/1.1" 200 665
"-" "Java/1.8.0_144"
127.0.0.1 - - [25/Oct/2017:01:01:46 +0000] "GET /api/atlas/types/table HTTP/1.1" 200 1447
"-" "Java/1.8.0_144"
127.0.0.1 - - [25/Oct/2017:01:01:46 +0000] "GET /api/atlas/types/fetl HTTP/1.1" 200 495 "-"
"Java/1.8.0_144"
127.0.0.1 - - [25/Oct/2017:01:01:46 +0000] "POST /api/atlas/types HTTP/1.1" 201 104 "-" "Java/1.8.0_144"
127.0.0.1 - - [25/Oct/2017:01:01:46 +0000] "PUT /api/atlas/types HTTP/1.1" 200 104 "-" "Java/1.8.0_144"
127.0.0.1 - - [25/Oct/2017:01:01:47 +0000] "GET /api/atlas/types/Af5PuGebAb HTTP/1.1" 200
672 "-" "Java/1.8.0_144"
127.0.0.1 - - [25/Oct/2017:01:01:47 +0000] "GET /api/atlas/types/database HTTP/1.1" 200 665
"-" "Java/1.8.0_144"
127.0.0.1 - - [25/Oct/2017:01:01:47 +0000] "GET /api/atlas/types/table HTTP/1.1" 200 1447
"-" "Java/1.8.0_144"
127.0.0.1 - - [25/Oct/2017:01:01:47 +0000] "GET /api/atlas/types/fetl HTTP/1.1" 200 495 "-"
"Java/1.8.0_144"
127.0.0.1 - - [25/Oct/2017:01:01:47 +0000] "GET /api/atlas/types HTTP/1.1" 200 3616 "-" "Java/1.8.0_144"
127.0.0.1 - - [25/Oct/2017:01:01:47 +0000] "POST /api/atlas/types HTTP/1.1" 201 359 "-" "Java/1.8.0_144"
127.0.0.1 - - [25/Oct/2017:01:01:48 +0000] "GET /api/atlas/types HTTP/1.1" 200 3776 "-" "Java/1.8.0_144"
127.0.0.1 - - [25/Oct/2017:01:01:48 +0000] "POST /api/atlas/entities HTTP/1.1" 201 836 "-"
"Java/1.8.0_144"
127.0.0.1 - - [25/Oct/2017:01:01:48 +0000] "POST /api/atlas/entities HTTP/1.1" 201 1425 "-"
"Java/1.8.0_144"
127.0.0.1 - - [25/Oct/2017:01:01:48 +0000] "POST /api/atlas/entities HTTP/1.1" 201 1327 "-"
"Java/1.8.0_144"
127.0.0.1 - - [25/Oct/2017:01:01:48 +0000] "POST /api/atlas/entities HTTP/1.1" 201 1327 "-"
"Java/1.8.0_144"
127.0.0.1 - - [25/Oct/2017:01:01:48 +0000] "POST /api/atlas/entities HTTP/1.1" 201 1327 "-"
"Java/1.8.0_144"
127.0.0.1 - - [25/Oct/2017:01:01:48 +0000] "POST /api/atlas/entities HTTP/1.1" 201 847 "-"
"Java/1.8.0_144"
127.0.0.1 - - [25/Oct/2017:01:01:48 +0000] "POST /api/atlas/entities HTTP/1.1" 201 841 "-"
"Java/1.8.0_144"
127.0.0.1 - - [25/Oct/2017:01:01:48 +0000] "POST /api/atlas/entities HTTP/1.1" 201 1425 "-"
"Java/1.8.0_144"
127.0.0.1 - - [25/Oct/2017:01:01:48 +0000] "POST /api/atlas/entities HTTP/1.1" 201 1425 "-"
"Java/1.8.0_144"
127.0.0.1 - - [25/Oct/2017:01:01:48 +0000] "POST /api/atlas/entities HTTP/1.1" 201 1763 "-"
"Java/1.8.0_144"
127.0.0.1 - - [25/Oct/2017:01:01:48 +0000] "POST /api/atlas/entities HTTP/1.1" 201 1486 "-"
"Java/1.8.0_144"
127.0.0.1 - - [25/Oct/2017:01:01:48 +0000] "POST /api/atlas/entities HTTP/1.1" 201 1488 "-"
"Java/1.8.0_144"
127.0.0.1 - - [25/Oct/2017:01:01:48 +0000] "POST /api/atlas/entities HTTP/1.1" 201 1425 "-"
"Java/1.8.0_144"
127.0.0.1 - - [25/Oct/2017:01:01:48 +0000] "POST /api/atlas/entities HTTP/1.1" 201 1561 "-"
"Java/1.8.0_144"
127.0.0.1 - - [25/Oct/2017:01:01:48 +0000] "POST /api/atlas/entities HTTP/1.1" 201 1425 "-"
"Java/1.8.0_144"
127.0.0.1 - - [25/Oct/2017:01:01:49 +0000] "POST /api/atlas/entities HTTP/1.1" 201 1559 "-"
"Java/1.8.0_144"
127.0.0.1 - - [25/Oct/2017:01:01:49 +0000] "GET /api/atlas/discovery/search?query=from+DB_v1&limit=10&offset=0
HTTP/1.1" 200 2549 "-" "Java/1.8.0_144"
127.0.0.1 - - [25/Oct/2017:01:01:49 +0000] "GET /api/atlas/discovery/search?query=DB_v1&limit=10&offset=0
HTTP/1.1" 200 2544 "-" "Java/1.8.0_144"
127.0.0.1 - - [25/Oct/2017:01:01:50 +0000] "GET /api/atlas/discovery/search?query=DB_v1+where+name%3D%22Reporting%22&limit=10&offset=0
HTTP/1.1" 200 1700 "-" "Java/1.8.0_144"
127.0.0.1 - - [25/Oct/2017:01:01:51 +0000] "GET /api/atlas/discovery/search?query=DB_v1+where+DB_v1.name%3D%22Reporting%22&limit=10&offset=0
HTTP/1.1" 200 1706 "-" "Java/1.8.0_144"
127.0.0.1 - - [25/Oct/2017:01:01:52 +0000] "GET /api/atlas/discovery/search?query=DB_v1+name+%3D+%22Reporting%22&limit=10&offset=0
HTTP/1.1" 200 1696 "-" "Java/1.8.0_144"
127.0.0.1 - - [25/Oct/2017:01:01:52 +0000] "GET /api/atlas/discovery/search?query=DB_v1+DB_v1.name+%3D+%22Reporting%22&limit=10&offset=0
HTTP/1.1" 200 1702 "-" "Java/1.8.0_144"
127.0.0.1 - - [25/Oct/2017:01:01:53 +0000] "GET /api/atlas/discovery/search?query=DB_v1+where+name%3D%22Reporting%22+select+name,+owner&limit=10&offset=0
HTTP/1.1" 200 731 "-" "Java/1.8.0_144"
127.0.0.1 - - [25/Oct/2017:01:01:54 +0000] "GET /api/atlas/discovery/search?query=DB_v1+where+DB_v1.name%3D%22Reporting%22+select+name,+owner&limit=10&offset=0
HTTP/1.1" 200 737 "-" "Java/1.8.0_144"
127.0.0.1 - - [25/Oct/2017:01:01:56 +0000] "GET /api/atlas/discovery/search?query=DB_v1+has+name&limit=10&offset=0
HTTP/1.1" 200 2553 "-" "Java/1.8.0_144"
127.0.0.1 - - [25/Oct/2017:01:01:56 +0000] "GET /api/atlas/discovery/search?query=DB_v1+where+DB_v1+has+name&limit=10&offset=0
HTTP/1.1" 200 2565 "-" "Java/1.8.0_144"
127.0.0.1 - - [25/Oct/2017:01:01:57 +0000] "GET /api/atlas/discovery/search?query=DB_v1,+Table_v1&limit=10&offset=0
HTTP/1.1" 200 22842 "-" "Java/1.8.0_144"
127.0.0.1 - - [25/Oct/2017:01:01:58 +0000] "GET /api/atlas/discovery/search?query=DB_v1+is+JdbcAccess&limit=10&offset=0
HTTP/1.1" 200 433 "-" "Java/1.8.0_144"
127.0.0.1 - - [25/Oct/2017:01:01:58 +0000] "GET /api/atlas/discovery/search?query=from+Table_v1&limit=10&offset=0
HTTP/1.1" 200 22840 "-" "Java/1.8.0_144"
127.0.0.1 - - [25/Oct/2017:01:01:59 +0000] "GET /api/atlas/discovery/search?query=Table_v1&limit=10&offset=0
HTTP/1.1" 200 22835 "-" "Java/1.8.0_144"
127.0.0.1 - - [25/Oct/2017:01:01:59 +0000] "GET /api/atlas/discovery/search?query=Table_v1+is+Dimension_v1&limit=10&offset=0
HTTP/1.1" 200 9338 "-" "Java/1.8.0_144"
127.0.0.1 - - [25/Oct/2017:01:02:00 +0000] "GET /api/atlas/discovery/search?query=Column_v1+where+Column_v1+isa+PII_v1&limit=10&offset=0
HTTP/1.1" 200 3287 "-" "Java/1.8.0_144"
127.0.0.1 - - [25/Oct/2017:01:02:01 +0000] "GET /api/atlas/discovery/search?query=View_v1+is+Dimension_v1&limit=10&offset=0
HTTP/1.1" 200 2131 "-" "Java/1.8.0_144"
127.0.0.1 - - [25/Oct/2017:01:02:02 +0000] "GET /api/atlas/discovery/search?query=Column_v1+select+Column_v1.name&limit=10&offset=0
HTTP/1.1" 200 1182 "-" "Java/1.8.0_144"
127.0.0.1 - - [25/Oct/2017:01:02:03 +0000] "GET /api/atlas/discovery/search?query=Column_v1+select+name&limit=10&offset=0
HTTP/1.1" 200 1062 "-" "Java/1.8.0_144"
127.0.0.1 - - [25/Oct/2017:01:02:04 +0000] "GET /api/atlas/discovery/search?query=Column_v1+where+Column_v1.name%3D%22customer_id%22&limit=10&offset=0
HTTP/1.1" 200 2501 "-" "Java/1.8.0_144"
127.0.0.1 - - [25/Oct/2017:01:02:04 +0000] "GET /api/atlas/discovery/search?query=from+Table_v1+select+Table_v1.name&limit=10&offset=0
HTTP/1.1" 200 1082 "-" "Java/1.8.0_144"
127.0.0.1 - - [25/Oct/2017:01:02:05 +0000] "GET /api/atlas/discovery/search?query=DB_v1+where+(name+%3D+%22Reporting%22)&limit=10&offset=0
HTTP/1.1" 200 1704 "-" "Java/1.8.0_144"
127.0.0.1 - - [25/Oct/2017:01:02:06 +0000] "GET /api/atlas/discovery/search?query=DB_v1+where+(name+%3D+%22Reporting%22)+select+name+as+_col_0,+owner+as+_col_1&limit=10&offset=0
HTTP/1.1" 200 761 "-" "Java/1.8.0_144"
127.0.0.1 - - [25/Oct/2017:01:02:07 +0000] "GET /api/atlas/discovery/search?query=DB_v1+where+DB_v1+is+JdbcAccess_v1&limit=10&offset=0
HTTP/1.1" 200 1262 "-" "Java/1.8.0_144"
127.0.0.1 - - [25/Oct/2017:01:02:08 +0000] "GET /api/atlas/discovery/search?query=DB_v1+where+DB_v1+has+name&limit=10&offset=0
HTTP/1.1" 200 2565 "-" "Java/1.8.0_144"
127.0.0.1 - - [25/Oct/2017:01:02:09 +0000] "GET /api/atlas/discovery/search?query=DB_v1+Table_v1&limit=10&offset=0
HTTP/1.1" 200 22841 "-" "Java/1.8.0_144"
127.0.0.1 - - [25/Oct/2017:01:02:10 +0000] "GET /api/atlas/discovery/search?query=DB_v1+where+DB_v1+has+name&limit=10&offset=0
HTTP/1.1" 200 2565 "-" "Java/1.8.0_144"
127.0.0.1 - - [25/Oct/2017:01:02:10 +0000] "GET /api/atlas/discovery/search?query=DB_v1+as+db1+Table+where+(db1.name+%3D+%22Reporting%22)&limit=10&offset=0
HTTP/1.1" 200 1202 "-" "Java/1.8.0_144"
127.0.0.1 - - [25/Oct/2017:01:02:10 +0000] "GET /api/atlas/discovery/search?query=DB_v1+where+(name+%3D+%22Reporting%22)+select+name+as+_col_0,+(createTime+%2B+1)+as+_col_1+&limit=10&offset=0
HTTP/1.1" 200 774 "-" "Java/1.8.0_144"
127.0.0.1 - - [25/Oct/2017:01:02:12 +0000] "GET /api/atlas/discovery/search?query=Dimension_v1&limit=10&offset=0
HTTP/1.1" 200 1640 "-" "Java/1.8.0_144"
127.0.0.1 - - [25/Oct/2017:01:02:13 +0000] "GET /api/atlas/discovery/search?query=JdbcAccess_v1&limit=10&offset=0
HTTP/1.1" 200 1039 "-" "Java/1.8.0_144"
127.0.0.1 - - [25/Oct/2017:01:02:13 +0000] "GET /api/atlas/discovery/search?query=ETL_v1&limit=10&offset=0
HTTP/1.1" 200 1246 "-" "Java/1.8.0_144"
127.0.0.1 - - [25/Oct/2017:01:02:14 +0000] "GET /api/atlas/discovery/search?query=Metric_v1&limit=10&offset=0
HTTP/1.1" 200 1639 "-" "Java/1.8.0_144"
127.0.0.1 - - [25/Oct/2017:01:02:15 +0000] "GET /api/atlas/discovery/search?query=PII_v1&limit=10&offset=0
HTTP/1.1" 200 1837 "-" "Java/1.8.0_144"
127.0.0.1 - - [25/Oct/2017:01:02:16 +0000] "GET /api/atlas/discovery/search?query=%60Log+Data_v1%60&limit=10&offset=0
HTTP/1.1" 200 1443 "-" "Java/1.8.0_144"
127.0.0.1 - - [25/Oct/2017:01:02:16 +0000] "GET /api/atlas/discovery/search?query=Table_v1+where+name%3D%22sales_fact%22,+columns&limit=10&offset=0
HTTP/1.1" 200 2398 "-" "Java/1.8.0_144"
127.0.0.1 - - [25/Oct/2017:01:02:17 +0000] "GET /api/atlas/discovery/search?query=Table_v1+where+name%3D%22sales_fact%22,+columns+as+column+select+column.name,+column.dataType,+column.comment&limit=10&offset=0
HTTP/1.1" 200 1403 "-" "Java/1.8.0_144"
127.0.0.1 - - [25/Oct/2017:01:02:19 +0000] "GET /api/atlas/discovery/search?query=from+DataSet&limit=10&offset=0
HTTP/1.1" 200 70287 "-" "Java/1.8.0_144"
127.0.0.1 - - [25/Oct/2017:01:02:20 +0000] "GET /api/atlas/discovery/search?query=from+Process&limit=10&offset=0
HTTP/1.1" 200 8567 "-" "Java/1.8.0_144"
127.0.0.1 - - [25/Oct/2017:01:02:20 +0000] "GET /api/atlas/entities?type=DB_v1&property=name&value=Sales
HTTP/1.1" 200 693 "-" "Java/1.8.0_144"
127.0.0.1 - - [25/Oct/2017:01:02:20 +0000] "GET /api/atlas/entities?type=Table_v1&property=qualifiedName&value=sales_fact
HTTP/1.1" 200 4145 "-" "Java/1.8.0_144"
127.0.0.1 - - [25/Oct/2017:01:02:20 +0000] "GET /api/atlas/entities?type=Table_v1&property=qualifiedName&value=time_dim
HTTP/1.1" 200 3373 "-" "Java/1.8.0_144"
127.0.0.1 - - [25/Oct/2017:01:02:20 +0000] "GET /api/atlas/entities?type=Table_v1&property=qualifiedName&value=sales_fact_daily_mv
HTTP/1.1" 200 4190 "-" "Java/1.8.0_144"
127.0.0.1 - - [25/Oct/2017:01:02:20 +0000] "GET /api/atlas/lineage/hive/table/sales_fact_daily_mv/inputs/graph
HTTP/1.1" 200 1792 "-" "Java/1.8.0_144"
127.0.0.1 - - [25/Oct/2017:01:02:22 +0000] "GET /api/atlas/entities?type=LoadProcess_v1&property=qualifiedName&value=loadSalesDaily
HTTP/1.1" 200 1491 "-" "Java/1.8.0_144"
127.0.0.1 - - [25/Oct/2017:01:02:22 +0000] "GET /api/atlas/entities?type=Table_v1&property=qualifiedName&value=sales_fact
HTTP/1.1" 200 4145 "-" "Java/1.8.0_144"
127.0.0.1 - - [25/Oct/2017:01:02:22 +0000] "GET /api/atlas/entities?type=Table_v1&property=qualifiedName&value=time_dim
HTTP/1.1" 200 3373 "-" "Java/1.8.0_144"
127.0.0.1 - - [25/Oct/2017:01:02:22 +0000] "GET /api/atlas/entities?type=Table_v1&property=qualifiedName&value=sales_fact_daily_mv
HTTP/1.1" 200 4190 "-" "Java/1.8.0_144"
127.0.0.1 - - [25/Oct/2017:01:02:22 +0000] "GET /api/atlas/entities?type=Table_v1&property=qualifiedName&value=sales_fact
HTTP/1.1" 200 4145 "-" "Java/1.8.0_144"
127.0.0.1 - - [25/Oct/2017:01:02:22 +0000] "GET /api/atlas/entities?type=DB_v1&property=name&value=Sales
HTTP/1.1" 200 693 "-" "Java/1.8.0_144"
127.0.0.1 - - [25/Oct/2017:01:02:22 +0000] "GET /api/atlas/entities?type=View_v1&property=qualifiedName&value=product_dim_view
HTTP/1.1" 200 1292 "-" "Java/1.8.0_144"
127.0.0.1 - - [25/Oct/2017:01:02:23 +0000] "GET /api/atlas/entities?type=Table_v1&property=qualifiedName&value=product_dim
HTTP/1.1" 200 3399 "-" "Java/1.8.0_144"
127.0.0.1 - - [25/Oct/2017:01:02:23 +0000] "POST /api/atlas/v2/types/typedefs HTTP/1.1" 409
85 "-" "Java/1.8.0_144"
Tests run: 137, Failures: 2, Errors: 0, Skipped: 5, Time elapsed: 126.601 sec <<<
FAILURE! - in TestSuite
testSimpleLoginAndAuthorizationWithValidCrendentialsAndInvalidAccessToResource(org.apache.atlas.web.filters.AtlasAuthenticationSimpleFilterIT)
 Time elapsed: 0.015 sec  <<< FAILURE!
java.lang.AssertionError: expected [403] but found [500]
	at org.testng.Assert.fail(Assert.java:94)
	at org.testng.Assert.failNotEquals(Assert.java:496)
	at org.testng.Assert.assertEquals(Assert.java:125)
	at org.testng.Assert.assertEquals(Assert.java:372)
	at org.testng.Assert.assertEquals(Assert.java:382)
	at org.apache.atlas.web.filters.AtlasAuthenticationSimpleFilterIT.testSimpleLoginAndAuthorizationWithValidCrendentialsAndInvalidAccessToResource(AtlasAuthenticationSimpleFilterIT.java:74)

runQuickStart(org.apache.atlas.examples.QuickStartV2IT)  Time elapsed: 0.499 sec  <<<
FAILURE!
org.apache.atlas.AtlasServiceException: Metadata service API org.apache.atlas.AtlasClientV2$API_V2@8647294
failed with status 409 (Conflict) Response Body ({"errorCode":"ATLAS-409-00-001","errorMessage":"Given
type Dimension already exists"})
	at org.apache.atlas.AtlasBaseClient.callAPIWithResource(AtlasBaseClient.java:387)
	at org.apache.atlas.AtlasBaseClient.callAPIWithResource(AtlasBaseClient.java:320)
	at org.apache.atlas.AtlasBaseClient.callAPI(AtlasBaseClient.java:208)
	at org.apache.atlas.AtlasClientV2.createAtlasTypeDefs(AtlasClientV2.java:223)
	at org.apache.atlas.examples.QuickStartV2.createTypes(QuickStartV2.java:191)
	at org.apache.atlas.examples.QuickStartV2.runQuickstart(QuickStartV2.java:147)
	at org.apache.atlas.examples.QuickStartV2IT.runQuickStart(QuickStartV2IT.java:49)


Results :

Failed tests: 
  QuickStartV2IT.runQuickStart:49 ยป AtlasService Metadata service API org.apache...
  AtlasAuthenticationSimpleFilterIT.testSimpleLoginAndAuthorizationWithValidCrendentialsAndInvalidAccessToResource:74
expected [403] but found [500]

Tests run: 137, Failures: 2, Errors: 0, Skipped: 5

[INFO] 
[INFO] --- jetty-maven-plugin:9.4.0.v20161208:stop (stop-jetty) @ atlas-webapp ---
[INFO] Waiting 10 seconds for jetty to stop
[INFO] Stopped ServerConnector@3da87e52{HTTP/1.1,[http/1.1]}{0.0.0.0:31000}
[INFO] Stopped scavenging
[INFO] Closing Spring root WebApplicationContext
[INFO] Shutting down log4j
[INFO] Stopped o.e.j.m.p.JettyWebAppContext@e9285d5{/,file://<https://builds.apache.org/job/Atlas-master-IntegrationTests/ws/webapp/target/atlas-webapp-1.0.0-SNAPSHOT/,UNAVAILABLE}{/home/jenkins/jenkins-slave/workspace/Atlas-master-IntegrationTests/webapp/target/atlas-webapp-1.0.0-SNAPSHOT.war}>
[INFO] Server reports itself as stopped
[INFO] 
[INFO] --- maven-source-plugin:2.4:jar-no-fork (attach-sources) @ atlas-webapp ---
[INFO] Building jar: <https://builds.apache.org/job/Atlas-master-IntegrationTests/ws/webapp/target/atlas-webapp-1.0.0-SNAPSHOT-sources.jar>
log4j:WARN No appenders could be found for logger (org.apache.zookeeper.ClientCnxn).
log4j:WARN Please initialize the log4j system properly.
log4j:WARN See http://logging.apache.org/log4j/1.2/faq.html#noconfig for more info.
[INFO] 
[INFO] --- maven-source-plugin:2.4:test-jar-no-fork (attach-sources) @ atlas-webapp ---
[INFO] Building jar: <https://builds.apache.org/job/Atlas-master-IntegrationTests/ws/webapp/target/atlas-webapp-1.0.0-SNAPSHOT-test-sources.jar>
[INFO] 
[INFO] --- maven-failsafe-plugin:2.18.1:verify (verify) @ atlas-webapp ---
[INFO] Failsafe report directory: <https://builds.apache.org/job/Atlas-master-IntegrationTests/ws/webapp/target/failsafe-reports>
[INFO] ------------------------------------------------------------------------
[INFO] Reactor Summary:
[INFO] 
[INFO] Apache Atlas Server Build Tools .................... SUCCESS [  1.043 s]
[INFO] apache-atlas ....................................... SUCCESS [  5.432 s]
[INFO] Apache Atlas Integration ........................... SUCCESS [ 23.910 s]
[INFO] Apache Atlas Common ................................ SUCCESS [  9.474 s]
[INFO] Apache Atlas Typesystem ............................ SUCCESS [ 52.702 s]
[INFO] Apache Atlas Client ................................ SUCCESS [  0.747 s]
[INFO] atlas-client-common ................................ SUCCESS [  8.485 s]
[INFO] atlas-client-v1 .................................... SUCCESS [  8.481 s]
[INFO] Apache Atlas Server API ............................ SUCCESS [  6.919 s]
[INFO] Apache Atlas Notification .......................... SUCCESS [ 11.062 s]
[INFO] atlas-client-v2 .................................... SUCCESS [  6.387 s]
[INFO] Apache Atlas Graph Database Projects ............... SUCCESS [  0.452 s]
[INFO] Apache Atlas Graph Database API .................... SUCCESS [  5.745 s]
[INFO] Graph Database Common Code ......................... SUCCESS [  5.656 s]
[INFO] Apache Atlas Titan 1.0.0 GraphDB Impl .............. SUCCESS [ 36.111 s]
[INFO] Shaded version of Apache hbase client .............. SUCCESS [  7.977 s]
[INFO] Apache Atlas Titan 0.5.4 Graph DB Impl ............. SUCCESS [ 37.591 s]
[INFO] Apache Atlas Graph Database Implementation Dependencies SUCCESS [  0.583 s]
[INFO] Shaded version of Apache hbase server .............. SUCCESS [ 21.343 s]
[INFO] Apache Atlas Repository ............................ SUCCESS [01:27 min]
[INFO] Apache Atlas Authorization ......................... SUCCESS [  7.599 s]
[INFO] Apache Atlas UI .................................... SUCCESS [01:24 min]
[INFO] Apache Atlas Web Application ....................... FAILURE [03:25 min]
[INFO] Apache Atlas Documentation ......................... SKIPPED
[INFO] Apache Atlas FileSystem Model ...................... SKIPPED
[INFO] Apache Atlas Plugin Classloader .................... SKIPPED
[INFO] Apache Atlas Hive Bridge Shim ...................... SKIPPED
[INFO] Apache Atlas Hive Bridge ........................... SKIPPED
[INFO] Apache Atlas Falcon Bridge Shim .................... SKIPPED
[INFO] Apache Atlas Falcon Bridge ......................... SKIPPED
[INFO] Apache Atlas Sqoop Bridge Shim ..................... SKIPPED
[INFO] Apache Atlas Sqoop Bridge .......................... SKIPPED
[INFO] Apache Atlas Storm Bridge Shim ..................... SKIPPED
[INFO] Apache Atlas Storm Bridge .......................... SKIPPED
[INFO] Apache Atlas Hbase Bridge Shim ..................... SKIPPED
[INFO] Apache Atlas Hbase Bridge .......................... SKIPPED
[INFO] Apache Atlas Distribution .......................... SKIPPED
[INFO] ------------------------------------------------------------------------
[INFO] BUILD FAILURE
[INFO] ------------------------------------------------------------------------
[INFO] Total time: 10:37 min
[INFO] Finished at: 2017-10-25T01:02:27Z
[INFO] Final Memory: 381M/2676M
[INFO] ------------------------------------------------------------------------
[ERROR] Failed to execute goal org.apache.maven.plugins:maven-failsafe-plugin:2.18.1:verify
(verify) on project atlas-webapp: There are test failures.
[ERROR] 
[ERROR] Please refer to <https://builds.apache.org/job/Atlas-master-IntegrationTests/ws/webapp/target/failsafe-reports>
for the individual test results.
[ERROR] -> [Help 1]
[ERROR] 
[ERROR] To see the full stack trace of the errors, re-run Maven with the -e switch.
[ERROR] Re-run Maven using the -X switch to enable full debug logging.
[ERROR] 
[ERROR] For more information about the errors and possible solutions, please read the following
articles:
[ERROR] [Help 1] http://cwiki.apache.org/confluence/display/MAVEN/MojoFailureException
[ERROR] 
[ERROR] After correcting the problems, you can resume the build with the command
[ERROR]   mvn <goals> -rf :atlas-webapp
Build step 'Execute shell' marked build as failure
[CHECKSTYLE] Collecting checkstyle analysis files...
[CHECKSTYLE] Searching for all files in <https://builds.apache.org/job/Atlas-master-IntegrationTests/ws/>
that match the pattern **/target/checkstyle-result.xml
[CHECKSTYLE] Parsing 21 files in <https://builds.apache.org/job/Atlas-master-IntegrationTests/ws/>
[CHECKSTYLE] Successfully parsed file <https://builds.apache.org/job/Atlas-master-IntegrationTests/ws/authorization/target/checkstyle-result.xml>
with 461 unique warnings and 0 duplicates.
[CHECKSTYLE] Successfully parsed file <https://builds.apache.org/job/Atlas-master-IntegrationTests/ws/client/client-v1/target/checkstyle-result.xml>
with 1336 unique warnings and 0 duplicates.
[CHECKSTYLE] Successfully parsed file <https://builds.apache.org/job/Atlas-master-IntegrationTests/ws/client/client-v2/target/checkstyle-result.xml>
with 1676 unique warnings and 0 duplicates.
[CHECKSTYLE] Successfully parsed file <https://builds.apache.org/job/Atlas-master-IntegrationTests/ws/client/common/target/checkstyle-result.xml>
with 2166 unique warnings and 0 duplicates.
[CHECKSTYLE] Successfully parsed file <https://builds.apache.org/job/Atlas-master-IntegrationTests/ws/client/target/checkstyle-result.xml>
with 2166 unique warnings and 0 duplicates.
[CHECKSTYLE] Successfully parsed file <https://builds.apache.org/job/Atlas-master-IntegrationTests/ws/common/target/checkstyle-result.xml>
with 3131 unique warnings and 0 duplicates.
[CHECKSTYLE] Successfully parsed file <https://builds.apache.org/job/Atlas-master-IntegrationTests/ws/dashboardv2/target/checkstyle-result.xml>
with 3131 unique warnings and 0 duplicates.
[CHECKSTYLE] Successfully parsed file <https://builds.apache.org/job/Atlas-master-IntegrationTests/ws/graphdb/api/target/checkstyle-result.xml>
with 3404 unique warnings and 0 duplicates.
[CHECKSTYLE] Successfully parsed file <https://builds.apache.org/job/Atlas-master-IntegrationTests/ws/graphdb/common/target/checkstyle-result.xml>
with 3591 unique warnings and 0 duplicates.
[CHECKSTYLE] Successfully parsed file <https://builds.apache.org/job/Atlas-master-IntegrationTests/ws/graphdb/graphdb-impls/target/checkstyle-result.xml>
with 3591 unique warnings and 0 duplicates.
[CHECKSTYLE] Successfully parsed file <https://builds.apache.org/job/Atlas-master-IntegrationTests/ws/graphdb/target/checkstyle-result.xml>
with 3591 unique warnings and 0 duplicates.
[CHECKSTYLE] Successfully parsed file <https://builds.apache.org/job/Atlas-master-IntegrationTests/ws/graphdb/titan0/target/checkstyle-result.xml>
with 6046 unique warnings and 0 duplicates.
[CHECKSTYLE] Successfully parsed file <https://builds.apache.org/job/Atlas-master-IntegrationTests/ws/graphdb/titan1/target/checkstyle-result.xml>
with 7013 unique warnings and 0 duplicates.
[CHECKSTYLE] Successfully parsed file <https://builds.apache.org/job/Atlas-master-IntegrationTests/ws/intg/target/checkstyle-result.xml>
with 15219 unique warnings and 0 duplicates.
[CHECKSTYLE] Successfully parsed file <https://builds.apache.org/job/Atlas-master-IntegrationTests/ws/notification/target/checkstyle-result.xml>
with 16784 unique warnings and 0 duplicates.
[CHECKSTYLE] Successfully parsed file <https://builds.apache.org/job/Atlas-master-IntegrationTests/ws/repository/target/checkstyle-result.xml>
with 37098 unique warnings and 0 duplicates.
[CHECKSTYLE] Successfully parsed file <https://builds.apache.org/job/Atlas-master-IntegrationTests/ws/server-api/target/checkstyle-result.xml>
with 37491 unique warnings and 0 duplicates.
[CHECKSTYLE] Successfully parsed file <https://builds.apache.org/job/Atlas-master-IntegrationTests/ws/shaded/hbase-client-shaded/target/checkstyle-result.xml>
with 37491 unique warnings and 0 duplicates.
[CHECKSTYLE] Successfully parsed file <https://builds.apache.org/job/Atlas-master-IntegrationTests/ws/shaded/hbase-server-shaded/target/checkstyle-result.xml>
with 37491 unique warnings and 0 duplicates.
[CHECKSTYLE] Successfully parsed file <https://builds.apache.org/job/Atlas-master-IntegrationTests/ws/target/checkstyle-result.xml>
with 37491 unique warnings and 0 duplicates.
[CHECKSTYLE] Successfully parsed file <https://builds.apache.org/job/Atlas-master-IntegrationTests/ws/typesystem/target/checkstyle-result.xml>
with 41709 unique warnings and 0 duplicates.
<Git Blamer> Using GitBlamer to create author and commit information for all warnings.
<Git Blamer> GIT_COMMIT=ea52e1f33910d687a316cb2f6feaa7e966812393, workspace=<https://builds.apache.org/job/Atlas-master-IntegrationTests/ws/>
 > git rev-parse ea52e1f33910d687a316cb2f6feaa7e966812393^{commit} # timeout=10
[FINDBUGS] Collecting findbugs analysis files...
[FINDBUGS] Searching for all files in <https://builds.apache.org/job/Atlas-master-IntegrationTests/ws/>
that match the pattern **/target/findbugs.xml
[FINDBUGS] Parsing 14 files in <https://builds.apache.org/job/Atlas-master-IntegrationTests/ws/>
[FINDBUGS] Successfully parsed file <https://builds.apache.org/job/Atlas-master-IntegrationTests/ws/authorization/target/findbugs.xml>
with 0 unique warnings and 0 duplicates.
[FINDBUGS] Successfully parsed file <https://builds.apache.org/job/Atlas-master-IntegrationTests/ws/client/client-v1/target/findbugs.xml>
with 0 unique warnings and 0 duplicates.
[FINDBUGS] Successfully parsed file <https://builds.apache.org/job/Atlas-master-IntegrationTests/ws/client/client-v2/target/findbugs.xml>
with 0 unique warnings and 0 duplicates.
[FINDBUGS] Successfully parsed file <https://builds.apache.org/job/Atlas-master-IntegrationTests/ws/client/common/target/findbugs.xml>
with 0 unique warnings and 0 duplicates.
[FINDBUGS] Successfully parsed file <https://builds.apache.org/job/Atlas-master-IntegrationTests/ws/common/target/findbugs.xml>
with 0 unique warnings and 0 duplicates.
[FINDBUGS] Successfully parsed file <https://builds.apache.org/job/Atlas-master-IntegrationTests/ws/graphdb/api/target/findbugs.xml>
with 0 unique warnings and 0 duplicates.
[FINDBUGS] Successfully parsed file <https://builds.apache.org/job/Atlas-master-IntegrationTests/ws/graphdb/common/target/findbugs.xml>
with 0 unique warnings and 0 duplicates.
[FINDBUGS] Successfully parsed file <https://builds.apache.org/job/Atlas-master-IntegrationTests/ws/graphdb/titan0/target/findbugs.xml>
with 0 unique warnings and 0 duplicates.
[FINDBUGS] Successfully parsed file <https://builds.apache.org/job/Atlas-master-IntegrationTests/ws/graphdb/titan1/target/findbugs.xml>
with 0 unique warnings and 0 duplicates.
[FINDBUGS] Successfully parsed file <https://builds.apache.org/job/Atlas-master-IntegrationTests/ws/intg/target/findbugs.xml>
with 0 unique warnings and 0 duplicates.
[FINDBUGS] Successfully parsed file <https://builds.apache.org/job/Atlas-master-IntegrationTests/ws/notification/target/findbugs.xml>
with 0 unique warnings and 0 duplicates.
[FINDBUGS] Successfully parsed file <https://builds.apache.org/job/Atlas-master-IntegrationTests/ws/repository/target/findbugs.xml>
with 0 unique warnings and 0 duplicates.
[FINDBUGS] Successfully parsed file <https://builds.apache.org/job/Atlas-master-IntegrationTests/ws/server-api/target/findbugs.xml>
with 0 unique warnings and 0 duplicates.
[FINDBUGS] Successfully parsed file <https://builds.apache.org/job/Atlas-master-IntegrationTests/ws/typesystem/target/findbugs.xml>
with 0 unique warnings and 0 duplicates.
<Git Blamer> Using GitBlamer to create author and commit information for all warnings.
<Git Blamer> GIT_COMMIT=ea52e1f33910d687a316cb2f6feaa7e966812393, workspace=<https://builds.apache.org/job/Atlas-master-IntegrationTests/ws/>
Archiving artifacts
[Fast Archiver] No prior successful build to compare, so performing full copy of artifacts
TestNG Reports Processing: START
Looking for TestNG results report in workspace using pattern: **/target/surefire-reports/testng-results.xml,**/target/failsafe-reports/testng-results.xml
Saving reports...
Processing '/x1/jenkins/jenkins-home/jobs/Atlas-master-IntegrationTests/builds/165/testng/testng-results.xml'
0.735294% of tests failed, which exceeded threshold of 0%. Marking build as UNSTABLE
TestNG Reports Processing: FINISH

Mime
View raw message