atlas-dev mailing list archives

Site index · List index
Message view « Date » · « Thread »
Top « Date » · « Thread »
From Apache Jenkins Server <jenk...@builds.apache.org>
Subject Build failed in Jenkins: Atlas-0.8-IntegrationTests #116
Date Sat, 21 Oct 2017 01:16:22 GMT
See <https://builds.apache.org/job/Atlas-0.8-IntegrationTests/116/display/redirect?page=changes>

Changes:

[madhan] ATLAS-2220: Active state change listener order made predictable

------------------------------------------
[...truncated 88.63 MB...]
	at org.apache.atlas.hive.HiveITBase.waitFor(HiveITBase.java:198)
	at org.apache.atlas.hive.hook.HiveHookIT.assertEntityIsNotRegistered(HiveHookIT.java:1806)
	at org.apache.atlas.hive.hook.HiveHookIT.assertDBIsNotRegistered(HiveHookIT.java:1798)
	at org.apache.atlas.hive.hook.HiveHookIT.testDropDatabaseWithCascade(HiveHookIT.java:1470)

testDropTable(org.apache.atlas.hive.hook.HiveHookIT)  Time elapsed: 5.11 sec  <<<
FAILURE!
java.lang.AssertionError: Assertions failed. Failing after waiting for timeout 1000 msecs
	at org.apache.atlas.AtlasBaseClient.callAPIWithResource(AtlasBaseClient.java:371)
	at org.apache.atlas.AtlasBaseClient.callAPIWithResource(AtlasBaseClient.java:311)
	at org.apache.atlas.AtlasBaseClient.callAPIWithRetries(AtlasBaseClient.java:446)
	at org.apache.atlas.AtlasClient.callAPIWithRetries(AtlasClient.java:967)
	at org.apache.atlas.AtlasClient.getEntity(AtlasClient.java:651)
	at org.apache.atlas.hive.HiveITBase$1.evaluate(HiveITBase.java:161)
	at org.apache.atlas.hive.HiveITBase.waitFor(HiveITBase.java:198)
	at org.apache.atlas.hive.HiveITBase.assertEntityIsRegistered(HiveITBase.java:158)
	at org.apache.atlas.hive.HiveITBase.assertTableIsRegistered(HiveITBase.java:152)
	at org.apache.atlas.hive.HiveITBase.assertTableIsRegistered(HiveITBase.java:146)
	at org.apache.atlas.hive.hook.HiveHookIT.testDropTable(HiveHookIT.java:1416)

testDropView(org.apache.atlas.hive.hook.HiveHookIT)  Time elapsed: 5.185 sec  <<<
FAILURE!
java.lang.AssertionError: Assertions failed. Failing after waiting for timeout 1000 msecs
	at org.apache.atlas.AtlasBaseClient.callAPIWithResource(AtlasBaseClient.java:371)
	at org.apache.atlas.AtlasBaseClient.callAPIWithResource(AtlasBaseClient.java:311)
	at org.apache.atlas.AtlasBaseClient.callAPIWithRetries(AtlasBaseClient.java:446)
	at org.apache.atlas.AtlasClient.callAPIWithRetries(AtlasClient.java:967)
	at org.apache.atlas.AtlasClient.getEntity(AtlasClient.java:651)
	at org.apache.atlas.hive.HiveITBase$1.evaluate(HiveITBase.java:161)
	at org.apache.atlas.hive.HiveITBase.waitFor(HiveITBase.java:198)
	at org.apache.atlas.hive.HiveITBase.assertEntityIsRegistered(HiveITBase.java:158)
	at org.apache.atlas.hive.HiveITBase.assertTableIsRegistered(HiveITBase.java:152)
	at org.apache.atlas.hive.HiveITBase.assertTableIsRegistered(HiveITBase.java:146)
	at org.apache.atlas.hive.hook.HiveHookIT.testDropView(HiveHookIT.java:1526)

testLoadDFSPathPartitioned(org.apache.atlas.hive.hook.HiveHookIT)  Time elapsed: 5.385 sec
 <<< FAILURE!
java.lang.AssertionError: expected [0] but found [40000]
	at org.testng.Assert.fail(Assert.java:94)
	at org.testng.Assert.failNotEquals(Assert.java:496)
	at org.testng.Assert.assertEquals(Assert.java:125)
	at org.testng.Assert.assertEquals(Assert.java:372)
	at org.testng.Assert.assertEquals(Assert.java:382)
	at org.apache.atlas.hive.HiveITBase.runCommandWithDelay(HiveITBase.java:120)
	at org.apache.atlas.hive.HiveITBase.runCommandWithDelay(HiveITBase.java:113)
	at org.apache.atlas.hive.HiveITBase.runCommand(HiveITBase.java:105)
	at org.apache.atlas.hive.hook.HiveHookIT.testLoadDFSPathPartitioned(HiveHookIT.java:452)

testLoadLocalPath(org.apache.atlas.hive.hook.HiveHookIT)  Time elapsed: 0.048 sec  <<<
FAILURE!
java.lang.AssertionError: expected [0] but found [40000]
	at org.testng.Assert.fail(Assert.java:94)
	at org.testng.Assert.failNotEquals(Assert.java:496)
	at org.testng.Assert.assertEquals(Assert.java:125)
	at org.testng.Assert.assertEquals(Assert.java:372)
	at org.testng.Assert.assertEquals(Assert.java:382)
	at org.apache.atlas.hive.HiveITBase.runCommandWithDelay(HiveITBase.java:120)
	at org.apache.atlas.hive.HiveITBase.runCommandWithDelay(HiveITBase.java:113)
	at org.apache.atlas.hive.HiveITBase.runCommand(HiveITBase.java:105)
	at org.apache.atlas.hive.hook.HiveHookIT.testLoadLocalPath(HiveHookIT.java:428)

testLoadLocalPathIntoPartition(org.apache.atlas.hive.hook.HiveHookIT)  Time elapsed: 0.041
sec  <<< FAILURE!
java.lang.AssertionError: expected [0] but found [40000]
	at org.testng.Assert.fail(Assert.java:94)
	at org.testng.Assert.failNotEquals(Assert.java:496)
	at org.testng.Assert.assertEquals(Assert.java:125)
	at org.testng.Assert.assertEquals(Assert.java:372)
	at org.testng.Assert.assertEquals(Assert.java:382)
	at org.apache.atlas.hive.HiveITBase.runCommandWithDelay(HiveITBase.java:120)
	at org.apache.atlas.hive.HiveITBase.runCommandWithDelay(HiveITBase.java:113)
	at org.apache.atlas.hive.HiveITBase.runCommand(HiveITBase.java:105)
	at org.apache.atlas.hive.hook.HiveHookIT.testLoadLocalPathIntoPartition(HiveHookIT.java:439)


Results :

Failed tests: 
  HiveHookIT.testAlterDBOwner:1569->HiveITBase.assertDatabaseIsRegistered:237->HiveITBase.assertDatabaseIsRegistered:243->HiveITBase.assertEntityIsRegistered:158->HiveITBase.waitFor:202
Assertions failed. Failing after waiting for timeout 1000 msecs
  HiveHookIT.testAlterDBProperties:1589->testAlterProperties:1610->verifyEntityProperties:1652->HiveITBase.assertDatabaseIsRegistered:243->HiveITBase.assertEntityIsRegistered:158->HiveITBase.waitFor:202
Assertions failed. Failing after waiting for timeout 1000 msecs
  HiveHookIT.testAlterTableAddColumn:966->assertColumnIsRegistered:278->assertColumnIsRegistered:283->HiveITBase.assertEntityIsRegistered:158->HiveITBase.waitFor:202
Assertions failed. Failing after waiting for timeout 1000 msecs
  HiveHookIT.testAlterTableBucketingClusterSort:1353->runBucketSortQuery:1365->assertTableIsRegistered:1802->HiveITBase.assertTableIsRegistered:152->HiveITBase.assertEntityIsRegistered:158->HiveITBase.waitFor:202
Assertions failed. Failing after waiting for timeout 1000 msecs
  HiveHookIT.testDropDatabaseWithCascade:1470->assertDBIsNotRegistered:1798->assertEntityIsNotRegistered:1806->HiveITBase.waitFor:202
Assertions failed. Failing after waiting for timeout 1000 msecs
  HiveHookIT.testDropTable:1416->HiveITBase.assertTableIsRegistered:146->HiveITBase.assertTableIsRegistered:152->HiveITBase.assertEntityIsRegistered:158->HiveITBase.waitFor:202
Assertions failed. Failing after waiting for timeout 1000 msecs
  HiveHookIT.testDropView:1526->HiveITBase.assertTableIsRegistered:146->HiveITBase.assertTableIsRegistered:152->HiveITBase.assertEntityIsRegistered:158->HiveITBase.waitFor:202
Assertions failed. Failing after waiting for timeout 1000 msecs
  HiveHookIT.testLoadDFSPathPartitioned:452->HiveITBase.runCommand:105->HiveITBase.runCommandWithDelay:113->HiveITBase.runCommandWithDelay:120
expected [0] but found [40000]
  HiveHookIT.testLoadLocalPath:428->HiveITBase.runCommand:105->HiveITBase.runCommandWithDelay:113->HiveITBase.runCommandWithDelay:120
expected [0] but found [40000]
  HiveHookIT.testLoadLocalPathIntoPartition:439->HiveITBase.runCommand:105->HiveITBase.runCommandWithDelay:113->HiveITBase.runCommandWithDelay:120
expected [0] but found [40000]

Tests run: 45, Failures: 10, Errors: 0, Skipped: 0

[INFO] 
[INFO] --- jetty-maven-plugin:9.2.12.v20150709:stop (stop-jetty) @ hive-bridge ---
[INFO] Waiting 10 seconds for jetty to stop
[INFO] Stopped ServerConnector@3d7166d7{HTTP/1.1}{0.0.0.0:31000}
[INFO] Closing Spring root WebApplicationContext
2017-10-21 01:10:12,102 INFO  - [ShutdownMonitor:] ~ Stopping service org.apache.atlas.web.service.ActiveInstanceElectorService
(Services:65)
2017-10-21 01:10:12,103 INFO  - [ShutdownMonitor:] ~ HA is not enabled, no need to stop leader
election service (ActiveInstanceElectorService:126)
2017-10-21 01:10:12,104 INFO  - [ShutdownMonitor:] ~ Stopping service org.apache.atlas.kafka.KafkaNotification
(Services:65)
2017-10-21 01:10:12,717 INFO  - [ShutdownMonitor:] ~ Stopping service org.apache.atlas.notification.NotificationHookConsumer
(Services:65)
2017-10-21 01:10:12,717 INFO  - [ShutdownMonitor:] ~ ==> stopConsumerThreads() (NotificationHookConsumer:185)
2017-10-21 01:10:12,717 INFO  - [ShutdownMonitor:] ~ ==> HookConsumer shutdown() (NotificationHookConsumer$HookConsumer:498)
2017-10-21 01:10:12,718 INFO  - [ShutdownMonitor:] ~ [atlas-hook-consumer-thread], Shutting
down (Logging$class:68)
2017-10-21 01:10:12,718 INFO  - [NotificationHookConsumer thread-0:] ~ closing NotificationConsumer
(NotificationHookConsumer$HookConsumer:325)
2017-10-21 01:10:12,720 INFO  - [NotificationHookConsumer thread-0:] ~ <== HookConsumer
doWork() (NotificationHookConsumer$HookConsumer:329)
2017-10-21 01:10:12,720 INFO  - [ShutdownMonitor:] ~ [atlas-hook-consumer-thread], Shutdown
completed (Logging$class:68)
2017-10-21 01:10:12,720 INFO  - [NotificationHookConsumer thread-0:] ~ [atlas-hook-consumer-thread],
Stopped  (Logging$class:68)
2017-10-21 01:10:12,720 INFO  - [ShutdownMonitor:] ~ <== HookConsumer shutdown() (NotificationHookConsumer$HookConsumer:513)
2017-10-21 01:10:12,721 INFO  - [ShutdownMonitor:] ~ <== stopConsumerThreads() (NotificationHookConsumer:194)
2017-10-21 01:10:12,723 DEBUG - [ShutdownMonitor:] ~ ==> AtlasAuthorizationFilter destroy
(AtlasAuthorizationFilter:78)
2017-10-21 01:10:12,723 DEBUG - [ShutdownMonitor:] ~ ==> +SimpleAtlasAuthorizer cleanUp
(SimpleAtlasAuthorizer:327)
2017-10-21 01:10:12,723 DEBUG - [ShutdownMonitor:] ~ <== +SimpleAtlasAuthorizer cleanUp
(SimpleAtlasAuthorizer:338)
[INFO] Shutting down log4j
[INFO] Not cleaning cached beans: no such field javax.el.BeanELResolver.properties
[INFO] Stopped o.e.j.m.p.JettyWebAppContext@22e7f1d9{/,<https://builds.apache.org/job/Atlas-0.8-IntegrationTests/ws/webapp/target/atlas-webapp-0.8.2-SNAPSHOT/,UNAVAILABLE}{/home/jenkins/jenkins-slave/workspace/Atlas-0.8-IntegrationTests/webapp/target/atlas-webapp-0.8.2-SNAPSHOT.war}>
[INFO] Server reports itself as stopped
[INFO] 
[INFO] --- maven-source-plugin:2.4:jar-no-fork (attach-sources) @ hive-bridge ---
[INFO] Building jar: <https://builds.apache.org/job/Atlas-0.8-IntegrationTests/ws/addons/hive-bridge/target/hive-bridge-0.8.2-SNAPSHOT-sources.jar>
[INFO] 
[INFO] --- maven-source-plugin:2.4:test-jar-no-fork (attach-sources) @ hive-bridge ---
[INFO] Building jar: <https://builds.apache.org/job/Atlas-0.8-IntegrationTests/ws/addons/hive-bridge/target/hive-bridge-0.8.2-SNAPSHOT-test-sources.jar>
[INFO] 
[INFO] --- maven-failsafe-plugin:2.18.1:verify (verify) @ hive-bridge ---
[INFO] Failsafe report directory: <https://builds.apache.org/job/Atlas-0.8-IntegrationTests/ws/addons/hive-bridge/target/failsafe-reports>
[INFO] ------------------------------------------------------------------------
[INFO] Reactor Summary:
[INFO] 
[INFO] Apache Atlas Server Build Tools .................... SUCCESS [  1.004 s]
[INFO] apache-atlas ....................................... SUCCESS [  8.451 s]
[INFO] Apache Atlas Integration ........................... SUCCESS [ 20.510 s]
[INFO] Apache Atlas Common ................................ SUCCESS [  8.485 s]
[INFO] Apache Atlas Typesystem ............................ SUCCESS [ 45.902 s]
[INFO] Apache Atlas Client ................................ SUCCESS [  0.803 s]
[INFO] atlas-client-common ................................ SUCCESS [  7.970 s]
[INFO] atlas-client-v1 .................................... SUCCESS [  7.521 s]
[INFO] Apache Atlas Server API ............................ SUCCESS [  5.986 s]
[INFO] Apache Atlas Notification .......................... SUCCESS [  9.937 s]
[INFO] atlas-client-v2 .................................... SUCCESS [  5.905 s]
[INFO] Apache Atlas Graph Database Projects ............... SUCCESS [  0.471 s]
[INFO] Apache Atlas Graph Database API .................... SUCCESS [  4.932 s]
[INFO] Graph Database Common Code ......................... SUCCESS [  4.825 s]
[INFO] Apache Atlas Titan 1.0.0 GraphDB Impl .............. SUCCESS [ 37.148 s]
[INFO] Shaded version of Apache hbase client .............. SUCCESS [  8.126 s]
[INFO] Apache Atlas Titan 0.5.4 Graph DB Impl ............. SUCCESS [ 38.408 s]
[INFO] Apache Atlas Graph Database Implementation Dependencies SUCCESS [  0.919 s]
[INFO] Shaded version of Apache hbase server .............. SUCCESS [ 22.992 s]
[INFO] Apache Atlas Repository ............................ SUCCESS [01:21 min]
[INFO] Apache Atlas Authorization ......................... SUCCESS [  7.098 s]
[INFO] Apache Atlas Business Catalog ...................... SUCCESS [ 11.021 s]
[INFO] Apache Atlas UI .................................... SUCCESS [01:27 min]
[INFO] Apache Atlas Web Application ....................... SUCCESS [04:13 min]
[INFO] Apache Atlas Documentation ......................... SUCCESS [  6.142 s]
[INFO] Apache Atlas FileSystem Model ...................... SUCCESS [  1.381 s]
[INFO] Apache Atlas Plugin Classloader .................... SUCCESS [  6.472 s]
[INFO] Apache Atlas Hive Bridge Shim ...................... SUCCESS [  5.931 s]
[INFO] Apache Atlas Hive Bridge ........................... FAILURE [07:28 min]
[INFO] Apache Atlas Falcon Bridge Shim .................... SKIPPED
[INFO] Apache Atlas Falcon Bridge ......................... SKIPPED
[INFO] Apache Atlas Sqoop Bridge Shim ..................... SKIPPED
[INFO] Apache Atlas Sqoop Bridge .......................... SKIPPED
[INFO] Apache Atlas Storm Bridge Shim ..................... SKIPPED
[INFO] Apache Atlas Storm Bridge .......................... SKIPPED
[INFO] Apache Atlas Distribution .......................... SKIPPED
[INFO] ------------------------------------------------------------------------
[INFO] BUILD FAILURE
[INFO] ------------------------------------------------------------------------
[INFO] Total time: 19:12 min
[INFO] Finished at: 2017-10-21T01:10:12Z
[INFO] Final Memory: 583M/2919M
[INFO] ------------------------------------------------------------------------
log4j:WARN No appenders could be found for logger (org.apache.atlas.security.InMemoryJAASConfiguration).
log4j:WARN Please initialize the log4j system properly.
log4j:WARN See http://logging.apache.org/log4j/1.2/faq.html#noconfig for more info.
[ERROR] Failed to execute goal org.apache.maven.plugins:maven-failsafe-plugin:2.18.1:verify
(verify) on project hive-bridge: There are test failures.
[ERROR] 
[ERROR] Please refer to <https://builds.apache.org/job/Atlas-0.8-IntegrationTests/ws/addons/hive-bridge/target/failsafe-reports>
for the individual test results.
[ERROR] -> [Help 1]
[ERROR] 
[ERROR] To see the full stack trace of the errors, re-run Maven with the -e switch.
[ERROR] Re-run Maven using the -X switch to enable full debug logging.
[ERROR] 
[ERROR] For more information about the errors and possible solutions, please read the following
articles:
[ERROR] [Help 1] http://cwiki.apache.org/confluence/display/MAVEN/MojoFailureException
[ERROR] 
[ERROR] After correcting the problems, you can resume the build with the command
[ERROR]   mvn <goals> -rf :hive-bridge
Build step 'Execute shell' marked build as failure
[CHECKSTYLE] Collecting checkstyle analysis files...
[CHECKSTYLE] Searching for all files in <https://builds.apache.org/job/Atlas-0.8-IntegrationTests/ws/>
that match the pattern **/target/checkstyle-result.xml
[CHECKSTYLE] Parsing 27 files in <https://builds.apache.org/job/Atlas-0.8-IntegrationTests/ws/>
[CHECKSTYLE] Successfully parsed file <https://builds.apache.org/job/Atlas-0.8-IntegrationTests/ws/addons/hdfs-model/target/checkstyle-result.xml>
with 0 unique warnings and 0 duplicates.
[CHECKSTYLE] Successfully parsed file <https://builds.apache.org/job/Atlas-0.8-IntegrationTests/ws/addons/hive-bridge-shim/target/checkstyle-result.xml>
with 15 unique warnings and 0 duplicates.
[CHECKSTYLE] Successfully parsed file <https://builds.apache.org/job/Atlas-0.8-IntegrationTests/ws/authorization/target/checkstyle-result.xml>
with 482 unique warnings and 0 duplicates.
[CHECKSTYLE] Successfully parsed file <https://builds.apache.org/job/Atlas-0.8-IntegrationTests/ws/catalog/target/checkstyle-result.xml>
with 2619 unique warnings and 0 duplicates.
[CHECKSTYLE] Successfully parsed file <https://builds.apache.org/job/Atlas-0.8-IntegrationTests/ws/client/client-v1/target/checkstyle-result.xml>
with 3493 unique warnings and 0 duplicates.
[CHECKSTYLE] Successfully parsed file <https://builds.apache.org/job/Atlas-0.8-IntegrationTests/ws/client/client-v2/target/checkstyle-result.xml>
with 3818 unique warnings and 0 duplicates.
[CHECKSTYLE] Successfully parsed file <https://builds.apache.org/job/Atlas-0.8-IntegrationTests/ws/client/common/target/checkstyle-result.xml>
with 4278 unique warnings and 0 duplicates.
[CHECKSTYLE] Successfully parsed file <https://builds.apache.org/job/Atlas-0.8-IntegrationTests/ws/client/target/checkstyle-result.xml>
with 4278 unique warnings and 0 duplicates.
[CHECKSTYLE] Successfully parsed file <https://builds.apache.org/job/Atlas-0.8-IntegrationTests/ws/common/target/checkstyle-result.xml>
with 5237 unique warnings and 0 duplicates.
[CHECKSTYLE] Successfully parsed file <https://builds.apache.org/job/Atlas-0.8-IntegrationTests/ws/dashboardv2/target/checkstyle-result.xml>
with 5237 unique warnings and 0 duplicates.
[CHECKSTYLE] Successfully parsed file <https://builds.apache.org/job/Atlas-0.8-IntegrationTests/ws/docs/target/checkstyle-result.xml>
with 5237 unique warnings and 0 duplicates.
[CHECKSTYLE] Successfully parsed file <https://builds.apache.org/job/Atlas-0.8-IntegrationTests/ws/graphdb/api/target/checkstyle-result.xml>
with 5510 unique warnings and 0 duplicates.
[CHECKSTYLE] Successfully parsed file <https://builds.apache.org/job/Atlas-0.8-IntegrationTests/ws/graphdb/common/target/checkstyle-result.xml>
with 5697 unique warnings and 0 duplicates.
[CHECKSTYLE] Successfully parsed file <https://builds.apache.org/job/Atlas-0.8-IntegrationTests/ws/graphdb/graphdb-impls/target/checkstyle-result.xml>
with 5697 unique warnings and 0 duplicates.
[CHECKSTYLE] Successfully parsed file <https://builds.apache.org/job/Atlas-0.8-IntegrationTests/ws/graphdb/target/checkstyle-result.xml>
with 5697 unique warnings and 0 duplicates.
[CHECKSTYLE] Successfully parsed file <https://builds.apache.org/job/Atlas-0.8-IntegrationTests/ws/graphdb/titan0/target/checkstyle-result.xml>
with 8152 unique warnings and 0 duplicates.
[CHECKSTYLE] Successfully parsed file <https://builds.apache.org/job/Atlas-0.8-IntegrationTests/ws/graphdb/titan1/target/checkstyle-result.xml>
with 9119 unique warnings and 0 duplicates.
[CHECKSTYLE] Successfully parsed file <https://builds.apache.org/job/Atlas-0.8-IntegrationTests/ws/intg/target/checkstyle-result.xml>
with 15833 unique warnings and 0 duplicates.
[CHECKSTYLE] Successfully parsed file <https://builds.apache.org/job/Atlas-0.8-IntegrationTests/ws/notification/target/checkstyle-result.xml>
with 17398 unique warnings and 0 duplicates.
[CHECKSTYLE] Successfully parsed file <https://builds.apache.org/job/Atlas-0.8-IntegrationTests/ws/plugin-classloader/target/checkstyle-result.xml>
with 17511 unique warnings and 0 duplicates.
[CHECKSTYLE] Successfully parsed file <https://builds.apache.org/job/Atlas-0.8-IntegrationTests/ws/repository/target/checkstyle-result.xml>
with 36402 unique warnings and 0 duplicates.
[CHECKSTYLE] Successfully parsed file <https://builds.apache.org/job/Atlas-0.8-IntegrationTests/ws/server-api/target/checkstyle-result.xml>
with 36795 unique warnings and 0 duplicates.
[CHECKSTYLE] Successfully parsed file <https://builds.apache.org/job/Atlas-0.8-IntegrationTests/ws/shaded/hbase-client-shaded/target/checkstyle-result.xml>
with 36795 unique warnings and 0 duplicates.
[CHECKSTYLE] Successfully parsed file <https://builds.apache.org/job/Atlas-0.8-IntegrationTests/ws/shaded/hbase-server-shaded/target/checkstyle-result.xml>
with 36795 unique warnings and 0 duplicates.
[CHECKSTYLE] Successfully parsed file <https://builds.apache.org/job/Atlas-0.8-IntegrationTests/ws/target/checkstyle-result.xml>
with 36795 unique warnings and 0 duplicates.
[CHECKSTYLE] Successfully parsed file <https://builds.apache.org/job/Atlas-0.8-IntegrationTests/ws/typesystem/target/checkstyle-result.xml>
with 41013 unique warnings and 0 duplicates.
[CHECKSTYLE] Successfully parsed file <https://builds.apache.org/job/Atlas-0.8-IntegrationTests/ws/webapp/target/checkstyle-result.xml>
with 49264 unique warnings and 0 duplicates.
<Git Blamer> Using GitBlamer to create author and commit information for all warnings.
<Git Blamer> GIT_COMMIT=28dda90802689c0926ca14b89065809150df8caa, workspace=<https://builds.apache.org/job/Atlas-0.8-IntegrationTests/ws/>
 > git rev-parse 28dda90802689c0926ca14b89065809150df8caa^{commit} # timeout=10
<Git Blamer> Skipping file <https://builds.apache.org/job/Atlas-0.8-IntegrationTests/ws/typesystem/src/main/java/org/apache/atlas/typesystem/IStruct.java,>
no result found.
[FINDBUGS] Collecting findbugs analysis files...
[FINDBUGS] Searching for all files in <https://builds.apache.org/job/Atlas-0.8-IntegrationTests/ws/>
that match the pattern **/target/findbugs.xml
[FINDBUGS] Parsing 18 files in <https://builds.apache.org/job/Atlas-0.8-IntegrationTests/ws/>
[FINDBUGS] Successfully parsed file <https://builds.apache.org/job/Atlas-0.8-IntegrationTests/ws/addons/hive-bridge-shim/target/findbugs.xml>
with 0 unique warnings and 0 duplicates.
[FINDBUGS] Successfully parsed file <https://builds.apache.org/job/Atlas-0.8-IntegrationTests/ws/authorization/target/findbugs.xml>
with 0 unique warnings and 0 duplicates.
[FINDBUGS] Successfully parsed file <https://builds.apache.org/job/Atlas-0.8-IntegrationTests/ws/catalog/target/findbugs.xml>
with 0 unique warnings and 0 duplicates.
[FINDBUGS] Successfully parsed file <https://builds.apache.org/job/Atlas-0.8-IntegrationTests/ws/client/client-v1/target/findbugs.xml>
with 0 unique warnings and 0 duplicates.
[FINDBUGS] Successfully parsed file <https://builds.apache.org/job/Atlas-0.8-IntegrationTests/ws/client/client-v2/target/findbugs.xml>
with 0 unique warnings and 0 duplicates.
[FINDBUGS] Successfully parsed file <https://builds.apache.org/job/Atlas-0.8-IntegrationTests/ws/client/common/target/findbugs.xml>
with 0 unique warnings and 0 duplicates.
[FINDBUGS] Successfully parsed file <https://builds.apache.org/job/Atlas-0.8-IntegrationTests/ws/common/target/findbugs.xml>
with 0 unique warnings and 0 duplicates.
[FINDBUGS] Successfully parsed file <https://builds.apache.org/job/Atlas-0.8-IntegrationTests/ws/graphdb/api/target/findbugs.xml>
with 0 unique warnings and 0 duplicates.
[FINDBUGS] Successfully parsed file <https://builds.apache.org/job/Atlas-0.8-IntegrationTests/ws/graphdb/common/target/findbugs.xml>
with 0 unique warnings and 0 duplicates.
[FINDBUGS] Successfully parsed file <https://builds.apache.org/job/Atlas-0.8-IntegrationTests/ws/graphdb/titan0/target/findbugs.xml>
with 0 unique warnings and 0 duplicates.
[FINDBUGS] Successfully parsed file <https://builds.apache.org/job/Atlas-0.8-IntegrationTests/ws/graphdb/titan1/target/findbugs.xml>
with 0 unique warnings and 0 duplicates.
[FINDBUGS] Successfully parsed file <https://builds.apache.org/job/Atlas-0.8-IntegrationTests/ws/intg/target/findbugs.xml>
with 0 unique warnings and 0 duplicates.
[FINDBUGS] Successfully parsed file <https://builds.apache.org/job/Atlas-0.8-IntegrationTests/ws/notification/target/findbugs.xml>
with 0 unique warnings and 0 duplicates.
[FINDBUGS] Successfully parsed file <https://builds.apache.org/job/Atlas-0.8-IntegrationTests/ws/plugin-classloader/target/findbugs.xml>
with 0 unique warnings and 0 duplicates.
[FINDBUGS] Successfully parsed file <https://builds.apache.org/job/Atlas-0.8-IntegrationTests/ws/repository/target/findbugs.xml>
with 0 unique warnings and 0 duplicates.
[FINDBUGS] Successfully parsed file <https://builds.apache.org/job/Atlas-0.8-IntegrationTests/ws/server-api/target/findbugs.xml>
with 0 unique warnings and 0 duplicates.
[FINDBUGS] Successfully parsed file <https://builds.apache.org/job/Atlas-0.8-IntegrationTests/ws/typesystem/target/findbugs.xml>
with 0 unique warnings and 0 duplicates.
[FINDBUGS] Successfully parsed file <https://builds.apache.org/job/Atlas-0.8-IntegrationTests/ws/webapp/target/findbugs.xml>
with 0 unique warnings and 0 duplicates.
<Git Blamer> Using GitBlamer to create author and commit information for all warnings.
<Git Blamer> GIT_COMMIT=28dda90802689c0926ca14b89065809150df8caa, workspace=<https://builds.apache.org/job/Atlas-0.8-IntegrationTests/ws/>
Archiving artifacts
[Fast Archiver] No prior successful build to compare, so performing full copy of artifacts
TestNG Reports Processing: START
Looking for TestNG results report in workspace using pattern: **/target/surefire-reports/testng-results.xml,**/target/failsafe-reports/testng-results.xml
Saving reports...
Processing '/x1/jenkins/jenkins-home/jobs/Atlas-0.8-IntegrationTests/builds/116/testng/testng-results-1.xml'
Processing '/x1/jenkins/jenkins-home/jobs/Atlas-0.8-IntegrationTests/builds/116/testng/testng-results.xml'
5.617978% of tests failed, which exceeded threshold of 0%. Marking build as UNSTABLE
TestNG Reports Processing: FINISH

Mime
View raw message