atlas-dev mailing list archives

Site index · List index
Message view « Date » · « Thread »
Top « Date » · « Thread »
From Apache Jenkins Server <jenk...@builds.apache.org>
Subject Build failed in Jenkins: Atlas-0.8-IntegrationTests #121
Date Thu, 26 Oct 2017 21:22:13 GMT
See <https://builds.apache.org/job/Atlas-0.8-IntegrationTests/121/display/redirect>

------------------------------------------
[...truncated 533.77 KB...]
127.0.0.1 - - [26/Oct/2017:21:15:42 +0000] "POST /api/atlas/types HTTP/1.1" 201 - "-" "Java/1.8.0_144"
127.0.0.1 - - [26/Oct/2017:21:15:42 +0000] "GET /api/atlas/types?type=TRAIT HTTP/1.1" 200
- "-" "Java/1.8.0_144"
127.0.0.1 - - [26/Oct/2017:21:15:42 +0000] "GET /api/atlas/v2/types/typedef/name/AKZybpDTK0U
HTTP/1.1" 404 - "-" "Java/1.8.0_144"
127.0.0.1 - - [26/Oct/2017:21:15:42 +0000] "POST /api/atlas/types HTTP/1.1" 201 - "-" "Java/1.8.0_144"
127.0.0.1 - - [26/Oct/2017:21:15:42 +0000] "GET /api/atlas/v2/types/typedef/name/A1A0EWXTfjES
HTTP/1.1" 404 - "-" "Java/1.8.0_144"
127.0.0.1 - - [26/Oct/2017:21:15:42 +0000] "POST /api/atlas/types HTTP/1.1" 201 - "-" "Java/1.8.0_144"
127.0.0.1 - - [26/Oct/2017:21:15:42 +0000] "GET /api/atlas/v2/types/typedef/name/BwcseyW6yxw
HTTP/1.1" 404 - "-" "Java/1.8.0_144"
127.0.0.1 - - [26/Oct/2017:21:15:42 +0000] "POST /api/atlas/types HTTP/1.1" 201 - "-" "Java/1.8.0_144"
127.0.0.1 - - [26/Oct/2017:21:15:42 +0000] "GET /api/atlas/v2/types/typedef/name/CPgy6yYCVPj
HTTP/1.1" 404 - "-" "Java/1.8.0_144"
127.0.0.1 - - [26/Oct/2017:21:15:42 +0000] "POST /api/atlas/types HTTP/1.1" 201 - "-" "Java/1.8.0_144"
127.0.0.1 - - [26/Oct/2017:21:15:42 +0000] "GET /api/atlas/types?type=CLASS&supertype=AKZybpDTK0U&notsupertype=BwcseyW6yxw
HTTP/1.1" 200 - "-" "Java/1.8.0_144"
127.0.0.1 - - [26/Oct/2017:21:15:42 +0000] "GET /api/atlas/types/database HTTP/1.1" 200 -
"-" "Java/1.8.0_144"
127.0.0.1 - - [26/Oct/2017:21:15:42 +0000] "GET /api/atlas/types/table HTTP/1.1" 200 - "-"
"Java/1.8.0_144"
127.0.0.1 - - [26/Oct/2017:21:15:42 +0000] "GET /api/atlas/types/fetl HTTP/1.1" 200 - "-"
"Java/1.8.0_144"
127.0.0.1 - - [26/Oct/2017:21:15:42 +0000] "POST /api/atlas/types HTTP/1.1" 201 - "-" "Java/1.8.0_144"
127.0.0.1 - - [26/Oct/2017:21:15:42 +0000] "PUT /api/atlas/types HTTP/1.1" 200 - "-" "Java/1.8.0_144"
127.0.0.1 - - [26/Oct/2017:21:15:43 +0000] "GET /api/atlas/types/UHKN66b51e HTTP/1.1" 200
- "-" "Java/1.8.0_144"
127.0.0.1 - - [26/Oct/2017:21:15:43 +0000] "GET /api/atlas/types/database HTTP/1.1" 200 -
"-" "Java/1.8.0_144"
127.0.0.1 - - [26/Oct/2017:21:15:43 +0000] "GET /api/atlas/types/table HTTP/1.1" 200 - "-"
"Java/1.8.0_144"
127.0.0.1 - - [26/Oct/2017:21:15:43 +0000] "GET /api/atlas/types/fetl HTTP/1.1" 200 - "-"
"Java/1.8.0_144"
127.0.0.1 - - [26/Oct/2017:21:15:43 +0000] "GET /api/atlas/types HTTP/1.1" 200 - "-" "Java/1.8.0_144"
127.0.0.1 - - [26/Oct/2017:21:15:43 +0000] "POST /api/atlas/types HTTP/1.1" 201 - "-" "Java/1.8.0_144"
127.0.0.1 - - [26/Oct/2017:21:15:44 +0000] "GET /api/atlas/types HTTP/1.1" 200 - "-" "Java/1.8.0_144"
127.0.0.1 - - [26/Oct/2017:21:15:44 +0000] "POST /api/atlas/entities HTTP/1.1" 201 - "-" "Java/1.8.0_144"
127.0.0.1 - - [26/Oct/2017:21:15:44 +0000] "POST /api/atlas/entities HTTP/1.1" 201 - "-" "Java/1.8.0_144"
127.0.0.1 - - [26/Oct/2017:21:15:44 +0000] "POST /api/atlas/entities HTTP/1.1" 201 - "-" "Java/1.8.0_144"
127.0.0.1 - - [26/Oct/2017:21:15:44 +0000] "POST /api/atlas/entities HTTP/1.1" 201 - "-" "Java/1.8.0_144"
127.0.0.1 - - [26/Oct/2017:21:15:44 +0000] "POST /api/atlas/entities HTTP/1.1" 201 - "-" "Java/1.8.0_144"
127.0.0.1 - - [26/Oct/2017:21:15:44 +0000] "POST /api/atlas/entities HTTP/1.1" 201 - "-" "Java/1.8.0_144"
127.0.0.1 - - [26/Oct/2017:21:15:44 +0000] "POST /api/atlas/entities HTTP/1.1" 201 - "-" "Java/1.8.0_144"
127.0.0.1 - - [26/Oct/2017:21:15:44 +0000] "POST /api/atlas/entities HTTP/1.1" 201 - "-" "Java/1.8.0_144"
127.0.0.1 - - [26/Oct/2017:21:15:44 +0000] "POST /api/atlas/entities HTTP/1.1" 201 - "-" "Java/1.8.0_144"
127.0.0.1 - - [26/Oct/2017:21:15:44 +0000] "POST /api/atlas/entities HTTP/1.1" 201 - "-" "Java/1.8.0_144"
127.0.0.1 - - [26/Oct/2017:21:15:44 +0000] "POST /api/atlas/entities HTTP/1.1" 201 - "-" "Java/1.8.0_144"
127.0.0.1 - - [26/Oct/2017:21:15:44 +0000] "POST /api/atlas/entities HTTP/1.1" 201 - "-" "Java/1.8.0_144"
127.0.0.1 - - [26/Oct/2017:21:15:44 +0000] "POST /api/atlas/entities HTTP/1.1" 201 - "-" "Java/1.8.0_144"
127.0.0.1 - - [26/Oct/2017:21:15:44 +0000] "POST /api/atlas/entities HTTP/1.1" 201 - "-" "Java/1.8.0_144"
127.0.0.1 - - [26/Oct/2017:21:15:44 +0000] "POST /api/atlas/entities HTTP/1.1" 201 - "-" "Java/1.8.0_144"
127.0.0.1 - - [26/Oct/2017:21:15:44 +0000] "POST /api/atlas/entities HTTP/1.1" 201 - "-" "Java/1.8.0_144"
127.0.0.1 - - [26/Oct/2017:21:15:44 +0000] "GET /api/atlas/discovery/search?query=from+DB_v1&limit=10&offset=0
HTTP/1.1" 200 - "-" "Java/1.8.0_144"
127.0.0.1 - - [26/Oct/2017:21:15:45 +0000] "GET /api/atlas/discovery/search?query=DB_v1&limit=10&offset=0
HTTP/1.1" 200 - "-" "Java/1.8.0_144"
127.0.0.1 - - [26/Oct/2017:21:15:46 +0000] "GET /api/atlas/discovery/search?query=DB_v1+where+name%3D%22Reporting%22&limit=10&offset=0
HTTP/1.1" 200 - "-" "Java/1.8.0_144"
127.0.0.1 - - [26/Oct/2017:21:15:47 +0000] "GET /api/atlas/discovery/search?query=DB_v1+where+DB_v1.name%3D%22Reporting%22&limit=10&offset=0
HTTP/1.1" 200 - "-" "Java/1.8.0_144"
127.0.0.1 - - [26/Oct/2017:21:15:48 +0000] "GET /api/atlas/discovery/search?query=DB_v1+name+%3D+%22Reporting%22&limit=10&offset=0
HTTP/1.1" 200 - "-" "Java/1.8.0_144"
127.0.0.1 - - [26/Oct/2017:21:15:49 +0000] "GET /api/atlas/discovery/search?query=DB_v1+DB_v1.name+%3D+%22Reporting%22&limit=10&offset=0
HTTP/1.1" 200 - "-" "Java/1.8.0_144"
127.0.0.1 - - [26/Oct/2017:21:15:49 +0000] "GET /api/atlas/discovery/search?query=DB_v1+where+name%3D%22Reporting%22+select+name,+owner&limit=10&offset=0
HTTP/1.1" 200 - "-" "Java/1.8.0_144"
127.0.0.1 - - [26/Oct/2017:21:15:51 +0000] "GET /api/atlas/discovery/search?query=DB_v1+where+DB_v1.name%3D%22Reporting%22+select+name,+owner&limit=10&offset=0
HTTP/1.1" 200 - "-" "Java/1.8.0_144"
127.0.0.1 - - [26/Oct/2017:21:15:53 +0000] "GET /api/atlas/discovery/search?query=DB_v1+has+name&limit=10&offset=0
HTTP/1.1" 200 - "-" "Java/1.8.0_144"
127.0.0.1 - - [26/Oct/2017:21:15:53 +0000] "GET /api/atlas/discovery/search?query=DB_v1+where+DB_v1+has+name&limit=10&offset=0
HTTP/1.1" 200 - "-" "Java/1.8.0_144"
127.0.0.1 - - [26/Oct/2017:21:15:54 +0000] "GET /api/atlas/discovery/search?query=DB_v1,+Table_v1&limit=10&offset=0
HTTP/1.1" 200 - "-" "Java/1.8.0_144"
127.0.0.1 - - [26/Oct/2017:21:15:55 +0000] "GET /api/atlas/discovery/search?query=DB_v1+is+JdbcAccess&limit=10&offset=0
HTTP/1.1" 200 - "-" "Java/1.8.0_144"
127.0.0.1 - - [26/Oct/2017:21:15:55 +0000] "GET /api/atlas/discovery/search?query=from+Table_v1&limit=10&offset=0
HTTP/1.1" 200 - "-" "Java/1.8.0_144"
127.0.0.1 - - [26/Oct/2017:21:15:56 +0000] "GET /api/atlas/discovery/search?query=Table_v1&limit=10&offset=0
HTTP/1.1" 200 - "-" "Java/1.8.0_144"
127.0.0.1 - - [26/Oct/2017:21:15:57 +0000] "GET /api/atlas/discovery/search?query=Table_v1+is+Dimension_v1&limit=10&offset=0
HTTP/1.1" 200 - "-" "Java/1.8.0_144"
127.0.0.1 - - [26/Oct/2017:21:15:58 +0000] "GET /api/atlas/discovery/search?query=Column_v1+where+Column_v1+isa+PII_v1&limit=10&offset=0
HTTP/1.1" 200 - "-" "Java/1.8.0_144"
127.0.0.1 - - [26/Oct/2017:21:15:59 +0000] "GET /api/atlas/discovery/search?query=View_v1+is+Dimension_v1&limit=10&offset=0
HTTP/1.1" 200 - "-" "Java/1.8.0_144"
127.0.0.1 - - [26/Oct/2017:21:16:00 +0000] "GET /api/atlas/discovery/search?query=Column_v1+select+Column_v1.name&limit=10&offset=0
HTTP/1.1" 200 - "-" "Java/1.8.0_144"
127.0.0.1 - - [26/Oct/2017:21:16:01 +0000] "GET /api/atlas/discovery/search?query=Column_v1+select+name&limit=10&offset=0
HTTP/1.1" 200 - "-" "Java/1.8.0_144"
127.0.0.1 - - [26/Oct/2017:21:16:02 +0000] "GET /api/atlas/discovery/search?query=Column_v1+where+Column_v1.name%3D%22customer_id%22&limit=10&offset=0
HTTP/1.1" 200 - "-" "Java/1.8.0_144"
127.0.0.1 - - [26/Oct/2017:21:16:03 +0000] "GET /api/atlas/discovery/search?query=from+Table_v1+select+Table_v1.name&limit=10&offset=0
HTTP/1.1" 200 - "-" "Java/1.8.0_144"
127.0.0.1 - - [26/Oct/2017:21:16:04 +0000] "GET /api/atlas/discovery/search?query=DB_v1+where+(name+%3D+%22Reporting%22)&limit=10&offset=0
HTTP/1.1" 200 - "-" "Java/1.8.0_144"
127.0.0.1 - - [26/Oct/2017:21:16:05 +0000] "GET /api/atlas/discovery/search?query=DB_v1+where+(name+%3D+%22Reporting%22)+select+name+as+_col_0,+owner+as+_col_1&limit=10&offset=0
HTTP/1.1" 200 - "-" "Java/1.8.0_144"
127.0.0.1 - - [26/Oct/2017:21:16:06 +0000] "GET /api/atlas/discovery/search?query=DB_v1+where+DB_v1+is+JdbcAccess_v1&limit=10&offset=0
HTTP/1.1" 200 - "-" "Java/1.8.0_144"
127.0.0.1 - - [26/Oct/2017:21:16:07 +0000] "GET /api/atlas/discovery/search?query=DB_v1+where+DB_v1+has+name&limit=10&offset=0
HTTP/1.1" 200 - "-" "Java/1.8.0_144"
127.0.0.1 - - [26/Oct/2017:21:16:08 +0000] "GET /api/atlas/discovery/search?query=DB_v1+Table_v1&limit=10&offset=0
HTTP/1.1" 200 - "-" "Java/1.8.0_144"
127.0.0.1 - - [26/Oct/2017:21:16:08 +0000] "GET /api/atlas/discovery/search?query=DB_v1+where+DB_v1+has+name&limit=10&offset=0
HTTP/1.1" 200 - "-" "Java/1.8.0_144"
127.0.0.1 - - [26/Oct/2017:21:16:09 +0000] "GET /api/atlas/discovery/search?query=DB_v1+as+db1+Table+where+(db1.name+%3D+%22Reporting%22)&limit=10&offset=0
HTTP/1.1" 200 - "-" "Java/1.8.0_144"
127.0.0.1 - - [26/Oct/2017:21:16:09 +0000] "GET /api/atlas/discovery/search?query=DB_v1+where+(name+%3D+%22Reporting%22)+select+name+as+_col_0,+(createTime+%2B+1)+as+_col_1+&limit=10&offset=0
HTTP/1.1" 200 - "-" "Java/1.8.0_144"
127.0.0.1 - - [26/Oct/2017:21:16:11 +0000] "GET /api/atlas/discovery/search?query=Dimension_v1&limit=10&offset=0
HTTP/1.1" 200 - "-" "Java/1.8.0_144"
127.0.0.1 - - [26/Oct/2017:21:16:12 +0000] "GET /api/atlas/discovery/search?query=JdbcAccess_v1&limit=10&offset=0
HTTP/1.1" 200 - "-" "Java/1.8.0_144"
127.0.0.1 - - [26/Oct/2017:21:16:12 +0000] "GET /api/atlas/discovery/search?query=ETL_v1&limit=10&offset=0
HTTP/1.1" 200 - "-" "Java/1.8.0_144"
127.0.0.1 - - [26/Oct/2017:21:16:13 +0000] "GET /api/atlas/discovery/search?query=Metric_v1&limit=10&offset=0
HTTP/1.1" 200 - "-" "Java/1.8.0_144"
127.0.0.1 - - [26/Oct/2017:21:16:14 +0000] "GET /api/atlas/discovery/search?query=PII_v1&limit=10&offset=0
HTTP/1.1" 200 - "-" "Java/1.8.0_144"
127.0.0.1 - - [26/Oct/2017:21:16:15 +0000] "GET /api/atlas/discovery/search?query=%60Log+Data_v1%60&limit=10&offset=0
HTTP/1.1" 200 - "-" "Java/1.8.0_144"
127.0.0.1 - - [26/Oct/2017:21:16:16 +0000] "GET /api/atlas/discovery/search?query=Table_v1+where+name%3D%22sales_fact%22,+columns&limit=10&offset=0
HTTP/1.1" 200 - "-" "Java/1.8.0_144"
127.0.0.1 - - [26/Oct/2017:21:16:16 +0000] "GET /api/atlas/discovery/search?query=Table_v1+where+name%3D%22sales_fact%22,+columns+as+column+select+column.name,+column.dataType,+column.comment&limit=10&offset=0
HTTP/1.1" 200 - "-" "Java/1.8.0_144"
127.0.0.1 - - [26/Oct/2017:21:16:18 +0000] "GET /api/atlas/discovery/search?query=from+DataSet&limit=10&offset=0
HTTP/1.1" 200 - "-" "Java/1.8.0_144"
127.0.0.1 - - [26/Oct/2017:21:16:19 +0000] "GET /api/atlas/discovery/search?query=from+Process&limit=10&offset=0
HTTP/1.1" 200 - "-" "Java/1.8.0_144"
127.0.0.1 - - [26/Oct/2017:21:16:20 +0000] "GET /api/atlas/entities?type=DB_v1&property=name&value=Sales
HTTP/1.1" 200 - "-" "Java/1.8.0_144"
127.0.0.1 - - [26/Oct/2017:21:16:20 +0000] "GET /api/atlas/entities?type=Table_v1&property=qualifiedName&value=sales_fact
HTTP/1.1" 200 - "-" "Java/1.8.0_144"
127.0.0.1 - - [26/Oct/2017:21:16:20 +0000] "GET /api/atlas/entities?type=Table_v1&property=qualifiedName&value=time_dim
HTTP/1.1" 200 - "-" "Java/1.8.0_144"
127.0.0.1 - - [26/Oct/2017:21:16:20 +0000] "GET /api/atlas/entities?type=Table_v1&property=qualifiedName&value=sales_fact_daily_mv
HTTP/1.1" 200 - "-" "Java/1.8.0_144"
127.0.0.1 - - [26/Oct/2017:21:16:20 +0000] "GET /api/atlas/lineage/hive/table/sales_fact_daily_mv/inputs/graph
HTTP/1.1" 200 - "-" "Java/1.8.0_144"
127.0.0.1 - - [26/Oct/2017:21:16:22 +0000] "GET /api/atlas/entities?type=LoadProcess_v1&property=qualifiedName&value=loadSalesDaily
HTTP/1.1" 200 - "-" "Java/1.8.0_144"
127.0.0.1 - - [26/Oct/2017:21:16:22 +0000] "GET /api/atlas/entities?type=Table_v1&property=qualifiedName&value=sales_fact
HTTP/1.1" 200 - "-" "Java/1.8.0_144"
127.0.0.1 - - [26/Oct/2017:21:16:22 +0000] "GET /api/atlas/entities?type=Table_v1&property=qualifiedName&value=time_dim
HTTP/1.1" 200 - "-" "Java/1.8.0_144"
127.0.0.1 - - [26/Oct/2017:21:16:22 +0000] "GET /api/atlas/entities?type=Table_v1&property=qualifiedName&value=sales_fact_daily_mv
HTTP/1.1" 200 - "-" "Java/1.8.0_144"
127.0.0.1 - - [26/Oct/2017:21:16:22 +0000] "GET /api/atlas/entities?type=Table_v1&property=qualifiedName&value=sales_fact
HTTP/1.1" 200 - "-" "Java/1.8.0_144"
127.0.0.1 - - [26/Oct/2017:21:16:22 +0000] "GET /api/atlas/entities?type=DB_v1&property=name&value=Sales
HTTP/1.1" 200 - "-" "Java/1.8.0_144"
127.0.0.1 - - [26/Oct/2017:21:16:22 +0000] "GET /api/atlas/entities?type=View_v1&property=qualifiedName&value=product_dim_view
HTTP/1.1" 200 - "-" "Java/1.8.0_144"
127.0.0.1 - - [26/Oct/2017:21:16:22 +0000] "GET /api/atlas/entities?type=Table_v1&property=qualifiedName&value=product_dim
HTTP/1.1" 200 - "-" "Java/1.8.0_144"
127.0.0.1 - - [26/Oct/2017:21:16:23 +0000] "POST /api/atlas/v2/types/typedefs HTTP/1.1" 409
- "-" "Java/1.8.0_144"
Tests run: 137, Failures: 1, Errors: 0, Skipped: 5, Time elapsed: 126.003 sec <<<
FAILURE! - in TestSuite
runQuickStart(org.apache.atlas.examples.QuickStartV2IT)  Time elapsed: 0.495 sec  <<<
FAILURE!
org.apache.atlas.AtlasServiceException: Metadata service API org.apache.atlas.AtlasClientV2$API_V2@2bc449e3
failed with status 409 (Conflict) Response Body ({"errorCode":"ATLAS-409-00-001","errorMessage":"Given
type Dimension already exists"})
	at org.apache.atlas.AtlasBaseClient.callAPIWithResource(AtlasBaseClient.java:387)
	at org.apache.atlas.AtlasBaseClient.callAPIWithResource(AtlasBaseClient.java:320)
	at org.apache.atlas.AtlasBaseClient.callAPI(AtlasBaseClient.java:208)
	at org.apache.atlas.AtlasClientV2.createAtlasTypeDefs(AtlasClientV2.java:219)
	at org.apache.atlas.examples.QuickStartV2.createTypes(QuickStartV2.java:191)
	at org.apache.atlas.examples.QuickStartV2.runQuickstart(QuickStartV2.java:147)
	at org.apache.atlas.examples.QuickStartV2IT.runQuickStart(QuickStartV2IT.java:49)


Results :

Failed tests: 
  QuickStartV2IT.runQuickStart:49 ยป AtlasService Metadata service API org.apache...

Tests run: 137, Failures: 1, Errors: 0, Skipped: 5

[INFO] 
[INFO] --- jetty-maven-plugin:9.2.12.v20150709:stop (stop-jetty) @ atlas-webapp ---
[INFO] Waiting 10 seconds for jetty to stop
[INFO] Stopped ServerConnector@4685e418{HTTP/1.1}{0.0.0.0:31000}
[INFO] Closing Spring root WebApplicationContext
[INFO] Shutting down log4j
[INFO] Not cleaning cached beans: no such field javax.el.BeanELResolver.properties
[INFO] Stopped o.e.j.m.p.JettyWebAppContext@1bfd9d34{/,<https://builds.apache.org/job/Atlas-0.8-IntegrationTests/ws/webapp/target/atlas-webapp-0.8.2-SNAPSHOT/,UNAVAILABLE}{/home/jenkins/jenkins-slave/workspace/Atlas-0.8-IntegrationTests/webapp/target/atlas-webapp-0.8.2-SNAPSHOT.war}>
[INFO] Server reports itself as stopped
[INFO] 
[INFO] --- maven-source-plugin:2.4:jar-no-fork (attach-sources) @ atlas-webapp ---
[INFO] Building jar: <https://builds.apache.org/job/Atlas-0.8-IntegrationTests/ws/webapp/target/atlas-webapp-0.8.2-SNAPSHOT-sources.jar>
[INFO] 
[INFO] --- maven-source-plugin:2.4:test-jar-no-fork (attach-sources) @ atlas-webapp ---
[INFO] Building jar: <https://builds.apache.org/job/Atlas-0.8-IntegrationTests/ws/webapp/target/atlas-webapp-0.8.2-SNAPSHOT-test-sources.jar>
[INFO] 
[INFO] --- maven-failsafe-plugin:2.18.1:verify (verify) @ atlas-webapp ---
[INFO] Failsafe report directory: <https://builds.apache.org/job/Atlas-0.8-IntegrationTests/ws/webapp/target/failsafe-reports>
[INFO] ------------------------------------------------------------------------
[INFO] Reactor Summary:
[INFO] 
[INFO] Apache Atlas Server Build Tools .................... SUCCESS [  0.762 s]
[INFO] apache-atlas ....................................... SUCCESS [  4.766 s]
[INFO] Apache Atlas Integration ........................... SUCCESS [ 20.910 s]
[INFO] Apache Atlas Common ................................ SUCCESS [  9.597 s]
[INFO] Apache Atlas Typesystem ............................ SUCCESS [ 58.635 s]
[INFO] Apache Atlas Client ................................ SUCCESS [  0.696 s]
[INFO] atlas-client-common ................................ SUCCESS [  7.749 s]
[INFO] atlas-client-v1 .................................... SUCCESS [  7.707 s]
[INFO] Apache Atlas Server API ............................ SUCCESS [  6.279 s]
[INFO] Apache Atlas Notification .......................... SUCCESS [ 11.052 s]
[INFO] atlas-client-v2 .................................... SUCCESS [  6.645 s]
[INFO] Apache Atlas Graph Database Projects ............... SUCCESS [  0.571 s]
[INFO] Apache Atlas Graph Database API .................... SUCCESS [  6.168 s]
[INFO] Graph Database Common Code ......................... SUCCESS [  5.577 s]
[INFO] Apache Atlas Titan 1.0.0 GraphDB Impl .............. SUCCESS [ 39.030 s]
[INFO] Shaded version of Apache hbase client .............. SUCCESS [  8.517 s]
[INFO] Apache Atlas Titan 0.5.4 Graph DB Impl ............. SUCCESS [ 38.530 s]
[INFO] Apache Atlas Graph Database Implementation Dependencies SUCCESS [  0.685 s]
[INFO] Shaded version of Apache hbase server .............. SUCCESS [ 23.122 s]
[INFO] Apache Atlas Repository ............................ SUCCESS [01:24 min]
[INFO] Apache Atlas Authorization ......................... SUCCESS [  9.815 s]
[INFO] Apache Atlas Business Catalog ...................... SUCCESS [ 13.044 s]
[INFO] Apache Atlas UI .................................... SUCCESS [01:33 min]
[INFO] Apache Atlas Web Application ....................... FAILURE [03:40 min]
[INFO] Apache Atlas Documentation ......................... SKIPPED
[INFO] Apache Atlas FileSystem Model ...................... SKIPPED
[INFO] Apache Atlas Plugin Classloader .................... SKIPPED
[INFO] Apache Atlas Hive Bridge Shim ...................... SKIPPED
[INFO] Apache Atlas Hive Bridge ........................... SKIPPED
[INFO] Apache Atlas Falcon Bridge Shim .................... SKIPPED
[INFO] Apache Atlas Falcon Bridge ......................... SKIPPED
[INFO] Apache Atlas Sqoop Bridge Shim ..................... SKIPPED
[INFO] Apache Atlas Sqoop Bridge .......................... SKIPPED
[INFO] Apache Atlas Storm Bridge Shim ..................... SKIPPED
[INFO] Apache Atlas Storm Bridge .......................... SKIPPED
[INFO] Apache Atlas Hbase Bridge Shim ..................... SKIPPED
[INFO] Apache Atlas Hbase Bridge .......................... SKIPPED
[INFO] Apache Atlas Distribution .......................... SKIPPED
[INFO] ------------------------------------------------------------------------
[INFO] BUILD FAILURE
[INFO] ------------------------------------------------------------------------
[INFO] Total time: 11:19 min
[INFO] Finished at: 2017-10-26T21:16:26Z
[INFO] Final Memory: 371M/2410M
[INFO] ------------------------------------------------------------------------
log4j:WARN No appenders could be found for logger (org.apache.zookeeper.ClientCnxn).
log4j:WARN Please initialize the log4j system properly.
log4j:WARN See http://logging.apache.org/log4j/1.2/faq.html#noconfig for more info.
[ERROR] Failed to execute goal org.apache.maven.plugins:maven-failsafe-plugin:2.18.1:verify
(verify) on project atlas-webapp: There are test failures.
[ERROR] 
[ERROR] Please refer to <https://builds.apache.org/job/Atlas-0.8-IntegrationTests/ws/webapp/target/failsafe-reports>
for the individual test results.
[ERROR] -> [Help 1]
[ERROR] 
[ERROR] To see the full stack trace of the errors, re-run Maven with the -e switch.
[ERROR] Re-run Maven using the -X switch to enable full debug logging.
[ERROR] 
[ERROR] For more information about the errors and possible solutions, please read the following
articles:
[ERROR] [Help 1] http://cwiki.apache.org/confluence/display/MAVEN/MojoFailureException
[ERROR] 
[ERROR] After correcting the problems, you can resume the build with the command
[ERROR]   mvn <goals> -rf :atlas-webapp
Build step 'Execute shell' marked build as failure
[CHECKSTYLE] Collecting checkstyle analysis files...
[CHECKSTYLE] Searching for all files in <https://builds.apache.org/job/Atlas-0.8-IntegrationTests/ws/>
that match the pattern **/target/checkstyle-result.xml
[CHECKSTYLE] Parsing 22 files in <https://builds.apache.org/job/Atlas-0.8-IntegrationTests/ws/>
[CHECKSTYLE] Successfully parsed file <https://builds.apache.org/job/Atlas-0.8-IntegrationTests/ws/authorization/target/checkstyle-result.xml>
with 467 unique warnings and 0 duplicates.
[CHECKSTYLE] Successfully parsed file <https://builds.apache.org/job/Atlas-0.8-IntegrationTests/ws/catalog/target/checkstyle-result.xml>
with 2604 unique warnings and 0 duplicates.
[CHECKSTYLE] Successfully parsed file <https://builds.apache.org/job/Atlas-0.8-IntegrationTests/ws/client/client-v1/target/checkstyle-result.xml>
with 3480 unique warnings and 0 duplicates.
[CHECKSTYLE] Successfully parsed file <https://builds.apache.org/job/Atlas-0.8-IntegrationTests/ws/client/client-v2/target/checkstyle-result.xml>
with 3805 unique warnings and 0 duplicates.
[CHECKSTYLE] Successfully parsed file <https://builds.apache.org/job/Atlas-0.8-IntegrationTests/ws/client/common/target/checkstyle-result.xml>
with 4295 unique warnings and 0 duplicates.
[CHECKSTYLE] Successfully parsed file <https://builds.apache.org/job/Atlas-0.8-IntegrationTests/ws/client/target/checkstyle-result.xml>
with 4295 unique warnings and 0 duplicates.
[CHECKSTYLE] Successfully parsed file <https://builds.apache.org/job/Atlas-0.8-IntegrationTests/ws/common/target/checkstyle-result.xml>
with 5254 unique warnings and 0 duplicates.
[CHECKSTYLE] Successfully parsed file <https://builds.apache.org/job/Atlas-0.8-IntegrationTests/ws/dashboardv2/target/checkstyle-result.xml>
with 5254 unique warnings and 0 duplicates.
[CHECKSTYLE] Successfully parsed file <https://builds.apache.org/job/Atlas-0.8-IntegrationTests/ws/graphdb/api/target/checkstyle-result.xml>
with 5527 unique warnings and 0 duplicates.
[CHECKSTYLE] Successfully parsed file <https://builds.apache.org/job/Atlas-0.8-IntegrationTests/ws/graphdb/common/target/checkstyle-result.xml>
with 5714 unique warnings and 0 duplicates.
[CHECKSTYLE] Successfully parsed file <https://builds.apache.org/job/Atlas-0.8-IntegrationTests/ws/graphdb/graphdb-impls/target/checkstyle-result.xml>
with 5714 unique warnings and 0 duplicates.
[CHECKSTYLE] Successfully parsed file <https://builds.apache.org/job/Atlas-0.8-IntegrationTests/ws/graphdb/target/checkstyle-result.xml>
with 5714 unique warnings and 0 duplicates.
[CHECKSTYLE] Successfully parsed file <https://builds.apache.org/job/Atlas-0.8-IntegrationTests/ws/graphdb/titan0/target/checkstyle-result.xml>
with 8169 unique warnings and 0 duplicates.
[CHECKSTYLE] Successfully parsed file <https://builds.apache.org/job/Atlas-0.8-IntegrationTests/ws/graphdb/titan1/target/checkstyle-result.xml>
with 9136 unique warnings and 0 duplicates.
[CHECKSTYLE] Successfully parsed file <https://builds.apache.org/job/Atlas-0.8-IntegrationTests/ws/intg/target/checkstyle-result.xml>
with 15850 unique warnings and 0 duplicates.
[CHECKSTYLE] Successfully parsed file <https://builds.apache.org/job/Atlas-0.8-IntegrationTests/ws/notification/target/checkstyle-result.xml>
with 17415 unique warnings and 0 duplicates.
[CHECKSTYLE] Successfully parsed file <https://builds.apache.org/job/Atlas-0.8-IntegrationTests/ws/repository/target/checkstyle-result.xml>
with 36354 unique warnings and 0 duplicates.
[CHECKSTYLE] Successfully parsed file <https://builds.apache.org/job/Atlas-0.8-IntegrationTests/ws/server-api/target/checkstyle-result.xml>
with 36747 unique warnings and 0 duplicates.
[CHECKSTYLE] Successfully parsed file <https://builds.apache.org/job/Atlas-0.8-IntegrationTests/ws/shaded/hbase-client-shaded/target/checkstyle-result.xml>
with 36747 unique warnings and 0 duplicates.
[CHECKSTYLE] Successfully parsed file <https://builds.apache.org/job/Atlas-0.8-IntegrationTests/ws/shaded/hbase-server-shaded/target/checkstyle-result.xml>
with 36747 unique warnings and 0 duplicates.
[CHECKSTYLE] Successfully parsed file <https://builds.apache.org/job/Atlas-0.8-IntegrationTests/ws/target/checkstyle-result.xml>
with 36747 unique warnings and 0 duplicates.
[CHECKSTYLE] Successfully parsed file <https://builds.apache.org/job/Atlas-0.8-IntegrationTests/ws/typesystem/target/checkstyle-result.xml>
with 40965 unique warnings and 0 duplicates.
<Git Blamer> Using GitBlamer to create author and commit information for all warnings.
<Git Blamer> GIT_COMMIT=8db1c77b3d693ccffbd96cb498d03aede54d3459, workspace=<https://builds.apache.org/job/Atlas-0.8-IntegrationTests/ws/>
 > git rev-parse 8db1c77b3d693ccffbd96cb498d03aede54d3459^{commit} # timeout=10
[FINDBUGS] Collecting findbugs analysis files...
[FINDBUGS] Searching for all files in <https://builds.apache.org/job/Atlas-0.8-IntegrationTests/ws/>
that match the pattern **/target/findbugs.xml
[FINDBUGS] Parsing 15 files in <https://builds.apache.org/job/Atlas-0.8-IntegrationTests/ws/>
[FINDBUGS] Successfully parsed file <https://builds.apache.org/job/Atlas-0.8-IntegrationTests/ws/authorization/target/findbugs.xml>
with 0 unique warnings and 0 duplicates.
[FINDBUGS] Successfully parsed file <https://builds.apache.org/job/Atlas-0.8-IntegrationTests/ws/catalog/target/findbugs.xml>
with 0 unique warnings and 0 duplicates.
[FINDBUGS] Successfully parsed file <https://builds.apache.org/job/Atlas-0.8-IntegrationTests/ws/client/client-v1/target/findbugs.xml>
with 0 unique warnings and 0 duplicates.
[FINDBUGS] Successfully parsed file <https://builds.apache.org/job/Atlas-0.8-IntegrationTests/ws/client/client-v2/target/findbugs.xml>
with 0 unique warnings and 0 duplicates.
[FINDBUGS] Successfully parsed file <https://builds.apache.org/job/Atlas-0.8-IntegrationTests/ws/client/common/target/findbugs.xml>
with 0 unique warnings and 0 duplicates.
[FINDBUGS] Successfully parsed file <https://builds.apache.org/job/Atlas-0.8-IntegrationTests/ws/common/target/findbugs.xml>
with 0 unique warnings and 0 duplicates.
[FINDBUGS] Successfully parsed file <https://builds.apache.org/job/Atlas-0.8-IntegrationTests/ws/graphdb/api/target/findbugs.xml>
with 0 unique warnings and 0 duplicates.
[FINDBUGS] Successfully parsed file <https://builds.apache.org/job/Atlas-0.8-IntegrationTests/ws/graphdb/common/target/findbugs.xml>
with 0 unique warnings and 0 duplicates.
[FINDBUGS] Successfully parsed file <https://builds.apache.org/job/Atlas-0.8-IntegrationTests/ws/graphdb/titan0/target/findbugs.xml>
with 0 unique warnings and 0 duplicates.
[FINDBUGS] Successfully parsed file <https://builds.apache.org/job/Atlas-0.8-IntegrationTests/ws/graphdb/titan1/target/findbugs.xml>
with 0 unique warnings and 0 duplicates.
[FINDBUGS] Successfully parsed file <https://builds.apache.org/job/Atlas-0.8-IntegrationTests/ws/intg/target/findbugs.xml>
with 0 unique warnings and 0 duplicates.
[FINDBUGS] Successfully parsed file <https://builds.apache.org/job/Atlas-0.8-IntegrationTests/ws/notification/target/findbugs.xml>
with 0 unique warnings and 0 duplicates.
[FINDBUGS] Successfully parsed file <https://builds.apache.org/job/Atlas-0.8-IntegrationTests/ws/repository/target/findbugs.xml>
with 0 unique warnings and 0 duplicates.
[FINDBUGS] Successfully parsed file <https://builds.apache.org/job/Atlas-0.8-IntegrationTests/ws/server-api/target/findbugs.xml>
with 0 unique warnings and 0 duplicates.
[FINDBUGS] Successfully parsed file <https://builds.apache.org/job/Atlas-0.8-IntegrationTests/ws/typesystem/target/findbugs.xml>
with 0 unique warnings and 0 duplicates.
<Git Blamer> Using GitBlamer to create author and commit information for all warnings.
<Git Blamer> GIT_COMMIT=8db1c77b3d693ccffbd96cb498d03aede54d3459, workspace=<https://builds.apache.org/job/Atlas-0.8-IntegrationTests/ws/>
Archiving artifacts
[Fast Archiver] No prior successful build to compare, so performing full copy of artifacts
TestNG Reports Processing: START
Looking for TestNG results report in workspace using pattern: **/target/surefire-reports/testng-results.xml,**/target/failsafe-reports/testng-results.xml
Saving reports...
Processing '/x1/jenkins/jenkins-home/jobs/Atlas-0.8-IntegrationTests/builds/121/testng/testng-results.xml'
TestNG Reports Processing: FINISH

Mime
View raw message