atlas-dev mailing list archives

Site index · List index
Message view « Date » · « Thread »
Top « Date » · « Thread »
From Apache Jenkins Server <jenk...@builds.apache.org>
Subject Build failed in Jenkins: Atlas-0.8-IntegrationTests #84
Date Wed, 27 Sep 2017 01:06:17 GMT
See <https://builds.apache.org/job/Atlas-0.8-IntegrationTests/84/display/redirect?page=changes>

Changes:

[madhan] ATLAS-2174: code improvements and validations

------------------------------------------
[...truncated 60.76 MB...]
	at org.apache.maven.DefaultMaven.doExecute(DefaultMaven.java:309)
	at org.apache.maven.DefaultMaven.doExecute(DefaultMaven.java:194)
	at org.apache.maven.DefaultMaven.execute(DefaultMaven.java:107)
	at org.apache.maven.cli.MavenCli.execute(MavenCli.java:993)
	at org.apache.maven.cli.MavenCli.doMain(MavenCli.java:345)
	at org.apache.maven.cli.MavenCli.main(MavenCli.java:191)
	at sun.reflect.NativeMethodAccessorImpl.invoke0(Native Method)
	at sun.reflect.NativeMethodAccessorImpl.invoke(NativeMethodAccessorImpl.java:57)
	at sun.reflect.DelegatingMethodAccessorImpl.invoke(DelegatingMethodAccessorImpl.java:43)
	at java.lang.reflect.Method.invoke(Method.java:606)
	at org.codehaus.plexus.classworlds.launcher.Launcher.launchEnhanced(Launcher.java:289)
	at org.codehaus.plexus.classworlds.launcher.Launcher.launch(Launcher.java:229)
	at org.codehaus.plexus.classworlds.launcher.Launcher.mainWithExitCode(Launcher.java:415)
	at org.codehaus.plexus.classworlds.launcher.Launcher.main(Launcher.java:356)
[INFO] 
[INFO] --- maven-source-plugin:2.4:jar-no-fork (attach-sources) @ hive-bridge ---
[INFO] Building jar: <https://builds.apache.org/job/Atlas-0.8-IntegrationTests/ws/addons/hive-bridge/target/hive-bridge-0.8.2-SNAPSHOT-sources.jar>
[INFO] 
[INFO] --- maven-source-plugin:2.4:test-jar-no-fork (attach-sources) @ hive-bridge ---
[INFO] Building jar: <https://builds.apache.org/job/Atlas-0.8-IntegrationTests/ws/addons/hive-bridge/target/hive-bridge-0.8.2-SNAPSHOT-test-sources.jar>
[INFO] 
[INFO] --- maven-failsafe-plugin:2.19.1:verify (verify) @ hive-bridge ---
[INFO] ------------------------------------------------------------------------
[INFO] Reactor Summary:
[INFO] 
[INFO] Apache Atlas Server Build Tools .................... SUCCESS [  0.862 s]
[INFO] apache-atlas ....................................... SUCCESS [  4.281 s]
[INFO] Apache Atlas Integration ........................... SUCCESS [ 26.984 s]
[INFO] Apache Atlas Common ................................ SUCCESS [ 14.107 s]
[INFO] Apache Atlas Typesystem ............................ SUCCESS [01:03 min]
[INFO] Apache Atlas Client ................................ SUCCESS [ 15.813 s]
[INFO] Apache Atlas Server API ............................ SUCCESS [  9.497 s]
[INFO] Apache Atlas Notification .......................... SUCCESS [ 15.129 s]
[INFO] Apache Atlas Graph Database Projects ............... SUCCESS [  0.587 s]
[INFO] Apache Atlas Graph Database API .................... SUCCESS [  7.271 s]
[INFO] Graph Database Common Code ......................... SUCCESS [  7.658 s]
[INFO] Apache Atlas Titan 1.0.0 GraphDB Impl .............. SUCCESS [ 31.086 s]
[INFO] Shaded version of Apache hbase client .............. SUCCESS [  8.452 s]
[INFO] Apache Atlas Titan 0.5.4 Graph DB Impl ............. SUCCESS [ 42.418 s]
[INFO] Apache Atlas Graph Database Implementation Dependencies SUCCESS [  0.643 s]
[INFO] Shaded version of Apache hbase server .............. SUCCESS [ 23.250 s]
[INFO] Apache Atlas Repository ............................ SUCCESS [01:46 min]
[INFO] Apache Atlas Authorization ......................... SUCCESS [ 11.592 s]
[INFO] Apache Atlas Business Catalog ...................... SUCCESS [ 15.971 s]
[INFO] Apache Atlas UI .................................... SUCCESS [01:34 min]
[INFO] Apache Atlas Web Application ....................... SUCCESS [05:19 min]
[INFO] Apache Atlas Documentation ......................... SUCCESS [  6.326 s]
[INFO] Apache Atlas FileSystem Model ...................... SUCCESS [  1.848 s]
[INFO] Apache Atlas Plugin Classloader .................... SUCCESS [ 10.190 s]
[INFO] Apache Atlas Hive Bridge Shim ...................... SUCCESS [  7.940 s]
[INFO] Apache Atlas Hive Bridge ........................... FAILURE [07:08 min]
[INFO] Apache Atlas Falcon Bridge Shim .................... SKIPPED
[INFO] Apache Atlas Falcon Bridge ......................... SKIPPED
[INFO] Apache Atlas Sqoop Bridge Shim ..................... SKIPPED
[INFO] Apache Atlas Sqoop Bridge .......................... SKIPPED
[INFO] Apache Atlas Storm Bridge Shim ..................... SKIPPED
[INFO] Apache Atlas Storm Bridge .......................... SKIPPED
[INFO] Apache Atlas Distribution .......................... SKIPPED
[INFO] ------------------------------------------------------------------------
[INFO] BUILD FAILURE
[INFO] ------------------------------------------------------------------------
[INFO] Total time: 21:17 min
[INFO] Finished at: 2017-09-27T01:01:07Z
[INFO] Final Memory: 589M/2142M
[INFO] ------------------------------------------------------------------------
[ERROR] Failed to execute goal org.apache.maven.plugins:maven-failsafe-plugin:2.19.1:verify
(verify) on project hive-bridge: There are test failures.
[ERROR] 
[ERROR] Please refer to <https://builds.apache.org/job/Atlas-0.8-IntegrationTests/ws/addons/hive-bridge/target/failsafe-reports>
for the individual test results.
[ERROR] -> [Help 1]
[ERROR] 
[ERROR] To see the full stack trace of the errors, re-run Maven with the -e switch.
[ERROR] Re-run Maven using the -X switch to enable full debug logging.
[ERROR] 
[ERROR] For more information about the errors and possible solutions, please read the following
articles:
[ERROR] [Help 1] http://cwiki.apache.org/confluence/display/MAVEN/MojoFailureException
[ERROR] 
[ERROR] After correcting the problems, you can resume the build with the command
[ERROR]   mvn <goals> -rf :hive-bridge
2017-09-27 01:01:10,476 ERROR - [main:] ~ Could not commit transaction [238] due to storage
exception in commit (StandardTitanGraph:673)
com.thinkaurelius.titan.core.TitanException: Could not execute operation due to backend exception
	at com.thinkaurelius.titan.diskstorage.util.BackendOperation.execute(BackendOperation.java:44)
	at com.thinkaurelius.titan.diskstorage.keycolumnvalue.cache.CacheTransaction.persist(CacheTransaction.java:86)
	at com.thinkaurelius.titan.diskstorage.keycolumnvalue.cache.CacheTransaction.flushInternal(CacheTransaction.java:140)
	at com.thinkaurelius.titan.diskstorage.keycolumnvalue.cache.CacheTransaction.commit(CacheTransaction.java:197)
	at com.thinkaurelius.titan.diskstorage.BackendTransaction.commitStorage(BackendTransaction.java:117)
	at com.thinkaurelius.titan.graphdb.database.StandardTitanGraph.commit(StandardTitanGraph.java:670)
	at com.thinkaurelius.titan.graphdb.transaction.StandardTitanTx.commit(StandardTitanTx.java:1337)
	at com.thinkaurelius.titan.graphdb.blueprints.TitanBlueprintsGraph.shutdown(TitanBlueprintsGraph.java:120)
	at com.thinkaurelius.titan.graphdb.database.StandardTitanGraph.shutdownInternal(StandardTitanGraph.java:171)
	at com.thinkaurelius.titan.graphdb.database.StandardTitanGraph.access$700(StandardTitanGraph.java:75)
	at com.thinkaurelius.titan.graphdb.database.StandardTitanGraph$ShutdownThread.start(StandardTitanGraph.java:756)
	at java.lang.ApplicationShutdownHooks.runHooks(ApplicationShutdownHooks.java:102)
	at java.lang.ApplicationShutdownHooks$1.run(ApplicationShutdownHooks.java:46)
	at java.lang.Shutdown.runHooks(Shutdown.java:123)
	at java.lang.Shutdown.sequence(Shutdown.java:167)
	at java.lang.Shutdown.exit(Shutdown.java:212)
	at java.lang.Runtime.exit(Runtime.java:109)
	at java.lang.System.exit(System.java:962)
	at org.codehaus.plexus.classworlds.launcher.Launcher.main(Launcher.java:358)
Caused by: com.thinkaurelius.titan.diskstorage.PermanentBackendException: Permanent failure
in storage backend
	at com.thinkaurelius.titan.diskstorage.berkeleyje.BerkeleyJEKeyValueStore.insert(BerkeleyJEKeyValueStore.java:206)
	at com.thinkaurelius.titan.diskstorage.berkeleyje.BerkeleyJEKeyValueStore.insert(BerkeleyJEKeyValueStore.java:183)
	at com.thinkaurelius.titan.diskstorage.berkeleyje.BerkeleyJEStoreManager.mutateMany(BerkeleyJEStoreManager.java:193)
	at com.thinkaurelius.titan.diskstorage.keycolumnvalue.keyvalue.OrderedKeyValueStoreManagerAdapter.mutateMany(OrderedKeyValueStoreManagerAdapter.java:100)
	at com.thinkaurelius.titan.diskstorage.keycolumnvalue.cache.CacheTransaction$1.call(CacheTransaction.java:89)
	at com.thinkaurelius.titan.diskstorage.keycolumnvalue.cache.CacheTransaction$1.call(CacheTransaction.java:86)
	at com.thinkaurelius.titan.diskstorage.util.BackendOperation.executeDirect(BackendOperation.java:56)
	at com.thinkaurelius.titan.diskstorage.util.BackendOperation.execute(BackendOperation.java:42)
	... 18 more
Caused by: com.sleepycat.je.LockTimeoutException: (JE 5.0.73) Lock expired. Locker 1425472326
13715_NotificationHookConsumer thread-0_Txn: waited for lock on database=edgestore LockAddr:1426959041
LSN=0x0/0x594015 type=WRITE grant=WAIT_NEW timeoutMillis=500 startTime=1506474069976 endTime=1506474070476
Owners: [<LockInfo locker="5817252 13708_qtp1857194534-766_Txn" type="READ"/>, <LockInfo
locker="2004163314 13686_qtp1857194534-767_Txn" type="READ"/>, <LockInfo locker="131294725
13698_qtp1857194534-764_Txn" type="READ"/>]
Waiters: []

	at com.sleepycat.je.txn.LockManager.newLockTimeoutException(LockManager.java:664)
	at com.sleepycat.je.txn.LockManager.makeTimeoutMsgInternal(LockManager.java:623)
	at com.sleepycat.je.txn.SyncedLockManager.makeTimeoutMsg(SyncedLockManager.java:97)
	at com.sleepycat.je.txn.LockManager.lockInternal(LockManager.java:390)
	at com.sleepycat.je.txn.LockManager.lock(LockManager.java:276)
	at com.sleepycat.je.txn.Txn.lockInternal(Txn.java:498)
	at com.sleepycat.je.txn.Locker.lock(Locker.java:443)
	at com.sleepycat.je.dbi.CursorImpl.lockLN(CursorImpl.java:2621)
	at com.sleepycat.je.dbi.CursorImpl.getSlotReuseInfo(CursorImpl.java:1091)
	at com.sleepycat.je.dbi.CursorImpl.putInternal(CursorImpl.java:880)
	at com.sleepycat.je.dbi.CursorImpl.put(CursorImpl.java:811)
	at com.sleepycat.je.Cursor.putAllowPhantoms(Cursor.java:2243)
	at com.sleepycat.je.Cursor.putNoNotify(Cursor.java:2200)
	at com.sleepycat.je.Cursor.putNotify(Cursor.java:2117)
	at com.sleepycat.je.Cursor.putNoDups(Cursor.java:2052)
	at com.sleepycat.je.Cursor.putInternal(Cursor.java:2020)
	at com.sleepycat.je.Database.putInternal(Database.java:1302)
	at com.sleepycat.je.Database.put(Database.java:1172)
	at com.thinkaurelius.titan.diskstorage.berkeleyje.BerkeleyJEKeyValueStore.insert(BerkeleyJEKeyValueStore.java:194)
	... 25 more
2017-09-27 01:01:10,477 ERROR - [main:] ~ Could not commit transaction [238] due to exception
(StandardTitanGraph:731)
com.thinkaurelius.titan.core.TitanException: Could not execute operation due to backend exception
	at com.thinkaurelius.titan.diskstorage.util.BackendOperation.execute(BackendOperation.java:44)
	at com.thinkaurelius.titan.diskstorage.keycolumnvalue.cache.CacheTransaction.persist(CacheTransaction.java:86)
	at com.thinkaurelius.titan.diskstorage.keycolumnvalue.cache.CacheTransaction.flushInternal(CacheTransaction.java:140)
	at com.thinkaurelius.titan.diskstorage.keycolumnvalue.cache.CacheTransaction.commit(CacheTransaction.java:197)
	at com.thinkaurelius.titan.diskstorage.BackendTransaction.commitStorage(BackendTransaction.java:117)
	at com.thinkaurelius.titan.graphdb.database.StandardTitanGraph.commit(StandardTitanGraph.java:670)
	at com.thinkaurelius.titan.graphdb.transaction.StandardTitanTx.commit(StandardTitanTx.java:1337)
	at com.thinkaurelius.titan.graphdb.blueprints.TitanBlueprintsGraph.shutdown(TitanBlueprintsGraph.java:120)
	at com.thinkaurelius.titan.graphdb.database.StandardTitanGraph.shutdownInternal(StandardTitanGraph.java:171)
	at com.thinkaurelius.titan.graphdb.database.StandardTitanGraph.access$700(StandardTitanGraph.java:75)
	at com.thinkaurelius.titan.graphdb.database.StandardTitanGraph$ShutdownThread.start(StandardTitanGraph.java:756)
	at java.lang.ApplicationShutdownHooks.runHooks(ApplicationShutdownHooks.java:102)
	at java.lang.ApplicationShutdownHooks$1.run(ApplicationShutdownHooks.java:46)
	at java.lang.Shutdown.runHooks(Shutdown.java:123)
	at java.lang.Shutdown.sequence(Shutdown.java:167)
	at java.lang.Shutdown.exit(Shutdown.java:212)
	at java.lang.Runtime.exit(Runtime.java:109)
	at java.lang.System.exit(System.java:962)
	at org.codehaus.plexus.classworlds.launcher.Launcher.main(Launcher.java:358)
Caused by: com.thinkaurelius.titan.diskstorage.PermanentBackendException: Permanent failure
in storage backend
	at com.thinkaurelius.titan.diskstorage.berkeleyje.BerkeleyJEKeyValueStore.insert(BerkeleyJEKeyValueStore.java:206)
	at com.thinkaurelius.titan.diskstorage.berkeleyje.BerkeleyJEKeyValueStore.insert(BerkeleyJEKeyValueStore.java:183)
	at com.thinkaurelius.titan.diskstorage.berkeleyje.BerkeleyJEStoreManager.mutateMany(BerkeleyJEStoreManager.java:193)
	at com.thinkaurelius.titan.diskstorage.keycolumnvalue.keyvalue.OrderedKeyValueStoreManagerAdapter.mutateMany(OrderedKeyValueStoreManagerAdapter.java:100)
	at com.thinkaurelius.titan.diskstorage.keycolumnvalue.cache.CacheTransaction$1.call(CacheTransaction.java:89)
	at com.thinkaurelius.titan.diskstorage.keycolumnvalue.cache.CacheTransaction$1.call(CacheTransaction.java:86)
	at com.thinkaurelius.titan.diskstorage.util.BackendOperation.executeDirect(BackendOperation.java:56)
	at com.thinkaurelius.titan.diskstorage.util.BackendOperation.execute(BackendOperation.java:42)
	... 18 more
Caused by: com.sleepycat.je.LockTimeoutException: (JE 5.0.73) Lock expired. Locker 1425472326
13715_NotificationHookConsumer thread-0_Txn: waited for lock on database=edgestore LockAddr:1426959041
LSN=0x0/0x594015 type=WRITE grant=WAIT_NEW timeoutMillis=500 startTime=1506474069976 endTime=1506474070476
Owners: [<LockInfo locker="5817252 13708_qtp1857194534-766_Txn" type="READ"/>, <LockInfo
locker="2004163314 13686_qtp1857194534-767_Txn" type="READ"/>, <LockInfo locker="131294725
13698_qtp1857194534-764_Txn" type="READ"/>]
Waiters: []

	at com.sleepycat.je.txn.LockManager.newLockTimeoutException(LockManager.java:664)
	at com.sleepycat.je.txn.LockManager.makeTimeoutMsgInternal(LockManager.java:623)
	at com.sleepycat.je.txn.SyncedLockManager.makeTimeoutMsg(SyncedLockManager.java:97)
	at com.sleepycat.je.txn.LockManager.lockInternal(LockManager.java:390)
	at com.sleepycat.je.txn.LockManager.lock(LockManager.java:276)
	at com.sleepycat.je.txn.Txn.lockInternal(Txn.java:498)
	at com.sleepycat.je.txn.Locker.lock(Locker.java:443)
	at com.sleepycat.je.dbi.CursorImpl.lockLN(CursorImpl.java:2621)
	at com.sleepycat.je.dbi.CursorImpl.getSlotReuseInfo(CursorImpl.java:1091)
	at com.sleepycat.je.dbi.CursorImpl.putInternal(CursorImpl.java:880)
	at com.sleepycat.je.dbi.CursorImpl.put(CursorImpl.java:811)
	at com.sleepycat.je.Cursor.putAllowPhantoms(Cursor.java:2243)
	at com.sleepycat.je.Cursor.putNoNotify(Cursor.java:2200)
	at com.sleepycat.je.Cursor.putNotify(Cursor.java:2117)
	at com.sleepycat.je.Cursor.putNoDups(Cursor.java:2052)
	at com.sleepycat.je.Cursor.putInternal(Cursor.java:2020)
	at com.sleepycat.je.Database.putInternal(Database.java:1302)
	at com.sleepycat.je.Database.put(Database.java:1172)
	at com.thinkaurelius.titan.diskstorage.berkeleyje.BerkeleyJEKeyValueStore.insert(BerkeleyJEKeyValueStore.java:194)
	... 25 more
Build step 'Execute shell' marked build as failure
[CHECKSTYLE] Collecting checkstyle analysis files...
[CHECKSTYLE] Searching for all files in <https://builds.apache.org/job/Atlas-0.8-IntegrationTests/ws/>
that match the pattern **/target/checkstyle-result.xml
[CHECKSTYLE] Parsing 24 files in <https://builds.apache.org/job/Atlas-0.8-IntegrationTests/ws/>
[CHECKSTYLE] Successfully parsed file <https://builds.apache.org/job/Atlas-0.8-IntegrationTests/ws/addons/hdfs-model/target/checkstyle-result.xml>
with 0 unique warnings and 0 duplicates.
[CHECKSTYLE] Successfully parsed file <https://builds.apache.org/job/Atlas-0.8-IntegrationTests/ws/addons/hive-bridge-shim/target/checkstyle-result.xml>
with 15 unique warnings and 0 duplicates.
[CHECKSTYLE] Successfully parsed file <https://builds.apache.org/job/Atlas-0.8-IntegrationTests/ws/authorization/target/checkstyle-result.xml>
with 482 unique warnings and 0 duplicates.
[CHECKSTYLE] Successfully parsed file <https://builds.apache.org/job/Atlas-0.8-IntegrationTests/ws/catalog/target/checkstyle-result.xml>
with 2619 unique warnings and 0 duplicates.
[CHECKSTYLE] Successfully parsed file <https://builds.apache.org/job/Atlas-0.8-IntegrationTests/ws/client/target/checkstyle-result.xml>
with 4257 unique warnings and 0 duplicates.
[CHECKSTYLE] Successfully parsed file <https://builds.apache.org/job/Atlas-0.8-IntegrationTests/ws/common/target/checkstyle-result.xml>
with 5468 unique warnings and 0 duplicates.
[CHECKSTYLE] Successfully parsed file <https://builds.apache.org/job/Atlas-0.8-IntegrationTests/ws/dashboardv2/target/checkstyle-result.xml>
with 5468 unique warnings and 0 duplicates.
[CHECKSTYLE] Successfully parsed file <https://builds.apache.org/job/Atlas-0.8-IntegrationTests/ws/docs/target/checkstyle-result.xml>
with 5468 unique warnings and 0 duplicates.
[CHECKSTYLE] Successfully parsed file <https://builds.apache.org/job/Atlas-0.8-IntegrationTests/ws/graphdb/api/target/checkstyle-result.xml>
with 5741 unique warnings and 0 duplicates.
[CHECKSTYLE] Successfully parsed file <https://builds.apache.org/job/Atlas-0.8-IntegrationTests/ws/graphdb/common/target/checkstyle-result.xml>
with 5928 unique warnings and 0 duplicates.
[CHECKSTYLE] Successfully parsed file <https://builds.apache.org/job/Atlas-0.8-IntegrationTests/ws/graphdb/graphdb-impls/target/checkstyle-result.xml>
with 5928 unique warnings and 0 duplicates.
[CHECKSTYLE] Successfully parsed file <https://builds.apache.org/job/Atlas-0.8-IntegrationTests/ws/graphdb/target/checkstyle-result.xml>
with 5928 unique warnings and 0 duplicates.
[CHECKSTYLE] Successfully parsed file <https://builds.apache.org/job/Atlas-0.8-IntegrationTests/ws/graphdb/titan0/target/checkstyle-result.xml>
with 8330 unique warnings and 0 duplicates.
[CHECKSTYLE] Successfully parsed file <https://builds.apache.org/job/Atlas-0.8-IntegrationTests/ws/graphdb/titan1/target/checkstyle-result.xml>
with 9297 unique warnings and 0 duplicates.
[CHECKSTYLE] Successfully parsed file <https://builds.apache.org/job/Atlas-0.8-IntegrationTests/ws/intg/target/checkstyle-result.xml>
with 15748 unique warnings and 0 duplicates.
[CHECKSTYLE] Successfully parsed file <https://builds.apache.org/job/Atlas-0.8-IntegrationTests/ws/notification/target/checkstyle-result.xml>
with 16958 unique warnings and 0 duplicates.
[CHECKSTYLE] Successfully parsed file <https://builds.apache.org/job/Atlas-0.8-IntegrationTests/ws/plugin-classloader/target/checkstyle-result.xml>
with 17071 unique warnings and 0 duplicates.
[CHECKSTYLE] Successfully parsed file <https://builds.apache.org/job/Atlas-0.8-IntegrationTests/ws/repository/target/checkstyle-result.xml>
with 35992 unique warnings and 0 duplicates.
[CHECKSTYLE] Successfully parsed file <https://builds.apache.org/job/Atlas-0.8-IntegrationTests/ws/server-api/target/checkstyle-result.xml>
with 36371 unique warnings and 0 duplicates.
[CHECKSTYLE] Successfully parsed file <https://builds.apache.org/job/Atlas-0.8-IntegrationTests/ws/shaded/hbase-client-shaded/target/checkstyle-result.xml>
with 36371 unique warnings and 0 duplicates.
[CHECKSTYLE] Successfully parsed file <https://builds.apache.org/job/Atlas-0.8-IntegrationTests/ws/shaded/hbase-server-shaded/target/checkstyle-result.xml>
with 36371 unique warnings and 0 duplicates.
[CHECKSTYLE] Successfully parsed file <https://builds.apache.org/job/Atlas-0.8-IntegrationTests/ws/target/checkstyle-result.xml>
with 36371 unique warnings and 0 duplicates.
[CHECKSTYLE] Successfully parsed file <https://builds.apache.org/job/Atlas-0.8-IntegrationTests/ws/typesystem/target/checkstyle-result.xml>
with 40589 unique warnings and 0 duplicates.
[CHECKSTYLE] Successfully parsed file <https://builds.apache.org/job/Atlas-0.8-IntegrationTests/ws/webapp/target/checkstyle-result.xml>
with 48806 unique warnings and 0 duplicates.
<Git Blamer> Using GitBlamer to create author and commit information for all warnings.
<Git Blamer> GIT_COMMIT=eea405089ad7b0b25e8c9c5141a1d75edebfb5c2, workspace=<https://builds.apache.org/job/Atlas-0.8-IntegrationTests/ws/>
 > git rev-parse eea405089ad7b0b25e8c9c5141a1d75edebfb5c2^{commit} # timeout=10
<Git Blamer> Skipping file <https://builds.apache.org/job/Atlas-0.8-IntegrationTests/ws/graphdb/titan1/src/main/java/org/apache/atlas/repository/graphdb/titan1/graphson/AtlasGraphSONMode.java,>
no result found.
[FINDBUGS] Collecting findbugs analysis files...
[FINDBUGS] Searching for all files in <https://builds.apache.org/job/Atlas-0.8-IntegrationTests/ws/>
that match the pattern **/target/findbugs.xml
[FINDBUGS] Parsing 15 files in <https://builds.apache.org/job/Atlas-0.8-IntegrationTests/ws/>
[FINDBUGS] Successfully parsed file <https://builds.apache.org/job/Atlas-0.8-IntegrationTests/ws/addons/hive-bridge-shim/target/findbugs.xml>
with 0 unique warnings and 0 duplicates.
[FINDBUGS] Successfully parsed file <https://builds.apache.org/job/Atlas-0.8-IntegrationTests/ws/authorization/target/findbugs.xml>
with 0 unique warnings and 0 duplicates.
[FINDBUGS] Successfully parsed file <https://builds.apache.org/job/Atlas-0.8-IntegrationTests/ws/catalog/target/findbugs.xml>
with 0 unique warnings and 0 duplicates.
[FINDBUGS] Successfully parsed file <https://builds.apache.org/job/Atlas-0.8-IntegrationTests/ws/client/target/findbugs.xml>
with 0 unique warnings and 0 duplicates.
[FINDBUGS] Successfully parsed file <https://builds.apache.org/job/Atlas-0.8-IntegrationTests/ws/common/target/findbugs.xml>
with 0 unique warnings and 0 duplicates.
[FINDBUGS] Successfully parsed file <https://builds.apache.org/job/Atlas-0.8-IntegrationTests/ws/graphdb/api/target/findbugs.xml>
with 0 unique warnings and 0 duplicates.
[FINDBUGS] Successfully parsed file <https://builds.apache.org/job/Atlas-0.8-IntegrationTests/ws/graphdb/common/target/findbugs.xml>
with 0 unique warnings and 0 duplicates.
[FINDBUGS] Successfully parsed file <https://builds.apache.org/job/Atlas-0.8-IntegrationTests/ws/graphdb/titan0/target/findbugs.xml>
with 0 unique warnings and 0 duplicates.
[FINDBUGS] Successfully parsed file <https://builds.apache.org/job/Atlas-0.8-IntegrationTests/ws/intg/target/findbugs.xml>
with 0 unique warnings and 0 duplicates.
[FINDBUGS] Successfully parsed file <https://builds.apache.org/job/Atlas-0.8-IntegrationTests/ws/notification/target/findbugs.xml>
with 0 unique warnings and 0 duplicates.
[FINDBUGS] Successfully parsed file <https://builds.apache.org/job/Atlas-0.8-IntegrationTests/ws/plugin-classloader/target/findbugs.xml>
with 0 unique warnings and 0 duplicates.
[FINDBUGS] Successfully parsed file <https://builds.apache.org/job/Atlas-0.8-IntegrationTests/ws/repository/target/findbugs.xml>
with 0 unique warnings and 0 duplicates.
[FINDBUGS] Successfully parsed file <https://builds.apache.org/job/Atlas-0.8-IntegrationTests/ws/server-api/target/findbugs.xml>
with 0 unique warnings and 0 duplicates.
[FINDBUGS] Successfully parsed file <https://builds.apache.org/job/Atlas-0.8-IntegrationTests/ws/typesystem/target/findbugs.xml>
with 0 unique warnings and 0 duplicates.
[FINDBUGS] Successfully parsed file <https://builds.apache.org/job/Atlas-0.8-IntegrationTests/ws/webapp/target/findbugs.xml>
with 0 unique warnings and 0 duplicates.
<Git Blamer> Using GitBlamer to create author and commit information for all warnings.
<Git Blamer> GIT_COMMIT=eea405089ad7b0b25e8c9c5141a1d75edebfb5c2, workspace=<https://builds.apache.org/job/Atlas-0.8-IntegrationTests/ws/>
Archiving artifacts
[Fast Archiver] No prior successful build to compare, so performing full copy of artifacts
TestNG Reports Processing: START
Looking for TestNG results report in workspace using pattern: **/target/surefire-reports/testng-results.xml,**/target/failsafe-reports/testng-results.xml
Saving reports...
Processing '/x1/jenkins/jenkins-home/jobs/Atlas-0.8-IntegrationTests/builds/84/testng/testng-results-1.xml'
Processing '/x1/jenkins/jenkins-home/jobs/Atlas-0.8-IntegrationTests/builds/84/testng/testng-results.xml'
16.292135% of tests failed, which exceeded threshold of 0%. Marking build as UNSTABLE
TestNG Reports Processing: FINISH

Mime
View raw message