atlas-dev mailing list archives

Site index · List index
Message view « Date » · « Thread »
Top « Date » · « Thread »
From Apache Jenkins Server <jenk...@builds.apache.org>
Subject Build failed in Jenkins: Atlas-master-IntegrationTests #131
Date Sat, 30 Sep 2017 02:54:38 GMT
See <https://builds.apache.org/job/Atlas-master-IntegrationTests/131/display/redirect?page=changes>

Changes:

[apoorvnaik] ATLAS-2184: IS_NULL, NOT_NULL operator support (#2)

------------------------------------------
[...truncated 445.29 KB...]
[INFO] Exclude: **/users-credentials.properties
[INFO] Exclude: **/public/css/animate.min.css
[INFO] Exclude: **/public/css/bootstrap-sidebar.css
[INFO] Exclude: **/public/js/external_lib/**
[INFO] Exclude: **/node_modules/**
[INFO] Exclude: **/public/js/libs/**
[INFO] Exclude: **/atlas.data/**
[INFO] Exclude: **/${sys:atlas.data}/**
[INFO] Exclude: **/policy-store.txt
[INFO] Exclude: **/*rebel*.xml
[INFO] Exclude: **/*rebel*.xml.bak
[INFO] 
[INFO] --- maven-resources-plugin:2.7:copy-resources (copy-resources) @ atlas-webapp ---
[INFO] Using 'UTF-8' encoding to copy filtered resources.
[INFO] Copying 10 resources
[INFO] 
[INFO] <<< jetty-maven-plugin:9.4.0.v20161208:deploy-war (start-jetty) < validate
@ atlas-webapp <<<
[INFO] 
[INFO] 
[INFO] --- jetty-maven-plugin:9.4.0.v20161208:deploy-war (start-jetty) @ atlas-webapp ---
[WARNING] Error injecting: org.eclipse.jetty.maven.plugin.JettyDeployWar
java.lang.TypeNotPresentException: Type org.eclipse.jetty.maven.plugin.JettyDeployWar not
present
	at org.eclipse.sisu.space.URLClassSpace.loadClass(URLClassSpace.java:147)
	at org.eclipse.sisu.space.NamedClass.load(NamedClass.java:46)
	at org.eclipse.sisu.space.AbstractDeferredClass.get(AbstractDeferredClass.java:48)
	at com.google.inject.internal.ProviderInternalFactory.provision(ProviderInternalFactory.java:81)
	at com.google.inject.internal.InternalFactoryToInitializableAdapter.provision(InternalFactoryToInitializableAdapter.java:53)
	at com.google.inject.internal.ProviderInternalFactory$1.call(ProviderInternalFactory.java:65)
	at com.google.inject.internal.ProvisionListenerStackCallback$Provision.provision(ProvisionListenerStackCallback.java:115)
	at com.google.inject.internal.ProvisionListenerStackCallback$Provision.provision(ProvisionListenerStackCallback.java:133)
	at com.google.inject.internal.ProvisionListenerStackCallback.provision(ProvisionListenerStackCallback.java:68)
	at com.google.inject.internal.ProviderInternalFactory.circularGet(ProviderInternalFactory.java:63)
	at com.google.inject.internal.InternalFactoryToInitializableAdapter.get(InternalFactoryToInitializableAdapter.java:45)
	at com.google.inject.internal.InjectorImpl$2$1.call(InjectorImpl.java:1016)
	at com.google.inject.internal.InjectorImpl.callInContext(InjectorImpl.java:1092)
	at com.google.inject.internal.InjectorImpl$2.get(InjectorImpl.java:1012)
	at org.eclipse.sisu.inject.Guice4$1.get(Guice4.java:162)
	at org.eclipse.sisu.inject.LazyBeanEntry.getValue(LazyBeanEntry.java:81)
	at org.eclipse.sisu.plexus.LazyPlexusBean.getValue(LazyPlexusBean.java:51)
	at org.codehaus.plexus.DefaultPlexusContainer.lookup(DefaultPlexusContainer.java:263)
	at org.codehaus.plexus.DefaultPlexusContainer.lookup(DefaultPlexusContainer.java:255)
	at org.apache.maven.plugin.internal.DefaultMavenPluginManager.getConfiguredMojo(DefaultMavenPluginManager.java:519)
	at org.apache.maven.plugin.DefaultBuildPluginManager.executeMojo(DefaultBuildPluginManager.java:121)
	at org.apache.maven.lifecycle.internal.MojoExecutor.execute(MojoExecutor.java:208)
	at org.apache.maven.lifecycle.internal.MojoExecutor.execute(MojoExecutor.java:154)
	at org.apache.maven.lifecycle.internal.MojoExecutor.execute(MojoExecutor.java:146)
	at org.apache.maven.lifecycle.internal.LifecycleModuleBuilder.buildProject(LifecycleModuleBuilder.java:117)
	at org.apache.maven.lifecycle.internal.LifecycleModuleBuilder.buildProject(LifecycleModuleBuilder.java:81)
	at org.apache.maven.lifecycle.internal.builder.singlethreaded.SingleThreadedBuilder.build(SingleThreadedBuilder.java:51)
	at org.apache.maven.lifecycle.internal.LifecycleStarter.execute(LifecycleStarter.java:128)
	at org.apache.maven.DefaultMaven.doExecute(DefaultMaven.java:309)
	at org.apache.maven.DefaultMaven.doExecute(DefaultMaven.java:194)
	at org.apache.maven.DefaultMaven.execute(DefaultMaven.java:107)
	at org.apache.maven.cli.MavenCli.execute(MavenCli.java:993)
	at org.apache.maven.cli.MavenCli.doMain(MavenCli.java:345)
	at org.apache.maven.cli.MavenCli.main(MavenCli.java:191)
	at sun.reflect.NativeMethodAccessorImpl.invoke0(Native Method)
	at sun.reflect.NativeMethodAccessorImpl.invoke(NativeMethodAccessorImpl.java:57)
	at sun.reflect.DelegatingMethodAccessorImpl.invoke(DelegatingMethodAccessorImpl.java:43)
	at java.lang.reflect.Method.invoke(Method.java:606)
	at org.codehaus.plexus.classworlds.launcher.Launcher.launchEnhanced(Launcher.java:289)
	at org.codehaus.plexus.classworlds.launcher.Launcher.launch(Launcher.java:229)
	at org.codehaus.plexus.classworlds.launcher.Launcher.mainWithExitCode(Launcher.java:415)
	at org.codehaus.plexus.classworlds.launcher.Launcher.main(Launcher.java:356)
Caused by: java.lang.UnsupportedClassVersionError: org/eclipse/jetty/maven/plugin/JettyDeployWar
: Unsupported major.minor version 52.0
	at java.lang.ClassLoader.defineClass1(Native Method)
	at java.lang.ClassLoader.defineClass(ClassLoader.java:800)
	at java.security.SecureClassLoader.defineClass(SecureClassLoader.java:142)
	at java.net.URLClassLoader.defineClass(URLClassLoader.java:449)
	at java.net.URLClassLoader.access$100(URLClassLoader.java:71)
	at java.net.URLClassLoader$1.run(URLClassLoader.java:361)
	at java.net.URLClassLoader$1.run(URLClassLoader.java:355)
	at java.security.AccessController.doPrivileged(Native Method)
	at java.net.URLClassLoader.findClass(URLClassLoader.java:354)
	at org.codehaus.plexus.classworlds.realm.ClassRealm.loadClassFromSelf(ClassRealm.java:401)
	at org.codehaus.plexus.classworlds.strategy.SelfFirstStrategy.loadClass(SelfFirstStrategy.java:42)
	at org.codehaus.plexus.classworlds.realm.ClassRealm.unsynchronizedLoadClass(ClassRealm.java:271)
	at org.codehaus.plexus.classworlds.realm.ClassRealm.loadClass(ClassRealm.java:247)
	at org.codehaus.plexus.classworlds.realm.ClassRealm.loadClass(ClassRealm.java:239)
	at org.eclipse.sisu.space.URLClassSpace.loadClass(URLClassSpace.java:139)
	... 41 more
[INFO] ------------------------------------------------------------------------
[INFO] Reactor Summary:
[INFO] 
[INFO] Apache Atlas Server Build Tools .................... SUCCESS [  0.966 s]
[INFO] apache-atlas ....................................... SUCCESS [  4.629 s]
[INFO] Apache Atlas Integration ........................... SUCCESS [ 30.753 s]
[INFO] Apache Atlas Common ................................ SUCCESS [ 12.542 s]
[INFO] Apache Atlas Typesystem ............................ SUCCESS [01:02 min]
[INFO] Apache Atlas Client ................................ SUCCESS [  0.585 s]
[INFO] atlas-client-common ................................ SUCCESS [ 10.722 s]
[INFO] atlas-client-v1 .................................... SUCCESS [ 11.759 s]
[INFO] Apache Atlas Server API ............................ SUCCESS [  9.713 s]
[INFO] Apache Atlas Notification .......................... SUCCESS [ 14.694 s]
[INFO] atlas-client-v2 .................................... SUCCESS [  9.438 s]
[INFO] Apache Atlas Graph Database Projects ............... SUCCESS [  0.526 s]
[INFO] Apache Atlas Graph Database API .................... SUCCESS [  7.043 s]
[INFO] Graph Database Common Code ......................... SUCCESS [  7.210 s]
[INFO] Apache Atlas Titan 1.0.0 GraphDB Impl .............. SUCCESS [ 30.765 s]
[INFO] Shaded version of Apache hbase client .............. SUCCESS [  8.803 s]
[INFO] Apache Atlas Titan 0.5.4 Graph DB Impl ............. SUCCESS [ 44.790 s]
[INFO] Apache Atlas Graph Database Implementation Dependencies SUCCESS [  0.750 s]
[INFO] Shaded version of Apache hbase server .............. SUCCESS [ 24.181 s]
[INFO] Apache Atlas Repository ............................ SUCCESS [01:45 min]
[INFO] Apache Atlas Authorization ......................... SUCCESS [ 11.425 s]
[INFO] Apache Atlas Business Catalog ...................... SUCCESS [ 18.482 s]
[INFO] Apache Atlas UI .................................... SUCCESS [01:37 min]
[INFO] Apache Atlas Web Application ....................... FAILURE [ 19.170 s]
[INFO] Apache Atlas Documentation ......................... SKIPPED
[INFO] Apache Atlas FileSystem Model ...................... SKIPPED
[INFO] Apache Atlas Plugin Classloader .................... SKIPPED
[INFO] Apache Atlas Hive Bridge Shim ...................... SKIPPED
[INFO] Apache Atlas Hive Bridge ........................... SKIPPED
[INFO] Apache Atlas Falcon Bridge Shim .................... SKIPPED
[INFO] Apache Atlas Falcon Bridge ......................... SKIPPED
[INFO] Apache Atlas Sqoop Bridge Shim ..................... SKIPPED
[INFO] Apache Atlas Sqoop Bridge .......................... SKIPPED
[INFO] Apache Atlas Storm Bridge Shim ..................... SKIPPED
[INFO] Apache Atlas Storm Bridge .......................... SKIPPED
[INFO] Apache Atlas Distribution .......................... SKIPPED
[INFO] ------------------------------------------------------------------------
[INFO] BUILD FAILURE
[INFO] ------------------------------------------------------------------------
[INFO] Total time: 09:06 min
[INFO] Finished at: 2017-09-30T02:50:39Z
[INFO] Final Memory: 235M/2021M
[INFO] ------------------------------------------------------------------------
[ERROR] Failed to execute goal org.eclipse.jetty:jetty-maven-plugin:9.4.0.v20161208:deploy-war
(start-jetty) on project atlas-webapp: Execution start-jetty of goal org.eclipse.jetty:jetty-maven-plugin:9.4.0.v20161208:deploy-war
failed: Unable to load the mojo 'deploy-war' in the plugin 'org.eclipse.jetty:jetty-maven-plugin:9.4.0.v20161208'
due to an API incompatibility: org.codehaus.plexus.component.repository.exception.ComponentLookupException:
org/eclipse/jetty/maven/plugin/JettyDeployWar : Unsupported major.minor version 52.0
[ERROR] -----------------------------------------------------
[ERROR] realm =    plugin>org.eclipse.jetty:jetty-maven-plugin:9.4.0.v20161208
[ERROR] strategy = org.codehaus.plexus.classworlds.strategy.SelfFirstStrategy
[ERROR] urls[0] = file:/home/jenkins/.m2/repository/org/eclipse/jetty/jetty-maven-plugin/9.4.0.v20161208/jetty-maven-plugin-9.4.0.v20161208.jar
[ERROR] urls[1] = file:/home/jenkins/.m2/repository/org/sonatype/sisu/sisu-inject-bean/2.1.1/sisu-inject-bean-2.1.1.jar
[ERROR] urls[2] = file:/home/jenkins/.m2/repository/org/sonatype/sisu/sisu-guice/2.9.4/sisu-guice-2.9.4-no_aop.jar
[ERROR] urls[3] = file:/home/jenkins/.m2/repository/org/codehaus/plexus/plexus-utils/2.0.6/plexus-utils-2.0.6.jar
[ERROR] urls[4] = file:/home/jenkins/.m2/repository/org/apache/maven/maven-aether-provider/3.0.3/maven-aether-provider-3.0.3.jar
[ERROR] urls[5] = file:/home/jenkins/.m2/repository/org/sonatype/aether/aether-util/1.11/aether-util-1.11.jar
[ERROR] urls[6] = file:/home/jenkins/.m2/repository/org/codehaus/plexus/plexus-interpolation/1.14/plexus-interpolation-1.14.jar
[ERROR] urls[7] = file:/home/jenkins/.m2/repository/org/codehaus/plexus/plexus-component-annotations/1.5.5/plexus-component-annotations-1.5.5.jar
[ERROR] urls[8] = file:/home/jenkins/.m2/repository/org/sonatype/plexus/plexus-sec-dispatcher/1.3/plexus-sec-dispatcher-1.3.jar
[ERROR] urls[9] = file:/home/jenkins/.m2/repository/org/sonatype/plexus/plexus-cipher/1.4/plexus-cipher-1.4.jar
[ERROR] urls[10] = file:/home/jenkins/.m2/repository/org/apache/maven/plugin-tools/maven-plugin-tools-api/3.4/maven-plugin-tools-api-3.4.jar
[ERROR] urls[11] = file:/home/jenkins/.m2/repository/backport-util-concurrent/backport-util-concurrent/3.1/backport-util-concurrent-3.1.jar
[ERROR] urls[12] = file:/home/jenkins/.m2/repository/org/eclipse/jetty/jetty-util/9.4.0.v20161208/jetty-util-9.4.0.v20161208.jar
[ERROR] urls[13] = file:/home/jenkins/.m2/repository/org/eclipse/jetty/jetty-webapp/9.4.0.v20161208/jetty-webapp-9.4.0.v20161208.jar
[ERROR] urls[14] = file:/home/jenkins/.m2/repository/org/eclipse/jetty/jetty-xml/9.4.0.v20161208/jetty-xml-9.4.0.v20161208.jar
[ERROR] urls[15] = file:/home/jenkins/.m2/repository/org/eclipse/jetty/jetty-servlet/9.4.0.v20161208/jetty-servlet-9.4.0.v20161208.jar
[ERROR] urls[16] = file:/home/jenkins/.m2/repository/org/eclipse/jetty/jetty-quickstart/9.4.0.v20161208/jetty-quickstart-9.4.0.v20161208.jar
[ERROR] urls[17] = file:/home/jenkins/.m2/repository/org/eclipse/jetty/jetty-jaas/9.4.0.v20161208/jetty-jaas-9.4.0.v20161208.jar
[ERROR] urls[18] = file:/home/jenkins/.m2/repository/org/eclipse/jetty/jetty-security/9.4.0.v20161208/jetty-security-9.4.0.v20161208.jar
[ERROR] urls[19] = file:/home/jenkins/.m2/repository/org/eclipse/jetty/jetty-plus/9.4.0.v20161208/jetty-plus-9.4.0.v20161208.jar
[ERROR] urls[20] = file:/home/jenkins/.m2/repository/org/eclipse/jetty/jetty-jndi/9.4.0.v20161208/jetty-jndi-9.4.0.v20161208.jar
[ERROR] urls[21] = file:/home/jenkins/.m2/repository/org/eclipse/jetty/jetty-server/9.4.0.v20161208/jetty-server-9.4.0.v20161208.jar
[ERROR] urls[22] = file:/home/jenkins/.m2/repository/javax/servlet/javax.servlet-api/3.1.0/javax.servlet-api-3.1.0.jar
[ERROR] urls[23] = file:/home/jenkins/.m2/repository/org/eclipse/jetty/jetty-http/9.4.0.v20161208/jetty-http-9.4.0.v20161208.jar
[ERROR] urls[24] = file:/home/jenkins/.m2/repository/org/eclipse/jetty/jetty-io/9.4.0.v20161208/jetty-io-9.4.0.v20161208.jar
[ERROR] urls[25] = file:/home/jenkins/.m2/repository/org/eclipse/jetty/jetty-jmx/9.4.0.v20161208/jetty-jmx-9.4.0.v20161208.jar
[ERROR] urls[26] = file:/home/jenkins/.m2/repository/org/eclipse/jetty/jetty-annotations/9.4.0.v20161208/jetty-annotations-9.4.0.v20161208.jar
[ERROR] urls[27] = file:/home/jenkins/.m2/repository/javax/annotation/javax.annotation-api/1.2/javax.annotation-api-1.2.jar
[ERROR] urls[28] = file:/home/jenkins/.m2/repository/org/ow2/asm/asm/5.1/asm-5.1.jar
[ERROR] urls[29] = file:/home/jenkins/.m2/repository/org/ow2/asm/asm-commons/5.1/asm-commons-5.1.jar
[ERROR] urls[30] = file:/home/jenkins/.m2/repository/org/ow2/asm/asm-tree/5.1/asm-tree-5.1.jar
[ERROR] urls[31] = file:/home/jenkins/.m2/repository/org/eclipse/jetty/websocket/javax-websocket-server-impl/9.4.0.v20161208/javax-websocket-server-impl-9.4.0.v20161208.jar
[ERROR] urls[32] = file:/home/jenkins/.m2/repository/org/eclipse/jetty/websocket/javax-websocket-client-impl/9.4.0.v20161208/javax-websocket-client-impl-9.4.0.v20161208.jar
[ERROR] urls[33] = file:/home/jenkins/.m2/repository/javax/websocket/javax.websocket-api/1.0/javax.websocket-api-1.0.jar
[ERROR] urls[34] = file:/home/jenkins/.m2/repository/org/eclipse/jetty/websocket/websocket-server/9.4.0.v20161208/websocket-server-9.4.0.v20161208.jar
[ERROR] urls[35] = file:/home/jenkins/.m2/repository/org/eclipse/jetty/websocket/websocket-common/9.4.0.v20161208/websocket-common-9.4.0.v20161208.jar
[ERROR] urls[36] = file:/home/jenkins/.m2/repository/org/eclipse/jetty/websocket/websocket-api/9.4.0.v20161208/websocket-api-9.4.0.v20161208.jar
[ERROR] urls[37] = file:/home/jenkins/.m2/repository/org/eclipse/jetty/websocket/websocket-client/9.4.0.v20161208/websocket-client-9.4.0.v20161208.jar
[ERROR] urls[38] = file:/home/jenkins/.m2/repository/org/eclipse/jetty/jetty-client/9.4.0.v20161208/jetty-client-9.4.0.v20161208.jar
[ERROR] urls[39] = file:/home/jenkins/.m2/repository/org/eclipse/jetty/websocket/websocket-servlet/9.4.0.v20161208/websocket-servlet-9.4.0.v20161208.jar
[ERROR] urls[40] = file:/home/jenkins/.m2/repository/org/eclipse/jetty/apache-jsp/9.4.0.v20161208/apache-jsp-9.4.0.v20161208.jar
[ERROR] urls[41] = file:/home/jenkins/.m2/repository/org/eclipse/jetty/toolchain/jetty-schemas/3.1/jetty-schemas-3.1.jar
[ERROR] urls[42] = file:/home/jenkins/.m2/repository/org/mortbay/jasper/apache-jsp/8.5.5/apache-jsp-8.5.5.jar
[ERROR] urls[43] = file:/home/jenkins/.m2/repository/org/mortbay/jasper/apache-el/8.5.5/apache-el-8.5.5.jar
[ERROR] urls[44] = file:/home/jenkins/.m2/repository/org/eclipse/jdt/core/compiler/ecj/4.4.2/ecj-4.4.2.jar
[ERROR] urls[45] = file:/home/jenkins/.m2/repository/org/eclipse/jetty/apache-jstl/9.4.0.v20161208/apache-jstl-9.4.0.v20161208.jar
[ERROR] urls[46] = file:/home/jenkins/.m2/repository/org/apache/taglibs/taglibs-standard-spec/1.2.5/taglibs-standard-spec-1.2.5.jar
[ERROR] urls[47] = file:/home/jenkins/.m2/repository/org/apache/taglibs/taglibs-standard-impl/1.2.5/taglibs-standard-impl-1.2.5.jar
[ERROR] urls[48] = file:/home/jenkins/.m2/repository/javax/transaction/javax.transaction-api/1.2/javax.transaction-api-1.2.jar
[ERROR] Number of foreign imports: 1
[ERROR] import: Entry[import  from realm ClassRealm[project>org.apache.atlas:apache-atlas:1.0.0-SNAPSHOT,
parent: ClassRealm[maven.api, parent: null]]]
[ERROR] 
[ERROR] -----------------------------------------------------
[ERROR] 
[ERROR] -> [Help 1]
[ERROR] 
[ERROR] To see the full stack trace of the errors, re-run Maven with the -e switch.
[ERROR] Re-run Maven using the -X switch to enable full debug logging.
[ERROR] 
[ERROR] For more information about the errors and possible solutions, please read the following
articles:
[ERROR] [Help 1] http://cwiki.apache.org/confluence/display/MAVEN/PluginContainerException
[ERROR] 
[ERROR] After correcting the problems, you can resume the build with the command
[ERROR]   mvn <goals> -rf :atlas-webapp
Build step 'Execute shell' marked build as failure
[CHECKSTYLE] Collecting checkstyle analysis files...
[CHECKSTYLE] Searching for all files in <https://builds.apache.org/job/Atlas-master-IntegrationTests/ws/>
that match the pattern **/target/checkstyle-result.xml
[CHECKSTYLE] Parsing 22 files in <https://builds.apache.org/job/Atlas-master-IntegrationTests/ws/>
[CHECKSTYLE] Successfully parsed file <https://builds.apache.org/job/Atlas-master-IntegrationTests/ws/authorization/target/checkstyle-result.xml>
with 467 unique warnings and 0 duplicates.
[CHECKSTYLE] Successfully parsed file <https://builds.apache.org/job/Atlas-master-IntegrationTests/ws/catalog/target/checkstyle-result.xml>
with 2604 unique warnings and 0 duplicates.
[CHECKSTYLE] Successfully parsed file <https://builds.apache.org/job/Atlas-master-IntegrationTests/ws/client/client-v1/target/checkstyle-result.xml>
with 3477 unique warnings and 0 duplicates.
[CHECKSTYLE] Successfully parsed file <https://builds.apache.org/job/Atlas-master-IntegrationTests/ws/client/client-v2/target/checkstyle-result.xml>
with 3802 unique warnings and 0 duplicates.
[CHECKSTYLE] Successfully parsed file <https://builds.apache.org/job/Atlas-master-IntegrationTests/ws/client/common/target/checkstyle-result.xml>
with 4259 unique warnings and 0 duplicates.
[CHECKSTYLE] Successfully parsed file <https://builds.apache.org/job/Atlas-master-IntegrationTests/ws/client/target/checkstyle-result.xml>
with 4259 unique warnings and 0 duplicates.
[CHECKSTYLE] Successfully parsed file <https://builds.apache.org/job/Atlas-master-IntegrationTests/ws/common/target/checkstyle-result.xml>
with 5210 unique warnings and 0 duplicates.
[CHECKSTYLE] Successfully parsed file <https://builds.apache.org/job/Atlas-master-IntegrationTests/ws/dashboardv2/target/checkstyle-result.xml>
with 5210 unique warnings and 0 duplicates.
[CHECKSTYLE] Successfully parsed file <https://builds.apache.org/job/Atlas-master-IntegrationTests/ws/graphdb/api/target/checkstyle-result.xml>
with 5483 unique warnings and 0 duplicates.
[CHECKSTYLE] Successfully parsed file <https://builds.apache.org/job/Atlas-master-IntegrationTests/ws/graphdb/common/target/checkstyle-result.xml>
with 5670 unique warnings and 0 duplicates.
[CHECKSTYLE] Successfully parsed file <https://builds.apache.org/job/Atlas-master-IntegrationTests/ws/graphdb/graphdb-impls/target/checkstyle-result.xml>
with 5670 unique warnings and 0 duplicates.
[CHECKSTYLE] Successfully parsed file <https://builds.apache.org/job/Atlas-master-IntegrationTests/ws/graphdb/target/checkstyle-result.xml>
with 5670 unique warnings and 0 duplicates.
[CHECKSTYLE] Successfully parsed file <https://builds.apache.org/job/Atlas-master-IntegrationTests/ws/graphdb/titan0/target/checkstyle-result.xml>
with 8072 unique warnings and 0 duplicates.
[CHECKSTYLE] Successfully parsed file <https://builds.apache.org/job/Atlas-master-IntegrationTests/ws/graphdb/titan1/target/checkstyle-result.xml>
with 9039 unique warnings and 0 duplicates.
[CHECKSTYLE] Successfully parsed file <https://builds.apache.org/job/Atlas-master-IntegrationTests/ws/intg/target/checkstyle-result.xml>
with 17250 unique warnings and 0 duplicates.
[CHECKSTYLE] Successfully parsed file <https://builds.apache.org/job/Atlas-master-IntegrationTests/ws/notification/target/checkstyle-result.xml>
with 18460 unique warnings and 0 duplicates.
[CHECKSTYLE] Successfully parsed file <https://builds.apache.org/job/Atlas-master-IntegrationTests/ws/repository/target/checkstyle-result.xml>
with 38711 unique warnings and 0 duplicates.
[CHECKSTYLE] Successfully parsed file <https://builds.apache.org/job/Atlas-master-IntegrationTests/ws/server-api/target/checkstyle-result.xml>
with 39090 unique warnings and 0 duplicates.
[CHECKSTYLE] Successfully parsed file <https://builds.apache.org/job/Atlas-master-IntegrationTests/ws/shaded/hbase-client-shaded/target/checkstyle-result.xml>
with 39090 unique warnings and 0 duplicates.
[CHECKSTYLE] Successfully parsed file <https://builds.apache.org/job/Atlas-master-IntegrationTests/ws/shaded/hbase-server-shaded/target/checkstyle-result.xml>
with 39090 unique warnings and 0 duplicates.
[CHECKSTYLE] Successfully parsed file <https://builds.apache.org/job/Atlas-master-IntegrationTests/ws/target/checkstyle-result.xml>
with 39090 unique warnings and 0 duplicates.
[CHECKSTYLE] Successfully parsed file <https://builds.apache.org/job/Atlas-master-IntegrationTests/ws/typesystem/target/checkstyle-result.xml>
with 43308 unique warnings and 0 duplicates.
<Git Blamer> Using GitBlamer to create author and commit information for all warnings.
<Git Blamer> GIT_COMMIT=3af543640c944dc98cdc3334588a2ffc5a12e34c, workspace=<https://builds.apache.org/job/Atlas-master-IntegrationTests/ws/>
 > git rev-parse 3af543640c944dc98cdc3334588a2ffc5a12e34c^{commit} # timeout=10
<Git Blamer> Skipping file <https://builds.apache.org/job/Atlas-master-IntegrationTests/ws/typesystem/src/main/java/org/apache/atlas/typesystem/IStruct.java,>
no result found.
[FINDBUGS] Collecting findbugs analysis files...
[FINDBUGS] Searching for all files in <https://builds.apache.org/job/Atlas-master-IntegrationTests/ws/>
that match the pattern **/target/findbugs.xml
[FINDBUGS] Parsing 14 files in <https://builds.apache.org/job/Atlas-master-IntegrationTests/ws/>
[FINDBUGS] Successfully parsed file <https://builds.apache.org/job/Atlas-master-IntegrationTests/ws/authorization/target/findbugs.xml>
with 0 unique warnings and 0 duplicates.
[FINDBUGS] Successfully parsed file <https://builds.apache.org/job/Atlas-master-IntegrationTests/ws/catalog/target/findbugs.xml>
with 0 unique warnings and 0 duplicates.
[FINDBUGS] Successfully parsed file <https://builds.apache.org/job/Atlas-master-IntegrationTests/ws/client/client-v1/target/findbugs.xml>
with 0 unique warnings and 0 duplicates.
[FINDBUGS] Successfully parsed file <https://builds.apache.org/job/Atlas-master-IntegrationTests/ws/client/client-v2/target/findbugs.xml>
with 0 unique warnings and 0 duplicates.
[FINDBUGS] Successfully parsed file <https://builds.apache.org/job/Atlas-master-IntegrationTests/ws/client/common/target/findbugs.xml>
with 0 unique warnings and 0 duplicates.
[FINDBUGS] Successfully parsed file <https://builds.apache.org/job/Atlas-master-IntegrationTests/ws/common/target/findbugs.xml>
with 0 unique warnings and 0 duplicates.
[FINDBUGS] Successfully parsed file <https://builds.apache.org/job/Atlas-master-IntegrationTests/ws/graphdb/api/target/findbugs.xml>
with 0 unique warnings and 0 duplicates.
[FINDBUGS] Successfully parsed file <https://builds.apache.org/job/Atlas-master-IntegrationTests/ws/graphdb/common/target/findbugs.xml>
with 0 unique warnings and 0 duplicates.
[FINDBUGS] Successfully parsed file <https://builds.apache.org/job/Atlas-master-IntegrationTests/ws/graphdb/titan0/target/findbugs.xml>
with 0 unique warnings and 0 duplicates.
[FINDBUGS] Successfully parsed file <https://builds.apache.org/job/Atlas-master-IntegrationTests/ws/intg/target/findbugs.xml>
with 0 unique warnings and 0 duplicates.
[FINDBUGS] Successfully parsed file <https://builds.apache.org/job/Atlas-master-IntegrationTests/ws/notification/target/findbugs.xml>
with 0 unique warnings and 0 duplicates.
[FINDBUGS] Successfully parsed file <https://builds.apache.org/job/Atlas-master-IntegrationTests/ws/repository/target/findbugs.xml>
with 0 unique warnings and 0 duplicates.
[FINDBUGS] Successfully parsed file <https://builds.apache.org/job/Atlas-master-IntegrationTests/ws/server-api/target/findbugs.xml>
with 0 unique warnings and 0 duplicates.
[FINDBUGS] Successfully parsed file <https://builds.apache.org/job/Atlas-master-IntegrationTests/ws/typesystem/target/findbugs.xml>
with 0 unique warnings and 0 duplicates.
<Git Blamer> Using GitBlamer to create author and commit information for all warnings.
<Git Blamer> GIT_COMMIT=3af543640c944dc98cdc3334588a2ffc5a12e34c, workspace=<https://builds.apache.org/job/Atlas-master-IntegrationTests/ws/>
Archiving artifacts
[Fast Archiver] No prior successful build to compare, so performing full copy of artifacts
TestNG Reports Processing: START
Looking for TestNG results report in workspace using pattern: **/target/surefire-reports/testng-results.xml,**/target/failsafe-reports/testng-results.xml
Did not find any matching files.

Mime
View raw message