atlas-dev mailing list archives

Site index · List index
Message view « Date » · « Thread »
Top « Date » · « Thread »
From Apache Jenkins Server <jenk...@builds.apache.org>
Subject Build failed in Jenkins: Atlas-master-UnitTests #105
Date Fri, 29 Sep 2017 07:43:55 GMT
See <https://builds.apache.org/job/Atlas-master-UnitTests/105/display/redirect?page=changes>

Changes:

[madhan] ATLAS-2111 : UI: Select query is not able to render the search table in

[madhan] ATLAS-2182 : UI : Web elements are hidden when zoomed in

------------------------------------------
[...truncated 282.35 KB...]
Running org.apache.atlas.lineage.EntityLineageServiceTest
Running org.apache.atlas.query.GremlinTest
Running org.apache.atlas.RepositoryServiceLoadingTest
Running org.apache.atlas.repository.store.graph.v1.AtlasRelationshipStoreSoftDeleteV1Test
Running org.apache.atlas.TestModules
Running org.apache.atlas.repository.store.graph.AtlasTypeDefGraphStoreTest
Running org.apache.atlas.query.QueryProcessorTest
Running org.apache.atlas.repository.store.graph.v1.AtlasRelationshipStoreHardDeleteV1Test
Running org.apache.atlas.repository.store.graph.v1.InverseReferenceUpdateSoftDeleteV1Test
Running org.apache.atlas.query.ExpressionTest
Running org.apache.atlas.repository.store.graph.v1.AtlasRelationshipDefStoreV1Test
Running org.apache.atlas.repository.typestore.StoreBackedTypeCacheTest
Tests run: 5, Failures: 0, Errors: 0, Skipped: 0, Time elapsed: 26.23 sec - in org.apache.atlas.util.CompiledQueryCacheKeyTest
Running org.apache.atlas.repository.store.graph.v1.AtlasEntityDefStoreV1Test
Tests run: 0, Failures: 0, Errors: 0, Skipped: 0, Time elapsed: 28.799 sec - in org.apache.atlas.TestUtils
Tests run: 0, Failures: 0, Errors: 0, Skipped: 0, Time elapsed: 28.837 sec - in org.apache.atlas.BaseRepositoryTest
Tests run: 0, Failures: 0, Errors: 0, Skipped: 0, Time elapsed: 29.79 sec - in org.apache.atlas.query.BaseGremlinTest
Tests run: 0, Failures: 0, Errors: 0, Skipped: 0, Time elapsed: 29.387 sec - in org.apache.atlas.TestModules
Tests run: 0, Failures: 0, Errors: 0, Skipped: 0, Time elapsed: 29.697 sec - in org.apache.atlas.repository.store.graph.v1.AtlasDeleteHandlerV1Test
Running org.apache.atlas.repository.BaseTest
Tests run: 0, Failures: 0, Errors: 0, Skipped: 0, Time elapsed: 30.401 sec - in org.apache.atlas.repository.store.graph.v1.InverseReferenceUpdateV1Test
Running org.apache.atlas.repository.store.graph.v1.SoftDeleteHandlerV1Test
Tests run: 9, Failures: 0, Errors: 0, Skipped: 0, Time elapsed: 30.527 sec - in org.apache.atlas.utils.ObjectUpdateSynchronizerTest
Tests run: 2, Failures: 0, Errors: 0, Skipped: 0, Time elapsed: 31.216 sec - in org.apache.atlas.repository.audit.HBaseBasedAuditRepositoryHATest
Tests run: 3, Failures: 0, Errors: 0, Skipped: 0, Time elapsed: 30.862 sec - in org.apache.atlas.repository.audit.InMemoryAuditRepositoryTest
Tests run: 9, Failures: 0, Errors: 0, Skipped: 0, Time elapsed: 31.103 sec - in org.apache.atlas.repository.store.graph.v1.AtlasEntityStoreV1BulkImportPercentTest
Running org.apache.atlas.repository.userprofile.UserProfileServiceTest
Running org.apache.atlas.repository.graph.GraphBackedRepositorySoftDeleteTest
Tests run: 1, Failures: 0, Errors: 0, Skipped: 0, Time elapsed: 31.38 sec - in org.apache.atlas.query.LexerTest
Tests run: 0, Failures: 0, Errors: 0, Skipped: 0, Time elapsed: 31.31 sec - in org.apache.atlas.repository.store.graph.v1.AtlasRelationshipStoreV1Test
Tests run: 5, Failures: 0, Errors: 0, Skipped: 0, Time elapsed: 30.952 sec - in org.apache.atlas.query.QueryProcessorTest
Running org.apache.atlas.repository.graph.GraphBackedSearchIndexerMockTest
Running org.apache.atlas.repository.graph.GraphRepoMapperScaleTest
Running org.apache.atlas.repository.graph.Gremlin3QueryOptimizerTest
Running org.apache.atlas.repository.graph.Gremlin2QueryOptimizerTest
Running org.apache.atlas.repository.graph.GraphBackedRepositoryHardDeleteTest
Running org.apache.atlas.repository.graph.GraphHelperTest
Running org.apache.atlas.repository.graph.GraphBackedMetadataRepositoryTest
Running org.apache.atlas.repository.graph.ReverseReferenceUpdateSoftDeleteTest
Running org.apache.atlas.repository.graph.TestIntSequence
Tests run: 14, Failures: 0, Errors: 0, Skipped: 0, Time elapsed: 33.319 sec - in org.apache.atlas.query.ParserTest
Tests run: 19, Failures: 0, Errors: 0, Skipped: 0, Time elapsed: 33.242 sec - in org.apache.atlas.query.ExpressionTest
Running org.apache.atlas.repository.graph.ReverseReferenceUpdateHardDeleteTest
Running org.apache.atlas.repository.graph.AbstractGremlinQueryOptimizerTest
Tests run: 1, Failures: 0, Errors: 0, Skipped: 0, Time elapsed: 36.585 sec - in org.apache.atlas.services.MetricsServiceTest
Running org.apache.atlas.repository.graph.GraphHelperMockTest
Tests run: 1, Failures: 0, Errors: 0, Skipped: 0, Time elapsed: 42.17 sec - in org.apache.atlas.RepositoryServiceLoadingTest
Running org.apache.atlas.repository.graph.GraphBackedSearchIndexerTest
Tests run: 5, Failures: 0, Errors: 0, Skipped: 0, Time elapsed: 47.077 sec - in org.apache.atlas.repository.typestore.GraphBackedTypeStoreTest
Tests run: 10, Failures: 0, Errors: 0, Skipped: 0, Time elapsed: 46.726 sec - in org.apache.atlas.repository.store.graph.v1.AtlasRelationshipDefStoreV1Test
Running org.apache.atlas.repository.impexp.ImportServiceTest
Running org.apache.atlas.repository.impexp.ExportServiceTest
Tests run: 2, Failures: 0, Errors: 0, Skipped: 0, Time elapsed: 51.592 sec - in org.apache.atlas.repository.typestore.StoreBackedTypeCacheTest
Running org.apache.atlas.repository.impexp.AtlasImportRequestTest
Tests run: 0, Failures: 0, Errors: 0, Skipped: 0, Time elapsed: 31.603 sec - in org.apache.atlas.repository.BaseTest
Tests run: 33, Failures: 0, Errors: 0, Skipped: 0, Time elapsed: 30.391 sec - in org.apache.atlas.repository.graph.Gremlin2QueryOptimizerTest
Tests run: 3, Failures: 0, Errors: 0, Skipped: 0, Time elapsed: 31.252 sec - in org.apache.atlas.repository.graph.GraphBackedSearchIndexerMockTest
Running org.apache.atlas.repository.impexp.ZipSinkTest
Running org.apache.atlas.repository.impexp.ImportTransformerTest
Running org.apache.atlas.repository.impexp.TypeAttributeDifferenceTest
Tests run: 0, Failures: 0, Errors: 0, Skipped: 0, Time elapsed: 31.859 sec - in org.apache.atlas.repository.graph.TestIntSequence
Tests run: 5, Failures: 0, Errors: 0, Skipped: 0, Time elapsed: 65.849 sec - in org.apache.atlas.repository.store.graph.v1.AtlasRelationshipStoreSoftDeleteV1Test
Running org.apache.atlas.repository.impexp.ImportTransformsTest
Running org.apache.atlas.repository.impexp.UniqueListTest
Tests run: 0, Failures: 0, Errors: 0, Skipped: 0, Time elapsed: 32.117 sec - in org.apache.atlas.repository.graph.AbstractGremlinQueryOptimizerTest
Tests run: 5, Failures: 0, Errors: 0, Skipped: 0, Time elapsed: 67.314 sec - in org.apache.atlas.repository.store.graph.v1.AtlasRelationshipStoreHardDeleteV1Test
Running org.apache.atlas.repository.impexp.ImportTransformerJSONTest
Tests run: 33, Failures: 0, Errors: 0, Skipped: 0, Time elapsed: 36.951 sec - in org.apache.atlas.repository.graph.Gremlin3QueryOptimizerTest
Running org.apache.atlas.repository.impexp.ZipSourceTest
Running org.apache.atlas.discovery.EntityDiscoveryServiceTest
Tests run: 5, Failures: 0, Errors: 0, Skipped: 0, Time elapsed: 74.111 sec - in org.apache.atlas.repository.store.graph.v1.InverseReferenceUpdateHardDeleteV1Test
Tests run: 1, Failures: 0, Errors: 0, Skipped: 0, Time elapsed: 47.943 sec - in org.apache.atlas.repository.store.graph.v1.AtlasEntityDefStoreV1Test
Running org.apache.atlas.discovery.GraphBackedDiscoveryServiceTest
Tests run: 5, Failures: 0, Errors: 0, Skipped: 0, Time elapsed: 74.797 sec - in org.apache.atlas.repository.store.graph.v1.InverseReferenceUpdateSoftDeleteV1Test
Tests run: 5, Failures: 0, Errors: 0, Skipped: 0, Time elapsed: 75.775 sec - in org.apache.atlas.query.LineageQueryTest
Tests run: 2, Failures: 0, Errors: 0, Skipped: 0, Time elapsed: 37.465 sec - in org.apache.atlas.repository.graph.GraphHelperMockTest
Running org.apache.atlas.service.DefaultMetadataServiceTest
Running org.apache.atlas.discovery.DataSetLineageServiceTest
Running org.apache.atlas.service.StoreBackedTypeCacheMetadataServiceTest
Tests run: 6, Failures: 0, Errors: 0, Skipped: 0, Time elapsed: 29.327 sec - in org.apache.atlas.repository.impexp.AtlasImportRequestTest
Tests run: 5, Failures: 0, Errors: 0, Skipped: 0, Time elapsed: 42.133 sec - in org.apache.atlas.repository.graph.GraphBackedSearchIndexerTest
Tests run: 4, Failures: 0, Errors: 0, Skipped: 0, Time elapsed: 87.664 sec - in org.apache.atlas.repository.audit.HBaseBasedAuditRepositoryTest
Tests run: 5, Failures: 0, Errors: 0, Skipped: 0, Time elapsed: 57.835 sec - in org.apache.atlas.repository.graph.ReverseReferenceUpdateSoftDeleteTest
Tests run: 8, Failures: 0, Errors: 0, Skipped: 0, Time elapsed: 28.22 sec - in org.apache.atlas.repository.impexp.ZipSinkTest
Tests run: 5, Failures: 0, Errors: 0, Skipped: 0, Time elapsed: 56.969 sec - in org.apache.atlas.repository.graph.ReverseReferenceUpdateHardDeleteTest
Tests run: 8, Failures: 0, Errors: 0, Skipped: 0, Time elapsed: 28.558 sec - in org.apache.atlas.repository.impexp.ImportTransformerTest
Tests run: 14, Failures: 0, Errors: 0, Skipped: 0, Time elapsed: 62.111 sec - in org.apache.atlas.repository.graph.GraphHelperTest
Tests run: 14, Failures: 0, Errors: 0, Skipped: 0, Time elapsed: 94.858 sec - in org.apache.atlas.repository.store.graph.v1.AtlasEntityStoreV1Test
Tests run: 3, Failures: 0, Errors: 0, Skipped: 0, Time elapsed: 28.458 sec - in org.apache.atlas.repository.impexp.ImportTransformsTest
Tests run: 6, Failures: 0, Errors: 0, Skipped: 0, Time elapsed: 30.663 sec - in org.apache.atlas.repository.impexp.TypeAttributeDifferenceTest
Tests run: 1, Failures: 0, Errors: 0, Skipped: 0, Time elapsed: 28.96 sec - in org.apache.atlas.repository.impexp.ImportTransformerJSONTest
Tests run: 4, Failures: 0, Errors: 0, Skipped: 0, Time elapsed: 30.679 sec - in org.apache.atlas.repository.impexp.UniqueListTest
Tests run: 17, Failures: 0, Errors: 0, Skipped: 0, Time elapsed: 98.74 sec - in org.apache.atlas.repository.store.graph.AtlasTypeDefGraphStoreTest
Tests run: 11, Failures: 0, Errors: 0, Skipped: 0, Time elapsed: 100.098 sec - in org.apache.atlas.repository.store.graph.v1.HardDeleteHandlerV1Test
Tests run: 6, Failures: 0, Errors: 0, Skipped: 0, Time elapsed: 32.665 sec - in org.apache.atlas.repository.impexp.ZipSourceTest
Tests run: 11, Failures: 0, Errors: 0, Skipped: 0, Time elapsed: 72.962 sec - in org.apache.atlas.repository.userprofile.UserProfileServiceTest
Tests run: 21, Failures: 0, Errors: 0, Skipped: 0, Time elapsed: 105.221 sec - in org.apache.atlas.query.GremlinTest
Tests run: 6, Failures: 0, Errors: 0, Skipped: 0, Time elapsed: 36.218 sec - in org.apache.atlas.discovery.EntityDiscoveryServiceTest
Tests run: 0, Failures: 0, Errors: 0, Skipped: 0, Time elapsed: 31.763 sec - in org.apache.atlas.discovery.DataSetLineageServiceTest
Tests run: 21, Failures: 0, Errors: 0, Skipped: 0, Time elapsed: 77.669 sec - in org.apache.atlas.repository.graph.GraphBackedRepositoryHardDeleteTest
Tests run: 23, Failures: 0, Errors: 0, Skipped: 0, Time elapsed: 110.064 sec - in org.apache.atlas.lineage.EntityLineageServiceTest
Tests run: 30, Failures: 0, Errors: 0, Skipped: 0, Time elapsed: 78.055 sec - in org.apache.atlas.repository.graph.GraphBackedMetadataRepositoryTest
Tests run: 21, Failures: 0, Errors: 0, Skipped: 0, Time elapsed: 79.678 sec - in org.apache.atlas.repository.graph.GraphBackedRepositorySoftDeleteTest
Tests run: 11, Failures: 0, Errors: 0, Skipped: 0, Time elapsed: 83.682 sec - in org.apache.atlas.repository.store.graph.v1.SoftDeleteHandlerV1Test
Tests run: 3, Failures: 0, Errors: 0, Skipped: 0, Time elapsed: 41.043 sec - in org.apache.atlas.service.StoreBackedTypeCacheMetadataServiceTest
Tests run: 10, Failures: 0, Errors: 0, Skipped: 0, Time elapsed: 68.897 sec - in org.apache.atlas.repository.impexp.ExportServiceTest
Tests run: 9, Failures: 1, Errors: 0, Skipped: 0, Time elapsed: 73.495 sec <<< FAILURE!
- in org.apache.atlas.repository.impexp.ImportServiceTest
importCTAS(org.apache.atlas.repository.impexp.ImportServiceTest)  Time elapsed: 4.482 sec
 <<< FAILURE!
org.apache.atlas.exception.AtlasBaseException: Given instance is invalid/not found: Could
not find entities in the repository with guids: [73cb606c-6846-4718-a859-40c9c17e0b32]
	at org.apache.atlas.repository.converters.AtlasInstanceConverter.toAtlasBaseException(AtlasInstanceConverter.java:213)
	at org.apache.atlas.repository.converters.AtlasInstanceConverter.getITypedReferenceable(AtlasInstanceConverter.java:115)
	at org.apache.atlas.repository.store.graph.v1.AtlasEntityChangeNotifier.toITypedReferenceable(AtlasEntityChangeNotifier.java:184)
	at org.apache.atlas.repository.store.graph.v1.AtlasEntityChangeNotifier.notifyListeners(AtlasEntityChangeNotifier.java:158)
	at org.apache.atlas.repository.store.graph.v1.AtlasEntityChangeNotifier.onEntitiesMutated(AtlasEntityChangeNotifier.java:84)
	at org.apache.atlas.repository.store.graph.v1.AtlasEntityStoreV1.createOrUpdate(AtlasEntityStoreV1.java:165)
	at org.apache.atlas.repository.store.graph.v1.AtlasEntityStoreV1.createOrUpdateForImport(AtlasEntityStoreV1.java:179)
	at org.apache.atlas.GraphTransactionInterceptor.invoke(GraphTransactionInterceptor.java:60)
	at org.apache.atlas.repository.store.graph.v1.BulkImporterImpl.bulkImport(BulkImporterImpl.java:82)
	at org.apache.atlas.repository.impexp.ImportService.processEntities(ImportService.java:161)
	at org.apache.atlas.repository.impexp.ImportService.run(ImportService.java:82)
	at org.apache.atlas.repository.impexp.ImportService.run(ImportService.java:61)
	at org.apache.atlas.repository.impexp.ZipFileResourceTestUtils.runImportWithNoParameters(ZipFileResourceTestUtils.java:215)
	at org.apache.atlas.repository.impexp.ImportServiceTest.importCTAS(ImportServiceTest.java:168)

Tests run: 27, Failures: 0, Errors: 0, Skipped: 0, Time elapsed: 53.971 sec - in org.apache.atlas.service.DefaultMetadataServiceTest
Tests run: 2, Failures: 0, Errors: 0, Skipped: 0, Time elapsed: 221.073 sec - in org.apache.atlas.repository.graph.GraphRepoMapperScaleTest
Tests run: 338, Failures: 0, Errors: 0, Skipped: 0, Time elapsed: 200.955 sec - in org.apache.atlas.discovery.GraphBackedDiscoveryServiceTest

Results :

Failed tests: 
  ImportServiceTest.importCTAS:168 » AtlasBase Given instance is invalid/not fou...

Tests run: 833, Failures: 1, Errors: 0, Skipped: 0

[INFO] ------------------------------------------------------------------------
[INFO] Reactor Summary:
[INFO] 
[INFO] Apache Atlas Server Build Tools .................... SUCCESS [  0.919 s]
[INFO] apache-atlas ....................................... SUCCESS [  5.547 s]
[INFO] Apache Atlas Integration ........................... SUCCESS [ 36.909 s]
[INFO] Apache Atlas Common ................................ SUCCESS [ 14.687 s]
[INFO] Apache Atlas Typesystem ............................ SUCCESS [01:09 min]
[INFO] Apache Atlas Client ................................ SUCCESS [  0.602 s]
[INFO] atlas-client-common ................................ SUCCESS [ 10.666 s]
[INFO] atlas-client-v1 .................................... SUCCESS [ 15.147 s]
[INFO] Apache Atlas Server API ............................ SUCCESS [ 10.235 s]
[INFO] Apache Atlas Notification .......................... SUCCESS [ 21.320 s]
[INFO] atlas-client-v2 .................................... SUCCESS [  8.789 s]
[INFO] Apache Atlas Graph Database Projects ............... SUCCESS [  0.580 s]
[INFO] Apache Atlas Graph Database API .................... SUCCESS [  7.371 s]
[INFO] Graph Database Common Code ......................... SUCCESS [  7.342 s]
[INFO] Apache Atlas Titan 1.0.0 GraphDB Impl .............. SUCCESS [ 34.048 s]
[INFO] Shaded version of Apache hbase client .............. SUCCESS [  8.629 s]
[INFO] Apache Atlas Titan 0.5.4 Graph DB Impl ............. SUCCESS [01:22 min]
[INFO] Apache Atlas Graph Database Implementation Dependencies SUCCESS [  0.913 s]
[INFO] Shaded version of Apache hbase server .............. SUCCESS [ 23.971 s]
[INFO] Apache Atlas Repository ............................ FAILURE [05:37 min]
[INFO] Apache Atlas Authorization ......................... SKIPPED
[INFO] Apache Atlas Business Catalog ...................... SKIPPED
[INFO] Apache Atlas UI .................................... SKIPPED
[INFO] Apache Atlas Web Application ....................... SKIPPED
[INFO] Apache Atlas Documentation ......................... SKIPPED
[INFO] Apache Atlas FileSystem Model ...................... SKIPPED
[INFO] Apache Atlas Plugin Classloader .................... SKIPPED
[INFO] Apache Atlas Hive Bridge Shim ...................... SKIPPED
[INFO] Apache Atlas Hive Bridge ........................... SKIPPED
[INFO] Apache Atlas Falcon Bridge Shim .................... SKIPPED
[INFO] Apache Atlas Falcon Bridge ......................... SKIPPED
[INFO] Apache Atlas Sqoop Bridge Shim ..................... SKIPPED
[INFO] Apache Atlas Sqoop Bridge .......................... SKIPPED
[INFO] Apache Atlas Storm Bridge Shim ..................... SKIPPED
[INFO] Apache Atlas Storm Bridge .......................... SKIPPED
[INFO] Apache Atlas Distribution .......................... SKIPPED
[INFO] ------------------------------------------------------------------------
[INFO] BUILD FAILURE
[INFO] ------------------------------------------------------------------------
[INFO] Total time: 11:38 min
[INFO] Finished at: 2017-09-29T07:37:56Z
[INFO] Final Memory: 152M/1416M
[INFO] ------------------------------------------------------------------------
[ERROR] Failed to execute goal org.apache.maven.plugins:maven-surefire-plugin:2.18.1:test
(default-test) on project atlas-repository: There are test failures.
[ERROR] 
[ERROR] Please refer to <https://builds.apache.org/job/Atlas-master-UnitTests/ws/repository/target/surefire-reports>
for the individual test results.
[ERROR] -> [Help 1]
[ERROR] 
[ERROR] To see the full stack trace of the errors, re-run Maven with the -e switch.
[ERROR] Re-run Maven using the -X switch to enable full debug logging.
[ERROR] 
[ERROR] For more information about the errors and possible solutions, please read the following
articles:
[ERROR] [Help 1] http://cwiki.apache.org/confluence/display/MAVEN/MojoFailureException
[ERROR] 
[ERROR] After correcting the problems, you can resume the build with the command
[ERROR]   mvn <goals> -rf :atlas-repository
Build step 'Execute shell' marked build as failure
[CHECKSTYLE] Collecting checkstyle analysis files...
[CHECKSTYLE] Searching for all files in <https://builds.apache.org/job/Atlas-master-UnitTests/ws/>
that match the pattern **/target/checkstyle-result.xml
[CHECKSTYLE] Parsing 18 files in <https://builds.apache.org/job/Atlas-master-UnitTests/ws/>
[CHECKSTYLE] Successfully parsed file <https://builds.apache.org/job/Atlas-master-UnitTests/ws/client/client-v1/target/checkstyle-result.xml>
with 873 unique warnings and 0 duplicates.
[CHECKSTYLE] Successfully parsed file <https://builds.apache.org/job/Atlas-master-UnitTests/ws/client/client-v2/target/checkstyle-result.xml>
with 1198 unique warnings and 0 duplicates.
[CHECKSTYLE] Successfully parsed file <https://builds.apache.org/job/Atlas-master-UnitTests/ws/client/common/target/checkstyle-result.xml>
with 1655 unique warnings and 0 duplicates.
[CHECKSTYLE] Successfully parsed file <https://builds.apache.org/job/Atlas-master-UnitTests/ws/client/target/checkstyle-result.xml>
with 1655 unique warnings and 0 duplicates.
[CHECKSTYLE] Successfully parsed file <https://builds.apache.org/job/Atlas-master-UnitTests/ws/common/target/checkstyle-result.xml>
with 2606 unique warnings and 0 duplicates.
[CHECKSTYLE] Successfully parsed file <https://builds.apache.org/job/Atlas-master-UnitTests/ws/graphdb/api/target/checkstyle-result.xml>
with 2879 unique warnings and 0 duplicates.
[CHECKSTYLE] Successfully parsed file <https://builds.apache.org/job/Atlas-master-UnitTests/ws/graphdb/common/target/checkstyle-result.xml>
with 3066 unique warnings and 0 duplicates.
[CHECKSTYLE] Successfully parsed file <https://builds.apache.org/job/Atlas-master-UnitTests/ws/graphdb/graphdb-impls/target/checkstyle-result.xml>
with 3066 unique warnings and 0 duplicates.
[CHECKSTYLE] Successfully parsed file <https://builds.apache.org/job/Atlas-master-UnitTests/ws/graphdb/target/checkstyle-result.xml>
with 3066 unique warnings and 0 duplicates.
[CHECKSTYLE] Successfully parsed file <https://builds.apache.org/job/Atlas-master-UnitTests/ws/graphdb/titan0/target/checkstyle-result.xml>
with 5468 unique warnings and 0 duplicates.
[CHECKSTYLE] Successfully parsed file <https://builds.apache.org/job/Atlas-master-UnitTests/ws/graphdb/titan1/target/checkstyle-result.xml>
with 6435 unique warnings and 0 duplicates.
[CHECKSTYLE] Successfully parsed file <https://builds.apache.org/job/Atlas-master-UnitTests/ws/intg/target/checkstyle-result.xml>
with 14644 unique warnings and 0 duplicates.
[CHECKSTYLE] Successfully parsed file <https://builds.apache.org/job/Atlas-master-UnitTests/ws/notification/target/checkstyle-result.xml>
with 15854 unique warnings and 0 duplicates.
[CHECKSTYLE] Successfully parsed file <https://builds.apache.org/job/Atlas-master-UnitTests/ws/server-api/target/checkstyle-result.xml>
with 16233 unique warnings and 0 duplicates.
[CHECKSTYLE] Successfully parsed file <https://builds.apache.org/job/Atlas-master-UnitTests/ws/shaded/hbase-client-shaded/target/checkstyle-result.xml>
with 16233 unique warnings and 0 duplicates.
[CHECKSTYLE] Successfully parsed file <https://builds.apache.org/job/Atlas-master-UnitTests/ws/shaded/hbase-server-shaded/target/checkstyle-result.xml>
with 16233 unique warnings and 0 duplicates.
[CHECKSTYLE] Successfully parsed file <https://builds.apache.org/job/Atlas-master-UnitTests/ws/target/checkstyle-result.xml>
with 16233 unique warnings and 0 duplicates.
[CHECKSTYLE] Successfully parsed file <https://builds.apache.org/job/Atlas-master-UnitTests/ws/typesystem/target/checkstyle-result.xml>
with 20451 unique warnings and 0 duplicates.
<Git Blamer> Using GitBlamer to create author and commit information for all warnings.
<Git Blamer> GIT_COMMIT=d7acdba7c949c08b2320be95de97d9c35d41a386, workspace=<https://builds.apache.org/job/Atlas-master-UnitTests/ws/>
 > git rev-parse d7acdba7c949c08b2320be95de97d9c35d41a386^{commit} # timeout=10
[CHECKSTYLE] Computing warning deltas based on reference build #59
[FINDBUGS] Collecting findbugs analysis files...
[FINDBUGS] Searching for all files in <https://builds.apache.org/job/Atlas-master-UnitTests/ws/>
that match the pattern **/target/findbugs.xml
[FINDBUGS] Parsing 11 files in <https://builds.apache.org/job/Atlas-master-UnitTests/ws/>
[FINDBUGS] Successfully parsed file <https://builds.apache.org/job/Atlas-master-UnitTests/ws/client/client-v1/target/findbugs.xml>
with 0 unique warnings and 0 duplicates.
[FINDBUGS] Successfully parsed file <https://builds.apache.org/job/Atlas-master-UnitTests/ws/client/client-v2/target/findbugs.xml>
with 0 unique warnings and 0 duplicates.
[FINDBUGS] Successfully parsed file <https://builds.apache.org/job/Atlas-master-UnitTests/ws/client/common/target/findbugs.xml>
with 0 unique warnings and 0 duplicates.
[FINDBUGS] Successfully parsed file <https://builds.apache.org/job/Atlas-master-UnitTests/ws/common/target/findbugs.xml>
with 0 unique warnings and 0 duplicates.
[FINDBUGS] Successfully parsed file <https://builds.apache.org/job/Atlas-master-UnitTests/ws/graphdb/api/target/findbugs.xml>
with 0 unique warnings and 0 duplicates.
[FINDBUGS] Successfully parsed file <https://builds.apache.org/job/Atlas-master-UnitTests/ws/graphdb/common/target/findbugs.xml>
with 0 unique warnings and 0 duplicates.
[FINDBUGS] Successfully parsed file <https://builds.apache.org/job/Atlas-master-UnitTests/ws/graphdb/titan0/target/findbugs.xml>
with 0 unique warnings and 0 duplicates.
[FINDBUGS] Successfully parsed file <https://builds.apache.org/job/Atlas-master-UnitTests/ws/intg/target/findbugs.xml>
with 0 unique warnings and 0 duplicates.
[FINDBUGS] Successfully parsed file <https://builds.apache.org/job/Atlas-master-UnitTests/ws/notification/target/findbugs.xml>
with 0 unique warnings and 0 duplicates.
[FINDBUGS] Successfully parsed file <https://builds.apache.org/job/Atlas-master-UnitTests/ws/server-api/target/findbugs.xml>
with 0 unique warnings and 0 duplicates.
[FINDBUGS] Successfully parsed file <https://builds.apache.org/job/Atlas-master-UnitTests/ws/typesystem/target/findbugs.xml>
with 0 unique warnings and 0 duplicates.
<Git Blamer> Using GitBlamer to create author and commit information for all warnings.
<Git Blamer> GIT_COMMIT=d7acdba7c949c08b2320be95de97d9c35d41a386, workspace=<https://builds.apache.org/job/Atlas-master-UnitTests/ws/>
[FINDBUGS] Computing warning deltas based on reference build #59
Archiving artifacts
TestNG Reports Processing: START
Looking for TestNG results report in workspace using pattern: **/target/surefire-reports/testng-results.xml,**/target/failsafe-reports/testng-results.xml
Saving reports...
Processing '/x1/jenkins/jenkins-home/jobs/Atlas-master-UnitTests/builds/105/testng/testng-results-1.xml'
Processing '/x1/jenkins/jenkins-home/jobs/Atlas-master-UnitTests/builds/105/testng/testng-results-2.xml'
Processing '/x1/jenkins/jenkins-home/jobs/Atlas-master-UnitTests/builds/105/testng/testng-results-3.xml'
Processing '/x1/jenkins/jenkins-home/jobs/Atlas-master-UnitTests/builds/105/testng/testng-results-4.xml'
Processing '/x1/jenkins/jenkins-home/jobs/Atlas-master-UnitTests/builds/105/testng/testng-results-5.xml'
Processing '/x1/jenkins/jenkins-home/jobs/Atlas-master-UnitTests/builds/105/testng/testng-results-6.xml'
Processing '/x1/jenkins/jenkins-home/jobs/Atlas-master-UnitTests/builds/105/testng/testng-results.xml'
TestNG Reports Processing: FINISH

Mime
View raw message