atlas-dev mailing list archives

Site index · List index
Message view « Date » · « Thread »
Top « Date » · « Thread »
From Apache Jenkins Server <jenk...@builds.apache.org>
Subject Build failed in Jenkins: Atlas-0.8-IntegrationTests #75
Date Fri, 22 Sep 2017 02:53:54 GMT
See <https://builds.apache.org/job/Atlas-0.8-IntegrationTests/75/display/redirect>

------------------------------------------
[...truncated 491.10 KB...]
127.0.0.1 - - [22/Sep/2017:02:49:49 +0000] "GET /api/atlas/v2/types/typedef/name/finance HTTP/1.1"
200 - "-" "Java/1.7.0_80"
127.0.0.1 - - [22/Sep/2017:02:49:49 +0000] "GET /api/atlas/v2/types/typedef/name/FactvX7d3q1pUd
HTTP/1.1" 404 - "-" "Java/1.7.0_80"
127.0.0.1 - - [22/Sep/2017:02:49:49 +0000] "GET /api/atlas/v2/types/typedef/name/ETLNdBRIhPXcE
HTTP/1.1" 404 - "-" "Java/1.7.0_80"
127.0.0.1 - - [22/Sep/2017:02:49:49 +0000] "GET /api/atlas/v2/types/typedef/name/DimensionIjsa2Hv4z3
HTTP/1.1" 404 - "-" "Java/1.7.0_80"
127.0.0.1 - - [22/Sep/2017:02:49:49 +0000] "GET /api/atlas/v2/types/typedef/name/MetricBoUh1WCBP0
HTTP/1.1" 404 - "-" "Java/1.7.0_80"
127.0.0.1 - - [22/Sep/2017:02:49:49 +0000] "GET /api/atlas/v2/types/typedef/name/hive_db_v1
HTTP/1.1" 200 - "-" "Java/1.7.0_80"
127.0.0.1 - - [22/Sep/2017:02:49:49 +0000] "GET /api/atlas/v2/types/typedef/name/hive_column_v1
HTTP/1.1" 200 - "-" "Java/1.7.0_80"
127.0.0.1 - - [22/Sep/2017:02:49:49 +0000] "GET /api/atlas/v2/types/typedef/name/hive_table_v1
HTTP/1.1" 200 - "-" "Java/1.7.0_80"
127.0.0.1 - - [22/Sep/2017:02:49:49 +0000] "GET /api/atlas/v2/types/typedef/name/hive_process_v1
HTTP/1.1" 200 - "-" "Java/1.7.0_80"
127.0.0.1 - - [22/Sep/2017:02:49:49 +0000] "POST /api/atlas/types HTTP/1.1" 201 - "-" "Java/1.7.0_80"
127.0.0.1 - - [22/Sep/2017:02:49:49 +0000] "GET /api/atlas/v2/types/typedef/name/Fact HTTP/1.1"
404 - "-" "Java/1.7.0_80"
127.0.0.1 - - [22/Sep/2017:02:49:49 +0000] "GET /api/atlas/v2/types/typedef/name/ETL HTTP/1.1"
404 - "-" "Java/1.7.0_80"
127.0.0.1 - - [22/Sep/2017:02:49:49 +0000] "GET /api/atlas/v2/types/typedef/name/Dimension
HTTP/1.1" 404 - "-" "Java/1.7.0_80"
127.0.0.1 - - [22/Sep/2017:02:49:49 +0000] "GET /api/atlas/v2/types/typedef/name/Metric HTTP/1.1"
404 - "-" "Java/1.7.0_80"
127.0.0.1 - - [22/Sep/2017:02:49:49 +0000] "POST /api/atlas/types HTTP/1.1" 201 - "-" "Java/1.7.0_80"
127.0.0.1 - - [22/Sep/2017:02:49:49 +0000] "POST /api/atlas/entities HTTP/1.1" 201 - "-" "Java/1.7.0_80"
127.0.0.1 - - [22/Sep/2017:02:49:49 +0000] "POST /api/atlas/entities HTTP/1.1" 201 - "-" "Java/1.7.0_80"
127.0.0.1 - - [22/Sep/2017:02:49:49 +0000] "POST /api/atlas/entities HTTP/1.1" 201 - "-" "Java/1.7.0_80"
127.0.0.1 - - [22/Sep/2017:02:49:49 +0000] "POST /api/atlas/entities HTTP/1.1" 201 - "-" "Java/1.7.0_80"
127.0.0.1 - - [22/Sep/2017:02:49:49 +0000] "POST /api/atlas/entities HTTP/1.1" 201 - "-" "Java/1.7.0_80"
127.0.0.1 - - [22/Sep/2017:02:49:49 +0000] "POST /api/atlas/entities HTTP/1.1" 201 - "-" "Java/1.7.0_80"
127.0.0.1 - - [22/Sep/2017:02:49:49 +0000] "POST /api/atlas/entities HTTP/1.1" 201 - "-" "Java/1.7.0_80"
127.0.0.1 - - [22/Sep/2017:02:49:50 +0000] "POST /api/atlas/entities HTTP/1.1" 201 - "-" "Java/1.7.0_80"
127.0.0.1 - - [22/Sep/2017:02:49:50 +0000] "GET /api/atlas/lineage/hive/table/sales_fact_monthly_mvCwxzXeMa99/inputs/graph
HTTP/1.1" 200 - "-" "Java/1.7.0_80"
127.0.0.1 - - [22/Sep/2017:02:49:52 +0000] "GET /api/atlas/entities?type=hive_table_v1&property=qualifiedName&value=sales_factoANClFkTnf
HTTP/1.1" 200 - "-" "Java/1.7.0_80"
127.0.0.1 - - [22/Sep/2017:02:49:52 +0000] "GET /api/atlas/lineage/acd65721-a1fd-48da-b893-6c6d481c431d/outputs/graph
HTTP/1.1" 200 - "-" "Java/1.7.0_80"
127.0.0.1 - - [22/Sep/2017:02:49:53 +0000] "GET /api/atlas/lineage/hive/table/blah/schema
HTTP/1.1" 404 - "-" "Java/1.7.0_80"
127.0.0.1 - - [22/Sep/2017:02:49:53 +0000] "GET /api/atlas/lineage/hive/table/sales_factoANClFkTnf/outputs/graph
HTTP/1.1" 200 - "-" "Java/1.7.0_80"
127.0.0.1 - - [22/Sep/2017:02:49:55 +0000] "GET /api/atlas/entities?type=hive_table_v1&property=qualifiedName&value=sales_fact_monthly_mvCwxzXeMa99
HTTP/1.1" 200 - "-" "Java/1.7.0_80"
127.0.0.1 - - [22/Sep/2017:02:49:55 +0000] "GET /api/atlas/lineage/86e23948-0323-4645-94fe-16cef9990b28/inputs/graph
HTTP/1.1" 200 - "-" "Java/1.7.0_80"
127.0.0.1 - - [22/Sep/2017:02:49:56 +0000] "GET /api/atlas/lineage/hive/table/Salesl4RIqVXnnx/schema
HTTP/1.1" 404 - "-" "Java/1.7.0_80"
127.0.0.1 - - [22/Sep/2017:02:49:56 +0000] "GET /api/atlas/entities?type=hive_table_v1&property=qualifiedName&value=sales_factoANClFkTnf
HTTP/1.1" 200 - "-" "Java/1.7.0_80"
127.0.0.1 - - [22/Sep/2017:02:49:56 +0000] "GET /api/atlas/lineage/acd65721-a1fd-48da-b893-6c6d481c431d/schema
HTTP/1.1" 200 - "-" "Java/1.7.0_80"
127.0.0.1 - - [22/Sep/2017:02:49:57 +0000] "GET /api/atlas/lineage/hive/table/sales_factoANClFkTnf/schema
HTTP/1.1" 200 - "-" "Java/1.7.0_80"
127.0.0.1 - - [22/Sep/2017:02:49:58 +0000] "GET /api/atlas/v2/types/typedef/name/tableType
HTTP/1.1" 200 - "-" "Java/1.7.0_80"
127.0.0.1 - - [22/Sep/2017:02:49:58 +0000] "GET /api/atlas/v2/types/typedef/name/serdeType
HTTP/1.1" 200 - "-" "Java/1.7.0_80"
127.0.0.1 - - [22/Sep/2017:02:49:58 +0000] "GET /api/atlas/v2/types/typedef/name/classification
HTTP/1.1" 200 - "-" "Java/1.7.0_80"
127.0.0.1 - - [22/Sep/2017:02:49:58 +0000] "GET /api/atlas/v2/types/typedef/name/pii HTTP/1.1"
200 - "-" "Java/1.7.0_80"
127.0.0.1 - - [22/Sep/2017:02:49:58 +0000] "GET /api/atlas/v2/types/typedef/name/phi HTTP/1.1"
200 - "-" "Java/1.7.0_80"
127.0.0.1 - - [22/Sep/2017:02:49:58 +0000] "GET /api/atlas/v2/types/typedef/name/pci HTTP/1.1"
200 - "-" "Java/1.7.0_80"
127.0.0.1 - - [22/Sep/2017:02:49:58 +0000] "GET /api/atlas/v2/types/typedef/name/sox HTTP/1.1"
200 - "-" "Java/1.7.0_80"
127.0.0.1 - - [22/Sep/2017:02:49:58 +0000] "GET /api/atlas/v2/types/typedef/name/sec HTTP/1.1"
200 - "-" "Java/1.7.0_80"
127.0.0.1 - - [22/Sep/2017:02:49:58 +0000] "GET /api/atlas/v2/types/typedef/name/finance HTTP/1.1"
200 - "-" "Java/1.7.0_80"
127.0.0.1 - - [22/Sep/2017:02:49:58 +0000] "GET /api/atlas/v2/types/typedef/name/FactjfyXZoDHT5
HTTP/1.1" 404 - "-" "Java/1.7.0_80"
127.0.0.1 - - [22/Sep/2017:02:49:58 +0000] "GET /api/atlas/v2/types/typedef/name/ETLxTR1SgzsXr
HTTP/1.1" 404 - "-" "Java/1.7.0_80"
127.0.0.1 - - [22/Sep/2017:02:49:58 +0000] "GET /api/atlas/v2/types/typedef/name/DimensioneTdczzOaCK
HTTP/1.1" 404 - "-" "Java/1.7.0_80"
127.0.0.1 - - [22/Sep/2017:02:49:58 +0000] "GET /api/atlas/v2/types/typedef/name/MetricGDHlDBFEJp
HTTP/1.1" 404 - "-" "Java/1.7.0_80"
127.0.0.1 - - [22/Sep/2017:02:49:58 +0000] "GET /api/atlas/v2/types/typedef/name/hive_db_v1
HTTP/1.1" 200 - "-" "Java/1.7.0_80"
127.0.0.1 - - [22/Sep/2017:02:49:58 +0000] "GET /api/atlas/v2/types/typedef/name/hive_column_v1
HTTP/1.1" 200 - "-" "Java/1.7.0_80"
127.0.0.1 - - [22/Sep/2017:02:49:58 +0000] "GET /api/atlas/v2/types/typedef/name/hive_table_v1
HTTP/1.1" 200 - "-" "Java/1.7.0_80"
127.0.0.1 - - [22/Sep/2017:02:49:58 +0000] "GET /api/atlas/v2/types/typedef/name/hive_process_v1
HTTP/1.1" 200 - "-" "Java/1.7.0_80"
127.0.0.1 - - [22/Sep/2017:02:49:58 +0000] "POST /api/atlas/types HTTP/1.1" 201 - "-" "Java/1.7.0_80"
127.0.0.1 - - [22/Sep/2017:02:49:58 +0000] "GET /api/atlas/v2/types/typedef/name/Fact HTTP/1.1"
200 - "-" "Java/1.7.0_80"
127.0.0.1 - - [22/Sep/2017:02:49:58 +0000] "GET /api/atlas/v2/types/typedef/name/ETL HTTP/1.1"
200 - "-" "Java/1.7.0_80"
127.0.0.1 - - [22/Sep/2017:02:49:58 +0000] "GET /api/atlas/v2/types/typedef/name/Dimension
HTTP/1.1" 200 - "-" "Java/1.7.0_80"
127.0.0.1 - - [22/Sep/2017:02:49:58 +0000] "GET /api/atlas/v2/types/typedef/name/Metric HTTP/1.1"
200 - "-" "Java/1.7.0_80"
127.0.0.1 - - [22/Sep/2017:02:49:58 +0000] "POST /api/atlas/types HTTP/1.1" 201 - "-" "Java/1.7.0_80"
127.0.0.1 - - [22/Sep/2017:02:49:58 +0000] "POST /api/atlas/entities HTTP/1.1" 201 - "-" "Java/1.7.0_80"
127.0.0.1 - - [22/Sep/2017:02:49:58 +0000] "POST /api/atlas/entities HTTP/1.1" 201 - "-" "Java/1.7.0_80"
127.0.0.1 - - [22/Sep/2017:02:49:58 +0000] "POST /api/atlas/entities HTTP/1.1" 201 - "-" "Java/1.7.0_80"
127.0.0.1 - - [22/Sep/2017:02:49:58 +0000] "POST /api/atlas/entities HTTP/1.1" 201 - "-" "Java/1.7.0_80"
127.0.0.1 - - [22/Sep/2017:02:49:58 +0000] "POST /api/atlas/entities HTTP/1.1" 201 - "-" "Java/1.7.0_80"
127.0.0.1 - - [22/Sep/2017:02:49:58 +0000] "POST /api/atlas/entities HTTP/1.1" 201 - "-" "Java/1.7.0_80"
127.0.0.1 - - [22/Sep/2017:02:49:58 +0000] "POST /api/atlas/entities HTTP/1.1" 201 - "-" "Java/1.7.0_80"
127.0.0.1 - - [22/Sep/2017:02:49:59 +0000] "POST /api/atlas/entities HTTP/1.1" 201 - "-" "Java/1.7.0_80"
127.0.0.1 - - [22/Sep/2017:02:49:59 +0000] "GET /api/atlas/v2/types/typedef/name/tableType
HTTP/1.1" 200 - "-" "Java/1.7.0_80"
127.0.0.1 - - [22/Sep/2017:02:49:59 +0000] "GET /api/atlas/v2/types/typedef/name/serdeType
HTTP/1.1" 200 - "-" "Java/1.7.0_80"
127.0.0.1 - - [22/Sep/2017:02:49:59 +0000] "GET /api/atlas/v2/types/typedef/name/classification
HTTP/1.1" 200 - "-" "Java/1.7.0_80"
127.0.0.1 - - [22/Sep/2017:02:49:59 +0000] "GET /api/atlas/v2/types/typedef/name/pii HTTP/1.1"
200 - "-" "Java/1.7.0_80"
127.0.0.1 - - [22/Sep/2017:02:49:59 +0000] "GET /api/atlas/v2/types/typedef/name/phi HTTP/1.1"
200 - "-" "Java/1.7.0_80"
127.0.0.1 - - [22/Sep/2017:02:49:59 +0000] "GET /api/atlas/v2/types/typedef/name/pci HTTP/1.1"
200 - "-" "Java/1.7.0_80"
127.0.0.1 - - [22/Sep/2017:02:49:59 +0000] "GET /api/atlas/v2/types/typedef/name/sox HTTP/1.1"
200 - "-" "Java/1.7.0_80"
127.0.0.1 - - [22/Sep/2017:02:49:59 +0000] "GET /api/atlas/v2/types/typedef/name/sec HTTP/1.1"
200 - "-" "Java/1.7.0_80"
127.0.0.1 - - [22/Sep/2017:02:49:59 +0000] "GET /api/atlas/v2/types/typedef/name/finance HTTP/1.1"
200 - "-" "Java/1.7.0_80"
127.0.0.1 - - [22/Sep/2017:02:49:59 +0000] "GET /api/atlas/v2/types/typedef/name/FactIHffQ3R4ud
HTTP/1.1" 404 - "-" "Java/1.7.0_80"
127.0.0.1 - - [22/Sep/2017:02:49:59 +0000] "GET /api/atlas/v2/types/typedef/name/ETLDhRyfJGI5O
HTTP/1.1" 404 - "-" "Java/1.7.0_80"
127.0.0.1 - - [22/Sep/2017:02:49:59 +0000] "GET /api/atlas/v2/types/typedef/name/DimensionvvTOztV5iH
HTTP/1.1" 404 - "-" "Java/1.7.0_80"
127.0.0.1 - - [22/Sep/2017:02:49:59 +0000] "GET /api/atlas/v2/types/typedef/name/MetricKKsqc2G1n9
HTTP/1.1" 404 - "-" "Java/1.7.0_80"
127.0.0.1 - - [22/Sep/2017:02:49:59 +0000] "GET /api/atlas/v2/types/typedef/name/hive_db_v1
HTTP/1.1" 200 - "-" "Java/1.7.0_80"
127.0.0.1 - - [22/Sep/2017:02:49:59 +0000] "GET /api/atlas/v2/types/typedef/name/hive_column_v1
HTTP/1.1" 200 - "-" "Java/1.7.0_80"
127.0.0.1 - - [22/Sep/2017:02:49:59 +0000] "GET /api/atlas/v2/types/typedef/name/hive_table_v1
HTTP/1.1" 200 - "-" "Java/1.7.0_80"
127.0.0.1 - - [22/Sep/2017:02:49:59 +0000] "GET /api/atlas/v2/types/typedef/name/hive_process_v1
HTTP/1.1" 200 - "-" "Java/1.7.0_80"
127.0.0.1 - - [22/Sep/2017:02:49:59 +0000] "POST /api/atlas/types HTTP/1.1" 201 - "-" "Java/1.7.0_80"
127.0.0.1 - - [22/Sep/2017:02:49:59 +0000] "POST /api/atlas/entities HTTP/1.1" 201 - "-" "Java/1.7.0_80"
127.0.0.1 - - [22/Sep/2017:02:49:59 +0000] "POST /api/atlas/entities HTTP/1.1" 201 - "-" "Java/1.7.0_80"
127.0.0.1 - - [22/Sep/2017:02:49:59 +0000] "POST /api/atlas/entities HTTP/1.1" 201 - "-" "Java/1.7.0_80"
127.0.0.1 - - [22/Sep/2017:02:49:59 +0000] "POST /api/atlas/entities HTTP/1.1" 201 - "-" "Java/1.7.0_80"
127.0.0.1 - - [22/Sep/2017:02:49:59 +0000] "POST /api/atlas/entities HTTP/1.1" 201 - "-" "Java/1.7.0_80"
127.0.0.1 - - [22/Sep/2017:02:49:59 +0000] "POST /api/atlas/entities HTTP/1.1" 201 - "-" "Java/1.7.0_80"
127.0.0.1 - - [22/Sep/2017:02:49:59 +0000] "POST /api/atlas/entities HTTP/1.1" 201 - "-" "Java/1.7.0_80"
127.0.0.1 - - [22/Sep/2017:02:49:59 +0000] "POST /api/atlas/entities HTTP/1.1" 201 - "-" "Java/1.7.0_80"
127.0.0.1 - - [22/Sep/2017:02:49:59 +0000] "GET /api/atlas/lineage/hive/table/sales_fact_monthly_mvFe5fm2toU6/inputs/graph
HTTP/1.1" 200 - "-" "Java/1.7.0_80"
127.0.0.1 - - [22/Sep/2017:02:50:01 +0000] "GET /api/atlas/entities?type=hive_table_v1&property=qualifiedName&value=sales_factZb8Oox5J2a
HTTP/1.1" 200 - "-" "Java/1.7.0_80"
127.0.0.1 - - [22/Sep/2017:02:50:01 +0000] "GET /api/atlas/lineage/07adc7f6-8f1d-4f57-bf6f-cdece529442b/outputs/graph
HTTP/1.1" 200 - "-" "Java/1.7.0_80"
127.0.0.1 - - [22/Sep/2017:02:50:02 +0000] "GET /api/atlas/entities?type=hive_table_v1&property=qualifiedName&value=sales_factiq6nCBX2JD
HTTP/1.1" 200 - "-" "Java/1.7.0_80"
127.0.0.1 - - [22/Sep/2017:02:50:02 +0000] "GET /api/atlas/v2/lineage/4a5a3621-97c3-4027-9ab3-b62b4e894717?direction=OUTPUT&depth=5
HTTP/1.1" 200 - "-" "Java/1.7.0_80"
127.0.0.1 - - [22/Sep/2017:02:50:03 +0000] "GET /api/atlas/lineage/hive/table/blah/schema
HTTP/1.1" 404 - "-" "Java/1.7.0_80"
127.0.0.1 - - [22/Sep/2017:02:50:03 +0000] "GET /api/atlas/entities?type=hive_table_v1&property=qualifiedName&value=sales_fact_monthly_mvFe5fm2toU6
HTTP/1.1" 200 - "-" "Java/1.7.0_80"
127.0.0.1 - - [22/Sep/2017:02:50:03 +0000] "GET /api/atlas/lineage/65f12d78-13ab-4e20-810a-996d8c8d5c96/inputs/graph
HTTP/1.1" 200 - "-" "Java/1.7.0_80"
127.0.0.1 - - [22/Sep/2017:02:50:04 +0000] "GET /api/atlas/lineage/hive/table/sales_factZb8Oox5J2a/outputs/graph
HTTP/1.1" 200 - "-" "Java/1.7.0_80"
127.0.0.1 - - [22/Sep/2017:02:50:06 +0000] "GET /api/atlas/lineage/hive/table/SalesrB6IoqimXG/schema
HTTP/1.1" 404 - "-" "Java/1.7.0_80"
127.0.0.1 - - [22/Sep/2017:02:50:06 +0000] "GET /api/atlas/entities?type=hive_table_v1&property=qualifiedName&value=sales_factZb8Oox5J2a
HTTP/1.1" 200 - "-" "Java/1.7.0_80"
127.0.0.1 - - [22/Sep/2017:02:50:06 +0000] "GET /api/atlas/lineage/07adc7f6-8f1d-4f57-bf6f-cdece529442b/schema
HTTP/1.1" 200 - "-" "Java/1.7.0_80"
127.0.0.1 - - [22/Sep/2017:02:50:07 +0000] "GET /api/atlas/entities?type=hive_table_v1&property=qualifiedName&value=sales_fact_monthly_mvrexwsklqIx
HTTP/1.1" 200 - "-" "Java/1.7.0_80"
127.0.0.1 - - [22/Sep/2017:02:50:07 +0000] "GET /api/atlas/v2/lineage/3d918d39-5c23-4ad7-92ea-5ff148356acd?direction=BOTH&depth=5
HTTP/1.1" 200 - "-" "Java/1.7.0_80"
127.0.0.1 - - [22/Sep/2017:02:50:09 +0000] "GET /api/atlas/lineage/hive/table/sales_factZb8Oox5J2a/schema
HTTP/1.1" 200 - "-" "Java/1.7.0_80"
127.0.0.1 - - [22/Sep/2017:02:50:10 +0000] "GET /api/atlas/entities?type=hive_table_v1&property=qualifiedName&value=sales_fact_monthly_mvrexwsklqIx
HTTP/1.1" 200 - "-" "Java/1.7.0_80"
127.0.0.1 - - [22/Sep/2017:02:50:10 +0000] "GET /api/atlas/v2/lineage/3d918d39-5c23-4ad7-92ea-5ff148356acd?direction=INPUT&depth=5
HTTP/1.1" 200 - "-" "Java/1.7.0_80"
127.0.0.1 - - [22/Sep/2017:02:50:11 +0000] "POST /api/atlas/v2/types/typedefs/ HTTP/1.1" 409
- "-" "Java/1.7.0_80"
127.0.0.1 - - [22/Sep/2017:02:50:12 +0000] "GET /api/atlas/admin/version HTTP/1.1" 200 - "-"
"Java/1.7.0_80"
Tests run: 134, Failures: 1, Errors: 0, Skipped: 5, Time elapsed: 120.764 sec <<<
FAILURE! - in TestSuite
runQuickStart(org.apache.atlas.examples.QuickStartV2IT)  Time elapsed: 1.412 sec  <<<
FAILURE!
org.apache.atlas.AtlasServiceException: Metadata service API org.apache.atlas.AtlasBaseClient$APIInfo@7196ae42
failed with status 409 (Conflict) Response Body ({"errorCode":"ATLAS-409-00-001","errorMessage":"Given
type Dimension already exists"})
	at org.apache.atlas.examples.QuickStartV2IT.runQuickStart(QuickStartV2IT.java:49)


Results :

Failed tests: 
  QuickStartV2IT.runQuickStart:49 » AtlasService Metadata service API org.apache...

Tests run: 134, Failures: 1, Errors: 0, Skipped: 5

[INFO] 
[INFO] --- jetty-maven-plugin:9.2.12.v20150709:stop (stop-jetty) @ atlas-webapp ---
[INFO] Waiting 10 seconds for jetty to stop
[INFO] Stopped ServerConnector@7d74fdcb{HTTP/1.1}{0.0.0.0:31000}
[INFO] Closing Spring root WebApplicationContext
[INFO] Shutting down log4j
[INFO] Stopped o.e.j.m.p.JettyWebAppContext@37a3d5b2{/,<https://builds.apache.org/job/Atlas-0.8-IntegrationTests/ws/webapp/target/atlas-webapp-0.8.2-SNAPSHOT/,UNAVAILABLE}{/home/jenkins/jenkins-slave/workspace/Atlas-0.8-IntegrationTests/webapp/target/atlas-webapp-0.8.2-SNAPSHOT.war}>
[INFO] Server reports itself as stopped
[INFO] 
[INFO] --- maven-source-plugin:2.4:jar-no-fork (attach-sources) @ atlas-webapp ---
[INFO] Building jar: <https://builds.apache.org/job/Atlas-0.8-IntegrationTests/ws/webapp/target/atlas-webapp-0.8.2-SNAPSHOT-sources.jar>
log4j:WARN No appenders could be found for logger (org.apache.zookeeper.ClientCnxn).
log4j:WARN Please initialize the log4j system properly.
log4j:WARN See http://logging.apache.org/log4j/1.2/faq.html#noconfig for more info.
[INFO] 
[INFO] --- maven-source-plugin:2.4:test-jar-no-fork (attach-sources) @ atlas-webapp ---
[INFO] Building jar: <https://builds.apache.org/job/Atlas-0.8-IntegrationTests/ws/webapp/target/atlas-webapp-0.8.2-SNAPSHOT-test-sources.jar>
[INFO] 
[INFO] --- maven-failsafe-plugin:2.19.1:verify (verify) @ atlas-webapp ---
[INFO] ------------------------------------------------------------------------
[INFO] Reactor Summary:
[INFO] 
[INFO] Apache Atlas Server Build Tools .................... SUCCESS [  0.930 s]
[INFO] apache-atlas ....................................... SUCCESS [  3.998 s]
[INFO] Apache Atlas Integration ........................... SUCCESS [ 24.126 s]
[INFO] Apache Atlas Common ................................ SUCCESS [ 12.647 s]
[INFO] Apache Atlas Typesystem ............................ SUCCESS [ 55.811 s]
[INFO] Apache Atlas Client ................................ SUCCESS [ 14.677 s]
[INFO] Apache Atlas Server API ............................ SUCCESS [  8.892 s]
[INFO] Apache Atlas Notification .......................... SUCCESS [ 13.073 s]
[INFO] Apache Atlas Graph Database Projects ............... SUCCESS [  0.652 s]
[INFO] Apache Atlas Graph Database API .................... SUCCESS [  7.175 s]
[INFO] Graph Database Common Code ......................... SUCCESS [  7.239 s]
[INFO] Apache Atlas Titan 1.0.0 GraphDB Impl .............. SUCCESS [ 27.139 s]
[INFO] Shaded version of Apache hbase client .............. SUCCESS [  8.064 s]
[INFO] Apache Atlas Titan 0.5.4 Graph DB Impl ............. SUCCESS [ 41.001 s]
[INFO] Apache Atlas Graph Database Implementation Dependencies SUCCESS [  0.772 s]
[INFO] Shaded version of Apache hbase server .............. SUCCESS [ 21.504 s]
[INFO] Apache Atlas Repository ............................ SUCCESS [01:35 min]
[INFO] Apache Atlas Authorization ......................... SUCCESS [ 10.755 s]
[INFO] Apache Atlas Business Catalog ...................... SUCCESS [ 14.335 s]
[INFO] Apache Atlas UI .................................... SUCCESS [01:27 min]
[INFO] Apache Atlas Web Application ....................... FAILURE [03:22 min]
[INFO] Apache Atlas Documentation ......................... SKIPPED
[INFO] Apache Atlas FileSystem Model ...................... SKIPPED
[INFO] Apache Atlas Plugin Classloader .................... SKIPPED
[INFO] Apache Atlas Hive Bridge Shim ...................... SKIPPED
[INFO] Apache Atlas Hive Bridge ........................... SKIPPED
[INFO] Apache Atlas Falcon Bridge Shim .................... SKIPPED
[INFO] Apache Atlas Falcon Bridge ......................... SKIPPED
[INFO] Apache Atlas Sqoop Bridge Shim ..................... SKIPPED
[INFO] Apache Atlas Sqoop Bridge .......................... SKIPPED
[INFO] Apache Atlas Storm Bridge Shim ..................... SKIPPED
[INFO] Apache Atlas Storm Bridge .......................... SKIPPED
[INFO] Apache Atlas Distribution .......................... SKIPPED
[INFO] ------------------------------------------------------------------------
[INFO] BUILD FAILURE
[INFO] ------------------------------------------------------------------------
[INFO] Total time: 10:59 min
[INFO] Finished at: 2017-09-22T02:50:18Z
[INFO] Final Memory: 357M/1534M
[INFO] ------------------------------------------------------------------------
[ERROR] Failed to execute goal org.apache.maven.plugins:maven-failsafe-plugin:2.19.1:verify
(verify) on project atlas-webapp: There are test failures.
[ERROR] 
[ERROR] Please refer to <https://builds.apache.org/job/Atlas-0.8-IntegrationTests/ws/webapp/target/failsafe-reports>
for the individual test results.
[ERROR] -> [Help 1]
[ERROR] 
[ERROR] To see the full stack trace of the errors, re-run Maven with the -e switch.
[ERROR] Re-run Maven using the -X switch to enable full debug logging.
[ERROR] 
[ERROR] For more information about the errors and possible solutions, please read the following
articles:
[ERROR] [Help 1] http://cwiki.apache.org/confluence/display/MAVEN/MojoFailureException
[ERROR] 
[ERROR] After correcting the problems, you can resume the build with the command
[ERROR]   mvn <goals> -rf :atlas-webapp
Build step 'Execute shell' marked build as failure
[CHECKSTYLE] Collecting checkstyle analysis files...
[CHECKSTYLE] Searching for all files in <https://builds.apache.org/job/Atlas-0.8-IntegrationTests/ws/>
that match the pattern **/target/checkstyle-result.xml
[CHECKSTYLE] Parsing 19 files in <https://builds.apache.org/job/Atlas-0.8-IntegrationTests/ws/>
[CHECKSTYLE] Successfully parsed file <https://builds.apache.org/job/Atlas-0.8-IntegrationTests/ws/authorization/target/checkstyle-result.xml>
with 467 unique warnings and 0 duplicates.
[CHECKSTYLE] Successfully parsed file <https://builds.apache.org/job/Atlas-0.8-IntegrationTests/ws/catalog/target/checkstyle-result.xml>
with 2604 unique warnings and 0 duplicates.
[CHECKSTYLE] Successfully parsed file <https://builds.apache.org/job/Atlas-0.8-IntegrationTests/ws/client/target/checkstyle-result.xml>
with 4242 unique warnings and 0 duplicates.
[CHECKSTYLE] Successfully parsed file <https://builds.apache.org/job/Atlas-0.8-IntegrationTests/ws/common/target/checkstyle-result.xml>
with 5450 unique warnings and 0 duplicates.
[CHECKSTYLE] Successfully parsed file <https://builds.apache.org/job/Atlas-0.8-IntegrationTests/ws/dashboardv2/target/checkstyle-result.xml>
with 5450 unique warnings and 0 duplicates.
[CHECKSTYLE] Successfully parsed file <https://builds.apache.org/job/Atlas-0.8-IntegrationTests/ws/graphdb/api/target/checkstyle-result.xml>
with 5719 unique warnings and 0 duplicates.
[CHECKSTYLE] Successfully parsed file <https://builds.apache.org/job/Atlas-0.8-IntegrationTests/ws/graphdb/common/target/checkstyle-result.xml>
with 5906 unique warnings and 0 duplicates.
[CHECKSTYLE] Successfully parsed file <https://builds.apache.org/job/Atlas-0.8-IntegrationTests/ws/graphdb/graphdb-impls/target/checkstyle-result.xml>
with 5906 unique warnings and 0 duplicates.
[CHECKSTYLE] Successfully parsed file <https://builds.apache.org/job/Atlas-0.8-IntegrationTests/ws/graphdb/target/checkstyle-result.xml>
with 5906 unique warnings and 0 duplicates.
[CHECKSTYLE] Successfully parsed file <https://builds.apache.org/job/Atlas-0.8-IntegrationTests/ws/graphdb/titan0/target/checkstyle-result.xml>
with 8291 unique warnings and 0 duplicates.
[CHECKSTYLE] Successfully parsed file <https://builds.apache.org/job/Atlas-0.8-IntegrationTests/ws/graphdb/titan1/target/checkstyle-result.xml>
with 9239 unique warnings and 0 duplicates.
[CHECKSTYLE] Successfully parsed file <https://builds.apache.org/job/Atlas-0.8-IntegrationTests/ws/intg/target/checkstyle-result.xml>
with 15696 unique warnings and 0 duplicates.
[CHECKSTYLE] Successfully parsed file <https://builds.apache.org/job/Atlas-0.8-IntegrationTests/ws/notification/target/checkstyle-result.xml>
with 16906 unique warnings and 0 duplicates.
[CHECKSTYLE] Successfully parsed file <https://builds.apache.org/job/Atlas-0.8-IntegrationTests/ws/repository/target/checkstyle-result.xml>
with 35761 unique warnings and 0 duplicates.
[CHECKSTYLE] Successfully parsed file <https://builds.apache.org/job/Atlas-0.8-IntegrationTests/ws/server-api/target/checkstyle-result.xml>
with 36140 unique warnings and 0 duplicates.
[CHECKSTYLE] Successfully parsed file <https://builds.apache.org/job/Atlas-0.8-IntegrationTests/ws/shaded/hbase-client-shaded/target/checkstyle-result.xml>
with 36140 unique warnings and 0 duplicates.
[CHECKSTYLE] Successfully parsed file <https://builds.apache.org/job/Atlas-0.8-IntegrationTests/ws/shaded/hbase-server-shaded/target/checkstyle-result.xml>
with 36140 unique warnings and 0 duplicates.
[CHECKSTYLE] Successfully parsed file <https://builds.apache.org/job/Atlas-0.8-IntegrationTests/ws/target/checkstyle-result.xml>
with 36140 unique warnings and 0 duplicates.
[CHECKSTYLE] Successfully parsed file <https://builds.apache.org/job/Atlas-0.8-IntegrationTests/ws/typesystem/target/checkstyle-result.xml>
with 40358 unique warnings and 0 duplicates.
<Git Blamer> Using GitBlamer to create author and commit information for all warnings.
<Git Blamer> GIT_COMMIT=2d0bc3c62022ccdd52ff930b60aefe6200f22d71, workspace=<https://builds.apache.org/job/Atlas-0.8-IntegrationTests/ws/>
 > git rev-parse 2d0bc3c62022ccdd52ff930b60aefe6200f22d71^{commit} # timeout=10
<Git Blamer> Skipping file <https://builds.apache.org/job/Atlas-0.8-IntegrationTests/ws/graphdb/titan1/src/main/java/org/apache/atlas/repository/graphdb/titan1/graphson/AtlasGraphSONMode.java,>
no result found.
[FINDBUGS] Collecting findbugs analysis files...
[FINDBUGS] Searching for all files in <https://builds.apache.org/job/Atlas-0.8-IntegrationTests/ws/>
that match the pattern **/target/findbugs.xml
[FINDBUGS] Parsing 12 files in <https://builds.apache.org/job/Atlas-0.8-IntegrationTests/ws/>
[FINDBUGS] Successfully parsed file <https://builds.apache.org/job/Atlas-0.8-IntegrationTests/ws/authorization/target/findbugs.xml>
with 0 unique warnings and 0 duplicates.
[FINDBUGS] Successfully parsed file <https://builds.apache.org/job/Atlas-0.8-IntegrationTests/ws/catalog/target/findbugs.xml>
with 0 unique warnings and 0 duplicates.
[FINDBUGS] Successfully parsed file <https://builds.apache.org/job/Atlas-0.8-IntegrationTests/ws/client/target/findbugs.xml>
with 0 unique warnings and 0 duplicates.
[FINDBUGS] Successfully parsed file <https://builds.apache.org/job/Atlas-0.8-IntegrationTests/ws/common/target/findbugs.xml>
with 0 unique warnings and 0 duplicates.
[FINDBUGS] Successfully parsed file <https://builds.apache.org/job/Atlas-0.8-IntegrationTests/ws/graphdb/api/target/findbugs.xml>
with 0 unique warnings and 0 duplicates.
[FINDBUGS] Successfully parsed file <https://builds.apache.org/job/Atlas-0.8-IntegrationTests/ws/graphdb/common/target/findbugs.xml>
with 0 unique warnings and 0 duplicates.
[FINDBUGS] Successfully parsed file <https://builds.apache.org/job/Atlas-0.8-IntegrationTests/ws/graphdb/titan0/target/findbugs.xml>
with 0 unique warnings and 0 duplicates.
[FINDBUGS] Successfully parsed file <https://builds.apache.org/job/Atlas-0.8-IntegrationTests/ws/intg/target/findbugs.xml>
with 0 unique warnings and 0 duplicates.
[FINDBUGS] Successfully parsed file <https://builds.apache.org/job/Atlas-0.8-IntegrationTests/ws/notification/target/findbugs.xml>
with 0 unique warnings and 0 duplicates.
[FINDBUGS] Successfully parsed file <https://builds.apache.org/job/Atlas-0.8-IntegrationTests/ws/repository/target/findbugs.xml>
with 0 unique warnings and 0 duplicates.
[FINDBUGS] Successfully parsed file <https://builds.apache.org/job/Atlas-0.8-IntegrationTests/ws/server-api/target/findbugs.xml>
with 0 unique warnings and 0 duplicates.
[FINDBUGS] Successfully parsed file <https://builds.apache.org/job/Atlas-0.8-IntegrationTests/ws/typesystem/target/findbugs.xml>
with 0 unique warnings and 0 duplicates.
<Git Blamer> Using GitBlamer to create author and commit information for all warnings.
<Git Blamer> GIT_COMMIT=2d0bc3c62022ccdd52ff930b60aefe6200f22d71, workspace=<https://builds.apache.org/job/Atlas-0.8-IntegrationTests/ws/>
Archiving artifacts
[Fast Archiver] No prior successful build to compare, so performing full copy of artifacts
TestNG Reports Processing: START
Looking for TestNG results report in workspace using pattern: **/target/surefire-reports/testng-results.xml,**/target/failsafe-reports/testng-results.xml
Saving reports...
Processing '/x1/jenkins/jenkins-home/jobs/Atlas-0.8-IntegrationTests/builds/75/testng/testng-results.xml'
TestNG Reports Processing: FINISH

Mime
View raw message