atlas-dev mailing list archives

Site index · List index
Message view « Date » · « Thread »
Top « Date » · « Thread »
From Apache Jenkins Server <jenk...@builds.apache.org>
Subject Build failed in Jenkins: Atlas-0.8-IntegrationTests #49
Date Thu, 07 Sep 2017 03:06:06 GMT
See <https://builds.apache.org/job/Atlas-0.8-IntegrationTests/49/display/redirect?page=changes>

Changes:

[ssubramanian] ATLAS-2114: Regression : Type Update using V1 APIs

------------------------------------------
[...truncated 35.57 MB...]
2017-09-07 03:01:19,126 DEBUG - [NotificationHookConsumer thread-0:] ~ Mapping attributeInfo
owner (GraphToTypedInstanceMapper:144)
2017-09-07 03:01:19,126 DEBUG - [NotificationHookConsumer thread-0:] ~ Adding primitive {name=owner,
dataType={name=string, description=null}, multiplicity={lower=0, upper=1, isUnique=false},
isComposite=false, isUnique=false, isIndexable=true, reverseAttributeName=null} from vertex
Titan0Vertex [id=2642432] (GraphToTypedInstanceMapper:387)
2017-09-07 03:01:19,128 DEBUG - [NotificationHookConsumer thread-0:] ~ Reading property Asset.owner
from vertex[id=2642432 type=hive_table guid=4f48ba8e-afac-4fe5-8093-34934ee3938a] (GraphHelper:433)
2017-09-07 03:01:19,129 DEBUG - [NotificationHookConsumer thread-0:] ~ Reading property Asset.owner
from vertex[id=2642432 type=hive_table guid=4f48ba8e-afac-4fe5-8093-34934ee3938a] (GraphHelper:433)
2017-09-07 03:01:19,130 DEBUG - [NotificationHookConsumer thread-0:] ~ Retrieving entities
with guids=[c073c8e8-d162-4ed3-a06f-e299ef336416] (GraphBackedMetadataRepository:179)
2017-09-07 03:01:19,130 DEBUG - [NotificationHookConsumer thread-0:] ~ Retrieving entities
with guids=[d6fb519d-ca6f-4e86-ae35-48439d329807] (GraphBackedMetadataRepository:179)
2017-09-07 03:01:19,130 DEBUG - [NotificationHookConsumer thread-0:] ~ Retrieving entities
with guids=[d8e77365-7beb-4654-b496-55faa8265adc] (GraphBackedMetadataRepository:179)
2017-09-07 03:01:19,131 DEBUG - [NotificationHookConsumer thread-0:] ~ Retrieving entities
with guids=[f9a52438-d727-4941-baa1-49432453f404] (GraphBackedMetadataRepository:179)
2017-09-07 03:01:19,201 DEBUG - [NotificationHookConsumer thread-0:] ~ Sending message for
topic ATLAS_ENTITIES: {"version":{"version":"1.0.0"},"message":{"entity":{"jsonClass":"org.apache.atlas.typesystem.json.InstanceSerialization$_Reference","id":{"jsonClass":"org.apache.atlas.typesystem.json.InstanceSerialization$_Id","id":"4f2acc77-618a-41be-8144-a764b4b51147","version":0,"typeName":"hive_db","state":"ACTIVE"},"typeName":"hive_db","values":{"name":"default","location":"<https://builds.apache.org/job/Atlas-0.8-IntegrationTests/ws/target/metastore","description">:"Default
Hive database","ownerType":{"value":"ROLE","ordinal":2},"qualifiedName":"default@primary","owner":"public","clusterName":"primary"},"traitNames":[],"traits":{},"systemAttributes":{}},"operationType":"ENTITY_UPDATE","traits":[]}}
(KafkaNotification:218)
2017-09-07 03:01:19,201 DEBUG - [NotificationHookConsumer thread-0:] ~ Sending message for
topic ATLAS_ENTITIES: {"version":{"version":"1.0.0"},"message":{"entity":{"jsonClass":"org.apache.atlas.typesystem.json.InstanceSerialization$_Reference","id":{"jsonClass":"org.apache.atlas.typesystem.json.InstanceSerialization$_Id","id":"4f48ba8e-afac-4fe5-8093-34934ee3938a","version":0,"typeName":"hive_table","state":"ACTIVE"},"typeName":"hive_table","values":{"tableType":"EXTERNAL_TABLE","name":"tablekdbx6naztb","createTime":"2017-09-07T02:59:31.000Z","temporary":false,"db":{"jsonClass":"org.apache.atlas.typesystem.json.InstanceSerialization$_Id","id":"4f2acc77-618a-41be-8144-a764b4b51147","version":0,"typeName":"hive_db","state":"ACTIVE"},"retention":0,"qualifiedName":"default.tablekdbx6naztb@primary","columns":[{"jsonClass":"org.apache.atlas.typesystem.json.InstanceSerialization$_Reference","id":{"jsonClass":"org.apache.atlas.typesystem.json.InstanceSerialization$_Id","id":"c073c8e8-d162-4ed3-a06f-e299ef336416","version":0,"typeName":"hive_column","state":"ACTIVE"},"typeName":"hive_column","values":{"name":"id","qualifiedName":"default.tablekdbx6naztb.id@primary","position":0,"owner":"jenkins","type":"int","table":{"jsonClass":"org.apache.atlas.typesystem.json.InstanceSerialization$_Id","id":"4f48ba8e-afac-4fe5-8093-34934ee3938a","version":0,"typeName":"hive_table","state":"ACTIVE"}},"traitNames":[],"traits":{},"systemAttributes":{"createdBy":"jenkins","modifiedBy":"jenkins","createdTime":"2017-09-07T03:01:14.953Z","modifiedTime":"2017-09-07T03:01:17.538Z"}},{"jsonClass":"org.apache.atlas.typesystem.json.InstanceSerialization$_Reference","id":{"jsonClass":"org.apache.atlas.typesystem.json.InstanceSerialization$_Id","id":"d6fb519d-ca6f-4e86-ae35-48439d329807","version":0,"typeName":"hive_column","state":"ACTIVE"},"typeName":"hive_column","values":{"name":"name","qualifiedName":"default.tablekdbx6naztb.name@primary","position":1,"owner":"jenkins","type":"string","table":{"jsonClass":"org.apache.atlas.typesystem.json.InstanceSerialization$_Id","id":"4f48ba8e-afac-4fe5-8093-34934ee3938a","version":0,"typeName":"hive_table","state":"ACTIVE"}},"traitNames":[],"traits":{},"systemAttributes":{"createdBy":"jenkins","modifiedBy":"jenkins","createdTime":"2017-09-07T03:01:14.953Z","modifiedTime":"2017-09-07T03:01:17.538Z"}}],"comment":"table
comment","lastAccessTime":"2017-09-07T02:59:31.000Z","owner":"jenkins","sd":{"jsonClass":"org.apache.atlas.typesystem.json.InstanceSerialization$_Reference","id":{"jsonClass":"org.apache.atlas.typesystem.json.InstanceSerialization$_Id","id":"d8e77365-7beb-4654-b496-55faa8265adc","version":0,"typeName":"hive_storagedesc","state":"ACTIVE"},"typeName":"hive_storagedesc","values":{"location":"p<https://builds.apache.org/job/Atlas-0.8-IntegrationTests/ws/addons/hive-bridge/target/someTestPath-data-nwxmFJhQc1","serdeInfo">:{"jsonClass":"org.apache.atlas.typesystem.json.InstanceSerialization$_Struct","typeName":"hive_serde","values":{"serializationLib":"org.apache.hadoop.hive.serde2.lazy.LazySimpleSerDe","parameters":{"serialization.format":"1"}}},"qualifiedName":"default.tablekdbx6naztb@primary_storage","outputFormat":"org.apache.hadoop.hive.ql.io.HiveIgnoreKeyTextOutputFormat","compressed":false,"numBuckets":-1,"inputFormat":"org.apache.hadoop.mapred.TextInputFormat","storedAsSubDirectories":false,"table":{"jsonClass":"org.apache.atlas.typesystem.json.InstanceSerialization$_Id","id":"4f48ba8e-afac-4fe5-8093-34934ee3938a","version":0,"typeName":"hive_table","state":"ACTIVE"}},"traitNames":[],"traits":{},"systemAttributes":{"createdBy":"jenkins","modifiedBy":"jenkins","createdTime":"2017-09-07T03:01:14.953Z","modifiedTime":"2017-09-07T03:01:17.538Z"}},"parameters":{"comment":"table
comment","EXTERNAL":"TRUE","transient_lastDdlTime":"1504753171"},"partitionKeys":[{"jsonClass":"org.apache.atlas.typesystem.json.InstanceSerialization$_Reference","id":{"jsonClass":"org.apache.atlas.typesystem.json.InstanceSerialization$_Id","id":"f9a52438-d727-4941-baa1-49432453f404","version":0,"typeName":"hive_column","state":"ACTIVE"},"typeName":"hive_column","values":{"name":"dt","qualifiedName":"default.tablekdbx6naztb.dt@primary","position":0,"owner":"jenkins","type":"string","table":{"jsonClass":"org.apache.atlas.typesystem.json.InstanceSerialization$_Id","id":"4f48ba8e-afac-4fe5-8093-34934ee3938a","version":0,"typeName":"hive_table","state":"ACTIVE"}},"traitNames":[],"traits":{},"systemAttributes":{"createdBy":"jenkins","modifiedBy":"jenkins","createdTime":"2017-09-07T03:01:14.953Z","modifiedTime":"2017-09-07T03:01:17.538Z"}}]},"traitNames":[],"traits":{},"systemAttributes":{}},"operationType":"ENTITY_UPDATE","traits":[]}}
(KafkaNotification:218)
2017-09-07 03:01:19,203 DEBUG - [NotificationHookConsumer thread-0:] ~ Sending message for
topic ATLAS_ENTITIES: {"version":{"version":"1.0.0"},"message":{"entity":{"jsonClass":"org.apache.atlas.typesystem.json.InstanceSerialization$_Reference","id":{"jsonClass":"org.apache.atlas.typesystem.json.InstanceSerialization$_Id","id":"c073c8e8-d162-4ed3-a06f-e299ef336416","version":0,"typeName":"hive_column","state":"ACTIVE"},"typeName":"hive_column","values":{"name":"id","qualifiedName":"default.tablekdbx6naztb.id@primary","position":0,"owner":"jenkins","type":"int","table":{"jsonClass":"org.apache.atlas.typesystem.json.InstanceSerialization$_Id","id":"4f48ba8e-afac-4fe5-8093-34934ee3938a","version":0,"typeName":"hive_table","state":"ACTIVE"}},"traitNames":[],"traits":{},"systemAttributes":{}},"operationType":"ENTITY_UPDATE","traits":[]}}
(KafkaNotification:218)
2017-09-07 03:01:19,203 DEBUG - [NotificationHookConsumer thread-0:] ~ Sending message for
topic ATLAS_ENTITIES: {"version":{"version":"1.0.0"},"message":{"entity":{"jsonClass":"org.apache.atlas.typesystem.json.InstanceSerialization$_Reference","id":{"jsonClass":"org.apache.atlas.typesystem.json.InstanceSerialization$_Id","id":"d6fb519d-ca6f-4e86-ae35-48439d329807","version":0,"typeName":"hive_column","state":"ACTIVE"},"typeName":"hive_column","values":{"name":"name","qualifiedName":"default.tablekdbx6naztb.name@primary","position":1,"owner":"jenkins","type":"string","table":{"jsonClass":"org.apache.atlas.typesystem.json.InstanceSerialization$_Id","id":"4f48ba8e-afac-4fe5-8093-34934ee3938a","version":0,"typeName":"hive_table","state":"ACTIVE"}},"traitNames":[],"traits":{},"systemAttributes":{}},"operationType":"ENTITY_UPDATE","traits":[]}}
(KafkaNotification:218)
2017-09-07 03:01:19,204 DEBUG - [NotificationHookConsumer thread-0:] ~ Sending message for
topic ATLAS_ENTITIES: {"version":{"version":"1.0.0"},"message":{"entity":{"jsonClass":"org.apache.atlas.typesystem.json.InstanceSerialization$_Reference","id":{"jsonClass":"org.apache.atlas.typesystem.json.InstanceSerialization$_Id","id":"d8e77365-7beb-4654-b496-55faa8265adc","version":0,"typeName":"hive_storagedesc","state":"ACTIVE"},"typeName":"hive_storagedesc","values":{"location":"p<https://builds.apache.org/job/Atlas-0.8-IntegrationTests/ws/addons/hive-bridge/target/someTestPath-data-nwxmFJhQc1","serdeInfo">:{"jsonClass":"org.apache.atlas.typesystem.json.InstanceSerialization$_Struct","typeName":"hive_serde","values":{"serializationLib":"org.apache.hadoop.hive.serde2.lazy.LazySimpleSerDe","parameters":{"serialization.format":"1"}}},"qualifiedName":"default.tablekdbx6naztb@primary_storage","outputFormat":"org.apache.hadoop.hive.ql.io.HiveIgnoreKeyTextOutputFormat","compressed":false,"numBuckets":-1,"inputFormat":"org.apache.hadoop.mapred.TextInputFormat","storedAsSubDirectories":false,"table":{"jsonClass":"org.apache.atlas.typesystem.json.InstanceSerialization$_Id","id":"4f48ba8e-afac-4fe5-8093-34934ee3938a","version":0,"typeName":"hive_table","state":"ACTIVE"}},"traitNames":[],"traits":{},"systemAttributes":{}},"operationType":"ENTITY_UPDATE","traits":[]}}
(KafkaNotification:218)
2017-09-07 03:01:19,204 DEBUG - [NotificationHookConsumer thread-0:] ~ Sending message for
topic ATLAS_ENTITIES: {"version":{"version":"1.0.0"},"message":{"entity":{"jsonClass":"org.apache.atlas.typesystem.json.InstanceSerialization$_Reference","id":{"jsonClass":"org.apache.atlas.typesystem.json.InstanceSerialization$_Id","id":"f9a52438-d727-4941-baa1-49432453f404","version":0,"typeName":"hive_column","state":"ACTIVE"},"typeName":"hive_column","values":{"name":"dt","qualifiedName":"default.tablekdbx6naztb.dt@primary","position":0,"owner":"jenkins","type":"string","table":{"jsonClass":"org.apache.atlas.typesystem.json.InstanceSerialization$_Id","id":"4f48ba8e-afac-4fe5-8093-34934ee3938a","version":0,"typeName":"hive_table","state":"ACTIVE"}},"traitNames":[],"traits":{},"systemAttributes":{}},"operationType":"ENTITY_UPDATE","traits":[]}}
(KafkaNotification:218)
2017-09-07 03:01:21,632 INFO  - [ShutdownMonitor:] ~ Stopping service org.apache.atlas.notification.NotificationHookConsumer
(Services:65)
2017-09-07 03:01:21,632 INFO  - [ShutdownMonitor:] ~ ==> stopConsumerThreads() (NotificationHookConsumer:181)
2017-09-07 03:01:21,632 INFO  - [ShutdownMonitor:] ~ ==> HookConsumer shutdown() (NotificationHookConsumer$HookConsumer:485)
2017-09-07 03:01:21,633 INFO  - [ShutdownMonitor:] ~ [atlas-hook-consumer-thread], Shutting
down (Logging$class:68)
2017-09-07 03:01:21,860 DEBUG - [Curator-Framework-0-SendThread(localhost:19026):] ~ ==>
InMemoryJAASConfiguration.getAppConfigurationEntry(Client) (InMemoryJAASConfiguration:208)
2017-09-07 03:01:21,861 DEBUG - [Curator-Framework-0-SendThread(localhost:19026):] ~ <==
InMemoryJAASConfiguration.getAppConfigurationEntry(Client): {} (InMemoryJAASConfiguration:238)
2017-09-07 03:01:22,504 DEBUG - [main-SendThread(localhost:19026):] ~ ==> InMemoryJAASConfiguration.getAppConfigurationEntry(Client)
(InMemoryJAASConfiguration:208)
2017-09-07 03:01:22,504 DEBUG - [main-SendThread(localhost:19026):] ~ <== InMemoryJAASConfiguration.getAppConfigurationEntry(Client):
{} (InMemoryJAASConfiguration:238)
2017-09-07 03:01:22,505 WARN  - [main-SendThread(localhost:19026):] ~ Session 0x15e5a435c5a0000
for server null, unexpected error, closing socket connection and attempting reconnect (ClientCnxn$SendThread:1102)
java.net.ConnectException: Connection refused
	at sun.nio.ch.SocketChannelImpl.checkConnect(Native Method)
	at sun.nio.ch.SocketChannelImpl.finishConnect(SocketChannelImpl.java:744)
	at org.apache.zookeeper.ClientCnxnSocketNIO.doTransport(ClientCnxnSocketNIO.java:361)
	at org.apache.zookeeper.ClientCnxn$SendThread.run(ClientCnxn.java:1081)
2017-09-07 03:01:23,279 DEBUG - [Curator-Framework-0-SendThread(localhost:19026):] ~ ==>
InMemoryJAASConfiguration.getAppConfigurationEntry(Client) (InMemoryJAASConfiguration:208)
2017-09-07 03:01:23,279 DEBUG - [Curator-Framework-0-SendThread(localhost:19026):] ~ <==
InMemoryJAASConfiguration.getAppConfigurationEntry(Client): {} (InMemoryJAASConfiguration:238)
2017-09-07 03:01:23,631 DEBUG - [Curator-Framework-0-SendThread(localhost:19026):] ~ ==>
InMemoryJAASConfiguration.getAppConfigurationEntry(Client) (InMemoryJAASConfiguration:208)
2017-09-07 03:01:23,631 DEBUG - [Curator-Framework-0-SendThread(localhost:19026):] ~ <==
InMemoryJAASConfiguration.getAppConfigurationEntry(Client): {} (InMemoryJAASConfiguration:238)
2017-09-07 03:01:23,743 DEBUG - [main-SendThread(localhost:19026):] ~ ==> InMemoryJAASConfiguration.getAppConfigurationEntry(Client)
(InMemoryJAASConfiguration:208)
2017-09-07 03:01:23,744 DEBUG - [main-SendThread(localhost:19026):] ~ <== InMemoryJAASConfiguration.getAppConfigurationEntry(Client):
{} (InMemoryJAASConfiguration:238)
2017-09-07 03:01:23,744 WARN  - [main-SendThread(localhost:19026):] ~ Session 0x15e5a435c5a0000
for server null, unexpected error, closing socket connection and attempting reconnect (ClientCnxn$SendThread:1102)
java.net.ConnectException: Connection refused
	at sun.nio.ch.SocketChannelImpl.checkConnect(Native Method)
	at sun.nio.ch.SocketChannelImpl.finishConnect(SocketChannelImpl.java:744)
	at org.apache.zookeeper.ClientCnxnSocketNIO.doTransport(ClientCnxnSocketNIO.java:361)
	at org.apache.zookeeper.ClientCnxn$SendThread.run(ClientCnxn.java:1081)
2017-09-07 03:01:24,620 DEBUG - [main-SendThread(localhost:19026):] ~ ==> InMemoryJAASConfiguration.getAppConfigurationEntry(Client)
(InMemoryJAASConfiguration:208)
2017-09-07 03:01:24,621 DEBUG - [main-SendThread(localhost:19026):] ~ <== InMemoryJAASConfiguration.getAppConfigurationEntry(Client):
{} (InMemoryJAASConfiguration:238)
2017-09-07 03:01:24,621 WARN  - [main-SendThread(localhost:19026):] ~ Session 0x15e5a435c5a0000
for server null, unexpected error, closing socket connection and attempting reconnect (ClientCnxn$SendThread:1102)
java.net.ConnectException: Connection refused
	at sun.nio.ch.SocketChannelImpl.checkConnect(Native Method)
	at sun.nio.ch.SocketChannelImpl.finishConnect(SocketChannelImpl.java:744)
	at org.apache.zookeeper.ClientCnxnSocketNIO.doTransport(ClientCnxnSocketNIO.java:361)
	at org.apache.zookeeper.ClientCnxn$SendThread.run(ClientCnxn.java:1081)
2017-09-07 03:01:25,122 DEBUG - [Curator-Framework-0-SendThread(localhost:19026):] ~ ==>
InMemoryJAASConfiguration.getAppConfigurationEntry(Client) (InMemoryJAASConfiguration:208)
2017-09-07 03:01:25,122 DEBUG - [Curator-Framework-0-SendThread(localhost:19026):] ~ <==
InMemoryJAASConfiguration.getAppConfigurationEntry(Client): {} (InMemoryJAASConfiguration:238)
2017-09-07 03:01:26,098 DEBUG - [main-SendThread(localhost:19026):] ~ ==> InMemoryJAASConfiguration.getAppConfigurationEntry(Client)
(InMemoryJAASConfiguration:208)
2017-09-07 03:01:26,098 DEBUG - [main-SendThread(localhost:19026):] ~ <== InMemoryJAASConfiguration.getAppConfigurationEntry(Client):
{} (InMemoryJAASConfiguration:238)
2017-09-07 03:01:26,099 WARN  - [main-SendThread(localhost:19026):] ~ Session 0x15e5a435c5a0000
for server null, unexpected error, closing socket connection and attempting reconnect (ClientCnxn$SendThread:1102)
java.net.ConnectException: Connection refused
	at sun.nio.ch.SocketChannelImpl.checkConnect(Native Method)
	at sun.nio.ch.SocketChannelImpl.finishConnect(SocketChannelImpl.java:744)
	at org.apache.zookeeper.ClientCnxnSocketNIO.doTransport(ClientCnxnSocketNIO.java:361)
	at org.apache.zookeeper.ClientCnxn$SendThread.run(ClientCnxn.java:1081)
2017-09-07 03:01:26,186 DEBUG - [Curator-Framework-0-SendThread(localhost:19026):] ~ ==>
InMemoryJAASConfiguration.getAppConfigurationEntry(Client) (InMemoryJAASConfiguration:208)
2017-09-07 03:01:26,187 DEBUG - [Curator-Framework-0-SendThread(localhost:19026):] ~ <==
InMemoryJAASConfiguration.getAppConfigurationEntry(Client): {} (InMemoryJAASConfiguration:238)
2017-09-07 03:01:27,193 DEBUG - [main-SendThread(localhost:19026):] ~ ==> InMemoryJAASConfiguration.getAppConfigurationEntry(Client)
(InMemoryJAASConfiguration:208)
2017-09-07 03:01:27,193 DEBUG - [main-SendThread(localhost:19026):] ~ <== InMemoryJAASConfiguration.getAppConfigurationEntry(Client):
{} (InMemoryJAASConfiguration:238)
2017-09-07 03:01:27,194 WARN  - [main-SendThread(localhost:19026):] ~ Session 0x15e5a435c5a0000
for server null, unexpected error, closing socket connection and attempting reconnect (ClientCnxn$SendThread:1102)
java.net.ConnectException: Connection refused
	at sun.nio.ch.SocketChannelImpl.checkConnect(Native Method)
	at sun.nio.ch.SocketChannelImpl.finishConnect(SocketChannelImpl.java:744)
	at org.apache.zookeeper.ClientCnxnSocketNIO.doTransport(ClientCnxnSocketNIO.java:361)
	at org.apache.zookeeper.ClientCnxn$SendThread.run(ClientCnxn.java:1081)
2017-09-07 03:01:27,663 DEBUG - [Curator-Framework-0-SendThread(localhost:19026):] ~ ==>
InMemoryJAASConfiguration.getAppConfigurationEntry(Client) (InMemoryJAASConfiguration:208)
2017-09-07 03:01:27,664 DEBUG - [Curator-Framework-0-SendThread(localhost:19026):] ~ <==
InMemoryJAASConfiguration.getAppConfigurationEntry(Client): {} (InMemoryJAASConfiguration:238)
2017-09-07 03:01:28,074 DEBUG - [Curator-Framework-0-SendThread(localhost:19026):] ~ ==>
InMemoryJAASConfiguration.getAppConfigurationEntry(Client) (InMemoryJAASConfiguration:208)
2017-09-07 03:01:28,075 DEBUG - [Curator-Framework-0-SendThread(localhost:19026):] ~ <==
InMemoryJAASConfiguration.getAppConfigurationEntry(Client): {} (InMemoryJAASConfiguration:238)
[ERROR] 
java.net.SocketTimeoutException: Read timed out
	at java.net.SocketInputStream.socketRead0(Native Method)
	at java.net.SocketInputStream.read(SocketInputStream.java:152)
	at java.net.SocketInputStream.read(SocketInputStream.java:122)
	at sun.nio.cs.StreamDecoder.readBytes(StreamDecoder.java:283)
	at sun.nio.cs.StreamDecoder.implRead(StreamDecoder.java:325)
	at sun.nio.cs.StreamDecoder.read(StreamDecoder.java:177)
	at java.io.InputStreamReader.read(InputStreamReader.java:184)
	at java.io.BufferedReader.fill(BufferedReader.java:154)
	at java.io.BufferedReader.readLine(BufferedReader.java:317)
	at java.io.LineNumberReader.readLine(LineNumberReader.java:199)
	at org.eclipse.jetty.maven.plugin.JettyStopMojo.execute(JettyStopMojo.java:100)
	at org.apache.maven.plugin.DefaultBuildPluginManager.executeMojo(DefaultBuildPluginManager.java:134)
	at org.apache.maven.lifecycle.internal.MojoExecutor.execute(MojoExecutor.java:208)
	at org.apache.maven.lifecycle.internal.MojoExecutor.execute(MojoExecutor.java:154)
	at org.apache.maven.lifecycle.internal.MojoExecutor.execute(MojoExecutor.java:146)
	at org.apache.maven.lifecycle.internal.LifecycleModuleBuilder.buildProject(LifecycleModuleBuilder.java:117)
	at org.apache.maven.lifecycle.internal.LifecycleModuleBuilder.buildProject(LifecycleModuleBuilder.java:81)
	at org.apache.maven.lifecycle.internal.builder.singlethreaded.SingleThreadedBuilder.build(SingleThreadedBuilder.java:51)
	at org.apache.maven.lifecycle.internal.LifecycleStarter.execute(LifecycleStarter.java:128)
	at org.apache.maven.DefaultMaven.doExecute(DefaultMaven.java:309)
	at org.apache.maven.DefaultMaven.doExecute(DefaultMaven.java:194)
	at org.apache.maven.DefaultMaven.execute(DefaultMaven.java:107)
	at org.apache.maven.cli.MavenCli.execute(MavenCli.java:993)
	at org.apache.maven.cli.MavenCli.doMain(MavenCli.java:345)
	at org.apache.maven.cli.MavenCli.main(MavenCli.java:191)
	at sun.reflect.NativeMethodAccessorImpl.invoke0(Native Method)
	at sun.reflect.NativeMethodAccessorImpl.invoke(NativeMethodAccessorImpl.java:57)
	at sun.reflect.DelegatingMethodAccessorImpl.invoke(DelegatingMethodAccessorImpl.java:43)
	at java.lang.reflect.Method.invoke(Method.java:606)
	at org.codehaus.plexus.classworlds.launcher.Launcher.launchEnhanced(Launcher.java:289)
	at org.codehaus.plexus.classworlds.launcher.Launcher.launch(Launcher.java:229)
	at org.codehaus.plexus.classworlds.launcher.Launcher.mainWithExitCode(Launcher.java:415)
	at org.codehaus.plexus.classworlds.launcher.Launcher.main(Launcher.java:356)
[INFO] 
[INFO] --- maven-source-plugin:2.4:jar-no-fork (attach-sources) @ hive-bridge ---
[INFO] Building jar: <https://builds.apache.org/job/Atlas-0.8-IntegrationTests/ws/addons/hive-bridge/target/hive-bridge-0.8.2-SNAPSHOT-sources.jar>
[INFO] 
[INFO] --- maven-source-plugin:2.4:test-jar-no-fork (attach-sources) @ hive-bridge ---
[INFO] Building jar: <https://builds.apache.org/job/Atlas-0.8-IntegrationTests/ws/addons/hive-bridge/target/hive-bridge-0.8.2-SNAPSHOT-test-sources.jar>
[INFO] 
[INFO] --- maven-failsafe-plugin:2.19.1:verify (verify) @ hive-bridge ---
[INFO] ------------------------------------------------------------------------
[INFO] Reactor Summary:
[INFO] 
[INFO] Apache Atlas Server Build Tools .................... SUCCESS [  0.807 s]
[INFO] apache-atlas ....................................... SUCCESS [  4.402 s]
[INFO] Apache Atlas Integration ........................... SUCCESS [ 27.425 s]
[INFO] Apache Atlas Common ................................ SUCCESS [ 14.244 s]
[INFO] Apache Atlas Typesystem ............................ SUCCESS [01:03 min]
[INFO] Apache Atlas Client ................................ SUCCESS [ 16.544 s]
[INFO] Apache Atlas Server API ............................ SUCCESS [  9.401 s]
[INFO] Apache Atlas Notification .......................... SUCCESS [ 14.981 s]
[INFO] Apache Atlas Graph Database Projects ............... SUCCESS [  0.565 s]
[INFO] Apache Atlas Graph Database API .................... SUCCESS [  7.311 s]
[INFO] Graph Database Common Code ......................... SUCCESS [  7.489 s]
[INFO] Apache Atlas Titan 1.0.0 GraphDB Impl .............. SUCCESS [ 31.560 s]
[INFO] Shaded version of Apache hbase client .............. SUCCESS [  8.313 s]
[INFO] Apache Atlas Titan 0.5.4 Graph DB Impl ............. SUCCESS [ 42.869 s]
[INFO] Apache Atlas Graph Database Implementation Dependencies SUCCESS [  0.678 s]
[INFO] Shaded version of Apache hbase server .............. SUCCESS [ 23.179 s]
[INFO] Apache Atlas Repository ............................ SUCCESS [01:44 min]
[INFO] Apache Atlas Authorization ......................... SUCCESS [ 11.150 s]
[INFO] Apache Atlas Business Catalog ...................... SUCCESS [ 15.441 s]
[INFO] Apache Atlas UI .................................... SUCCESS [01:04 min]
[INFO] Apache Atlas Web Application ....................... SUCCESS [05:17 min]
[INFO] Apache Atlas Documentation ......................... SUCCESS [  6.117 s]
[INFO] Apache Atlas FileSystem Model ...................... SUCCESS [  2.511 s]
[INFO] Apache Atlas Plugin Classloader .................... SUCCESS [ 10.089 s]
[INFO] Apache Atlas Hive Bridge Shim ...................... SUCCESS [  8.270 s]
[INFO] Apache Atlas Hive Bridge ........................... FAILURE [08:34 min]
[INFO] Apache Atlas Falcon Bridge Shim .................... SKIPPED
[INFO] Apache Atlas Falcon Bridge ......................... SKIPPED
[INFO] Apache Atlas Sqoop Bridge Shim ..................... SKIPPED
[INFO] Apache Atlas Sqoop Bridge .......................... SKIPPED
[INFO] Apache Atlas Storm Bridge Shim ..................... SKIPPED
[INFO] Apache Atlas Storm Bridge .......................... SKIPPED
[INFO] Apache Atlas Distribution .......................... SKIPPED
[INFO] ------------------------------------------------------------------------
[INFO] BUILD FAILURE
[INFO] ------------------------------------------------------------------------
[INFO] Total time: 22:08 min
[INFO] Finished at: 2017-09-07T03:01:28Z
[INFO] Final Memory: 573M/1905M
[INFO] ------------------------------------------------------------------------
2017-09-07 03:01:30,046 DEBUG - [main-SendThread(localhost:19026):] ~ ==> InMemoryJAASConfiguration.getAppConfigurationEntry(Client)
(InMemoryJAASConfiguration:208)
2017-09-07 03:01:30,047 DEBUG - [main-SendThread(localhost:19026):] ~ <== InMemoryJAASConfiguration.getAppConfigurationEntry(Client):
{} (InMemoryJAASConfiguration:238)
2017-09-07 03:01:30,047 WARN  - [main-SendThread(localhost:19026):] ~ Session 0x15e5a435c5a0000
for server null, unexpected error, closing socket connection and attempting reconnect (ClientCnxn$SendThread:1102)
java.net.ConnectException: Connection refused
	at sun.nio.ch.SocketChannelImpl.checkConnect(Native Method)
	at sun.nio.ch.SocketChannelImpl.finishConnect(SocketChannelImpl.java:744)
	at org.apache.zookeeper.ClientCnxnSocketNIO.doTransport(ClientCnxnSocketNIO.java:361)
	at org.apache.zookeeper.ClientCnxn$SendThread.run(ClientCnxn.java:1081)
[ERROR] Failed to execute goal org.apache.maven.plugins:maven-failsafe-plugin:2.19.1:verify
(verify) on project hive-bridge: There are test failures.
[ERROR] 
[ERROR] Please refer to <https://builds.apache.org/job/Atlas-0.8-IntegrationTests/ws/addons/hive-bridge/target/failsafe-reports>
for the individual test results.
[ERROR] -> [Help 1]
[ERROR] 
[ERROR] To see the full stack trace of the errors, re-run Maven with the -e switch.
[ERROR] Re-run Maven using the -X switch to enable full debug logging.
[ERROR] 
[ERROR] For more information about the errors and possible solutions, please read the following
articles:
[ERROR] [Help 1] http://cwiki.apache.org/confluence/display/MAVEN/MojoFailureException
[ERROR] 
[ERROR] After correcting the problems, you can resume the build with the command
[ERROR]   mvn <goals> -rf :hive-bridge
2017-09-07 03:01:30,880 DEBUG - [main-SendThread(localhost:19026):] ~ ==> InMemoryJAASConfiguration.getAppConfigurationEntry(Client)
(InMemoryJAASConfiguration:208)
2017-09-07 03:01:30,881 DEBUG - [main-SendThread(localhost:19026):] ~ <== InMemoryJAASConfiguration.getAppConfigurationEntry(Client):
{} (InMemoryJAASConfiguration:238)
2017-09-07 03:01:30,881 WARN  - [main-SendThread(localhost:19026):] ~ Session 0x15e5a435c5a0000
for server null, unexpected error, closing socket connection and attempting reconnect (ClientCnxn$SendThread:1102)
java.net.ConnectException: Connection refused
	at sun.nio.ch.SocketChannelImpl.checkConnect(Native Method)
	at sun.nio.ch.SocketChannelImpl.finishConnect(SocketChannelImpl.java:744)
	at org.apache.zookeeper.ClientCnxnSocketNIO.doTransport(ClientCnxnSocketNIO.java:361)
	at org.apache.zookeeper.ClientCnxn$SendThread.run(ClientCnxn.java:1081)
2017-09-07 03:01:31,048 DEBUG - [Curator-Framework-0-SendThread(localhost:19026):] ~ ==>
InMemoryJAASConfiguration.getAppConfigurationEntry(Client) (InMemoryJAASConfiguration:208)
2017-09-07 03:01:31,049 DEBUG - [Curator-Framework-0-SendThread(localhost:19026):] ~ <==
InMemoryJAASConfiguration.getAppConfigurationEntry(Client): {} (InMemoryJAASConfiguration:238)
Build step 'Execute shell' marked build as failure
[CHECKSTYLE] Collecting checkstyle analysis files...
[CHECKSTYLE] Searching for all files in <https://builds.apache.org/job/Atlas-0.8-IntegrationTests/ws/>
that match the pattern **/target/checkstyle-result.xml
[CHECKSTYLE] Parsing 24 files in <https://builds.apache.org/job/Atlas-0.8-IntegrationTests/ws/>
[CHECKSTYLE] Successfully parsed file <https://builds.apache.org/job/Atlas-0.8-IntegrationTests/ws/addons/hdfs-model/target/checkstyle-result.xml>
with 0 unique warnings and 0 duplicates.
[CHECKSTYLE] Successfully parsed file <https://builds.apache.org/job/Atlas-0.8-IntegrationTests/ws/addons/hive-bridge-shim/target/checkstyle-result.xml>
with 15 unique warnings and 0 duplicates.
[CHECKSTYLE] Successfully parsed file <https://builds.apache.org/job/Atlas-0.8-IntegrationTests/ws/authorization/target/checkstyle-result.xml>
with 482 unique warnings and 0 duplicates.
[CHECKSTYLE] Successfully parsed file <https://builds.apache.org/job/Atlas-0.8-IntegrationTests/ws/catalog/target/checkstyle-result.xml>
with 2627 unique warnings and 0 duplicates.
[CHECKSTYLE] Successfully parsed file <https://builds.apache.org/job/Atlas-0.8-IntegrationTests/ws/client/target/checkstyle-result.xml>
with 4265 unique warnings and 0 duplicates.
[CHECKSTYLE] Successfully parsed file <https://builds.apache.org/job/Atlas-0.8-IntegrationTests/ws/common/target/checkstyle-result.xml>
with 5471 unique warnings and 0 duplicates.
[CHECKSTYLE] Successfully parsed file <https://builds.apache.org/job/Atlas-0.8-IntegrationTests/ws/dashboardv2/target/checkstyle-result.xml>
with 5471 unique warnings and 0 duplicates.
[CHECKSTYLE] Successfully parsed file <https://builds.apache.org/job/Atlas-0.8-IntegrationTests/ws/docs/target/checkstyle-result.xml>
with 5471 unique warnings and 0 duplicates.
[CHECKSTYLE] Successfully parsed file <https://builds.apache.org/job/Atlas-0.8-IntegrationTests/ws/graphdb/api/target/checkstyle-result.xml>
with 5740 unique warnings and 0 duplicates.
[CHECKSTYLE] Successfully parsed file <https://builds.apache.org/job/Atlas-0.8-IntegrationTests/ws/graphdb/common/target/checkstyle-result.xml>
with 5927 unique warnings and 0 duplicates.
[CHECKSTYLE] Successfully parsed file <https://builds.apache.org/job/Atlas-0.8-IntegrationTests/ws/graphdb/graphdb-impls/target/checkstyle-result.xml>
with 5927 unique warnings and 0 duplicates.
[CHECKSTYLE] Successfully parsed file <https://builds.apache.org/job/Atlas-0.8-IntegrationTests/ws/graphdb/target/checkstyle-result.xml>
with 5927 unique warnings and 0 duplicates.
[CHECKSTYLE] Successfully parsed file <https://builds.apache.org/job/Atlas-0.8-IntegrationTests/ws/graphdb/titan0/target/checkstyle-result.xml>
with 8312 unique warnings and 0 duplicates.
[CHECKSTYLE] Successfully parsed file <https://builds.apache.org/job/Atlas-0.8-IntegrationTests/ws/graphdb/titan1/target/checkstyle-result.xml>
with 9260 unique warnings and 0 duplicates.
[CHECKSTYLE] Successfully parsed file <https://builds.apache.org/job/Atlas-0.8-IntegrationTests/ws/intg/target/checkstyle-result.xml>
with 15572 unique warnings and 0 duplicates.
[CHECKSTYLE] Successfully parsed file <https://builds.apache.org/job/Atlas-0.8-IntegrationTests/ws/notification/target/checkstyle-result.xml>
with 16782 unique warnings and 0 duplicates.
[CHECKSTYLE] Successfully parsed file <https://builds.apache.org/job/Atlas-0.8-IntegrationTests/ws/plugin-classloader/target/checkstyle-result.xml>
with 16890 unique warnings and 0 duplicates.
[CHECKSTYLE] Successfully parsed file <https://builds.apache.org/job/Atlas-0.8-IntegrationTests/ws/repository/target/checkstyle-result.xml>
with 35294 unique warnings and 0 duplicates.
[CHECKSTYLE] Successfully parsed file <https://builds.apache.org/job/Atlas-0.8-IntegrationTests/ws/server-api/target/checkstyle-result.xml>
with 35673 unique warnings and 0 duplicates.
[CHECKSTYLE] Successfully parsed file <https://builds.apache.org/job/Atlas-0.8-IntegrationTests/ws/shaded/hbase-client-shaded/target/checkstyle-result.xml>
with 35673 unique warnings and 0 duplicates.
[CHECKSTYLE] Successfully parsed file <https://builds.apache.org/job/Atlas-0.8-IntegrationTests/ws/shaded/hbase-server-shaded/target/checkstyle-result.xml>
with 35673 unique warnings and 0 duplicates.
[CHECKSTYLE] Successfully parsed file <https://builds.apache.org/job/Atlas-0.8-IntegrationTests/ws/target/checkstyle-result.xml>
with 35673 unique warnings and 0 duplicates.
[CHECKSTYLE] Successfully parsed file <https://builds.apache.org/job/Atlas-0.8-IntegrationTests/ws/typesystem/target/checkstyle-result.xml>
with 39891 unique warnings and 0 duplicates.
[CHECKSTYLE] Successfully parsed file <https://builds.apache.org/job/Atlas-0.8-IntegrationTests/ws/webapp/target/checkstyle-result.xml>
with 48008 unique warnings and 0 duplicates.
<Git Blamer> Using GitBlamer to create author and commit information for all warnings.
<Git Blamer> GIT_COMMIT=f52ad35dd1fb6707c6b73bbfeccd8a8fcbf3ae7d, workspace=<https://builds.apache.org/job/Atlas-0.8-IntegrationTests/ws/>
 > git rev-parse f52ad35dd1fb6707c6b73bbfeccd8a8fcbf3ae7d^{commit} # timeout=10
[FINDBUGS] Collecting findbugs analysis files...
[FINDBUGS] Searching for all files in <https://builds.apache.org/job/Atlas-0.8-IntegrationTests/ws/>
that match the pattern **/target/findbugs.xml
[FINDBUGS] Parsing 15 files in <https://builds.apache.org/job/Atlas-0.8-IntegrationTests/ws/>
[FINDBUGS] Successfully parsed file <https://builds.apache.org/job/Atlas-0.8-IntegrationTests/ws/addons/hive-bridge-shim/target/findbugs.xml>
with 0 unique warnings and 0 duplicates.
[FINDBUGS] Successfully parsed file <https://builds.apache.org/job/Atlas-0.8-IntegrationTests/ws/authorization/target/findbugs.xml>
with 0 unique warnings and 0 duplicates.
[FINDBUGS] Successfully parsed file <https://builds.apache.org/job/Atlas-0.8-IntegrationTests/ws/catalog/target/findbugs.xml>
with 0 unique warnings and 0 duplicates.
[FINDBUGS] Successfully parsed file <https://builds.apache.org/job/Atlas-0.8-IntegrationTests/ws/client/target/findbugs.xml>
with 0 unique warnings and 0 duplicates.
[FINDBUGS] Successfully parsed file <https://builds.apache.org/job/Atlas-0.8-IntegrationTests/ws/common/target/findbugs.xml>
with 0 unique warnings and 0 duplicates.
[FINDBUGS] Successfully parsed file <https://builds.apache.org/job/Atlas-0.8-IntegrationTests/ws/graphdb/api/target/findbugs.xml>
with 0 unique warnings and 0 duplicates.
[FINDBUGS] Successfully parsed file <https://builds.apache.org/job/Atlas-0.8-IntegrationTests/ws/graphdb/common/target/findbugs.xml>
with 0 unique warnings and 0 duplicates.
[FINDBUGS] Successfully parsed file <https://builds.apache.org/job/Atlas-0.8-IntegrationTests/ws/graphdb/titan0/target/findbugs.xml>
with 0 unique warnings and 0 duplicates.
[FINDBUGS] Successfully parsed file <https://builds.apache.org/job/Atlas-0.8-IntegrationTests/ws/intg/target/findbugs.xml>
with 0 unique warnings and 0 duplicates.
[FINDBUGS] Successfully parsed file <https://builds.apache.org/job/Atlas-0.8-IntegrationTests/ws/notification/target/findbugs.xml>
with 0 unique warnings and 0 duplicates.
[FINDBUGS] Successfully parsed file <https://builds.apache.org/job/Atlas-0.8-IntegrationTests/ws/plugin-classloader/target/findbugs.xml>
with 0 unique warnings and 0 duplicates.
[FINDBUGS] Successfully parsed file <https://builds.apache.org/job/Atlas-0.8-IntegrationTests/ws/repository/target/findbugs.xml>
with 0 unique warnings and 0 duplicates.
[FINDBUGS] Successfully parsed file <https://builds.apache.org/job/Atlas-0.8-IntegrationTests/ws/server-api/target/findbugs.xml>
with 0 unique warnings and 0 duplicates.
[FINDBUGS] Successfully parsed file <https://builds.apache.org/job/Atlas-0.8-IntegrationTests/ws/typesystem/target/findbugs.xml>
with 0 unique warnings and 0 duplicates.
[FINDBUGS] Successfully parsed file <https://builds.apache.org/job/Atlas-0.8-IntegrationTests/ws/webapp/target/findbugs.xml>
with 0 unique warnings and 0 duplicates.
<Git Blamer> Using GitBlamer to create author and commit information for all warnings.
<Git Blamer> GIT_COMMIT=f52ad35dd1fb6707c6b73bbfeccd8a8fcbf3ae7d, workspace=<https://builds.apache.org/job/Atlas-0.8-IntegrationTests/ws/>
Archiving artifacts
[Fast Archiver] No prior successful build to compare, so performing full copy of artifacts
TestNG Reports Processing: START
Looking for TestNG results report in workspace using pattern: **/target/surefire-reports/testng-results.xml,**/target/failsafe-reports/testng-results.xml
Saving reports...
Processing '/x1/jenkins/jenkins-home/jobs/Atlas-0.8-IntegrationTests/builds/49/testng/testng-results-1.xml'
Processing '/x1/jenkins/jenkins-home/jobs/Atlas-0.8-IntegrationTests/builds/49/testng/testng-results.xml'
20.786516% of tests failed, which exceeded threshold of 0%. Marking build as UNSTABLE
TestNG Reports Processing: FINISH

Mime
View raw message