atlas-dev mailing list archives

Site index · List index
Message view « Date » · « Thread »
Top « Date » · « Thread »
From Apache Jenkins Server <jenk...@builds.apache.org>
Subject Build failed in Jenkins: Atlas-0.8-IntegrationTests #61
Date Fri, 15 Sep 2017 19:12:46 GMT
See <https://builds.apache.org/job/Atlas-0.8-IntegrationTests/61/display/redirect?page=changes>

Changes:

[madhan] ATLAS-2129: import fix to handle shutdown while in the middle of import

------------------------------------------
[...truncated 61.58 MB...]
2017-09-15 19:06:26,782 DEBUG - [NotificationHookConsumer thread-0:] ~ Reading property Asset.name
from vertex[id=2820864 type=hive_table guid=d8107606-79ae-41e5-97cb-db019597407f] (GraphHelper:433)
2017-09-15 19:06:26,782 DEBUG - [NotificationHookConsumer thread-0:] ~ Reading property Asset.name
from vertex[id=2820864 type=hive_table guid=d8107606-79ae-41e5-97cb-db019597407f] (GraphHelper:433)
2017-09-15 19:06:26,783 DEBUG - [NotificationHookConsumer thread-0:] ~ Mapping attributeInfo
description (GraphToTypedInstanceMapper:144)
2017-09-15 19:06:26,783 DEBUG - [NotificationHookConsumer thread-0:] ~ Adding primitive {name=description,
dataType={name=string, description=null}, multiplicity={lower=0, upper=1, isUnique=false},
isComposite=false, isUnique=false, isIndexable=false, reverseAttributeName=null} from vertex
Titan0Vertex [id=2820864] (GraphToTypedInstanceMapper:387)
2017-09-15 19:06:26,783 DEBUG - [NotificationHookConsumer thread-0:] ~ Reading property Asset.description
from vertex[id=2820864 type=hive_table guid=d8107606-79ae-41e5-97cb-db019597407f] (GraphHelper:433)
2017-09-15 19:06:26,783 DEBUG - [NotificationHookConsumer thread-0:] ~ Mapping attributeInfo
owner (GraphToTypedInstanceMapper:144)
2017-09-15 19:06:26,783 DEBUG - [NotificationHookConsumer thread-0:] ~ Adding primitive {name=owner,
dataType={name=string, description=null}, multiplicity={lower=0, upper=1, isUnique=false},
isComposite=false, isUnique=false, isIndexable=true, reverseAttributeName=null} from vertex
Titan0Vertex [id=2820864] (GraphToTypedInstanceMapper:387)
2017-09-15 19:06:26,784 DEBUG - [NotificationHookConsumer thread-0:] ~ Reading property Asset.owner
from vertex[id=2820864 type=hive_table guid=d8107606-79ae-41e5-97cb-db019597407f] (GraphHelper:433)
2017-09-15 19:06:26,784 DEBUG - [NotificationHookConsumer thread-0:] ~ Reading property Asset.owner
from vertex[id=2820864 type=hive_table guid=d8107606-79ae-41e5-97cb-db019597407f] (GraphHelper:433)
2017-09-15 19:06:26,784 DEBUG - [NotificationHookConsumer thread-0:] ~ Retrieving entities
with guids=[fe96478a-66d2-4d1b-a8b7-227239946195] (GraphBackedMetadataRepository:179)
2017-09-15 19:06:26,784 DEBUG - [NotificationHookConsumer thread-0:] ~ Retrieving entities
with guids=[fc634cb9-2244-4cd9-8ffc-420a2edbdc11] (GraphBackedMetadataRepository:179)
2017-09-15 19:06:26,784 DEBUG - [NotificationHookConsumer thread-0:] ~ Retrieving entities
with guids=[3f4f33e7-9e88-43a5-8ef6-c41385ee0da0] (GraphBackedMetadataRepository:179)
2017-09-15 19:06:26,787 DEBUG - [NotificationHookConsumer thread-0:] ~ Sending message for
topic ATLAS_ENTITIES: {"version":{"version":"1.0.0"},"message":{"entity":{"jsonClass":"org.apache.atlas.typesystem.json.InstanceSerialization$_Reference","id":{"jsonClass":"org.apache.atlas.typesystem.json.InstanceSerialization$_Id","id":"d8107606-79ae-41e5-97cb-db019597407f","version":0,"typeName":"hive_table","state":"ACTIVE"},"typeName":"hive_table","values":{"tableType":"MANAGED_TABLE","name":"tablel635zvcnas","createTime":"2017-09-15T19:05:46.000Z","temporary":false,"db":{"jsonClass":"org.apache.atlas.typesystem.json.InstanceSerialization$_Id","id":"58a724ed-ecb6-4eb6-9e6d-5e67d727b0c9","version":0,"typeName":"hive_db","state":"ACTIVE"},"retention":0,"qualifiedName":"default.tablel635zvcnas@primary","columns":[{"jsonClass":"org.apache.atlas.typesystem.json.InstanceSerialization$_Reference","id":{"jsonClass":"org.apache.atlas.typesystem.json.InstanceSerialization$_Id","id":"fe96478a-66d2-4d1b-a8b7-227239946195","version":0,"typeName":"hive_column","state":"ACTIVE"},"typeName":"hive_column","values":{"name":"id","qualifiedName":"default.tablel635zvcnas.id@primary","position":0,"owner":"jenkins","type":"int","table":{"jsonClass":"org.apache.atlas.typesystem.json.InstanceSerialization$_Id","id":"d8107606-79ae-41e5-97cb-db019597407f","version":0,"typeName":"hive_table","state":"ACTIVE"}},"traitNames":[],"traits":{},"systemAttributes":{"createdBy":"jenkins","modifiedBy":"jenkins","createdTime":"2017-09-15T19:06:26.576Z","modifiedTime":"2017-09-15T19:06:26.576Z"}},{"jsonClass":"org.apache.atlas.typesystem.json.InstanceSerialization$_Reference","id":{"jsonClass":"org.apache.atlas.typesystem.json.InstanceSerialization$_Id","id":"fc634cb9-2244-4cd9-8ffc-420a2edbdc11","version":0,"typeName":"hive_column","state":"ACTIVE"},"typeName":"hive_column","values":{"name":"name","qualifiedName":"default.tablel635zvcnas.name@primary","position":1,"owner":"jenkins","type":"string","table":{"jsonClass":"org.apache.atlas.typesystem.json.InstanceSerialization$_Id","id":"d8107606-79ae-41e5-97cb-db019597407f","version":0,"typeName":"hive_table","state":"ACTIVE"}},"traitNames":[],"traits":{},"systemAttributes":{"createdBy":"jenkins","modifiedBy":"jenkins","createdTime":"2017-09-15T19:06:26.576Z","modifiedTime":"2017-09-15T19:06:26.576Z"}}],"comment":"table
comment","lastAccessTime":"2017-09-15T19:05:46.000Z","owner":"jenkins","sd":{"jsonClass":"org.apache.atlas.typesystem.json.InstanceSerialization$_Reference","id":{"jsonClass":"org.apache.atlas.typesystem.json.InstanceSerialization$_Id","id":"3f4f33e7-9e88-43a5-8ef6-c41385ee0da0","version":0,"typeName":"hive_storagedesc","state":"ACTIVE"},"typeName":"hive_storagedesc","values":{"location":"<https://builds.apache.org/job/Atlas-0.8-IntegrationTests/ws/target/metastore/tablel635zvcnas","serdeInfo">:{"jsonClass":"org.apache.atlas.typesystem.json.InstanceSerialization$_Struct","typeName":"hive_serde","values":{"serializationLib":"org.apache.hadoop.hive.serde2.lazy.LazySimpleSerDe","parameters":{"serialization.format":"1"}}},"qualifiedName":"default.tablel635zvcnas@primary_storage","outputFormat":"org.apache.hadoop.hive.ql.io.HiveIgnoreKeyTextOutputFormat","compressed":false,"numBuckets":-1,"inputFormat":"org.apache.hadoop.mapred.TextInputFormat","storedAsSubDirectories":false,"table":{"jsonClass":"org.apache.atlas.typesystem.json.InstanceSerialization$_Id","id":"d8107606-79ae-41e5-97cb-db019597407f","version":0,"typeName":"hive_table","state":"ACTIVE"}},"traitNames":[],"traits":{},"systemAttributes":{"createdBy":"jenkins","modifiedBy":"jenkins","createdTime":"2017-09-15T19:06:26.576Z","modifiedTime":"2017-09-15T19:06:26.576Z"}},"parameters":{"comment":"table
comment","transient_lastDdlTime":"1505502346"}},"traitNames":[],"traits":{},"systemAttributes":{}},"operationType":"ENTITY_CREATE","traits":[]}}
(KafkaNotification:218)
2017-09-15 19:06:26,787 DEBUG - [NotificationHookConsumer thread-0:] ~ Sending message for
topic ATLAS_ENTITIES: {"version":{"version":"1.0.0"},"message":{"entity":{"jsonClass":"org.apache.atlas.typesystem.json.InstanceSerialization$_Reference","id":{"jsonClass":"org.apache.atlas.typesystem.json.InstanceSerialization$_Id","id":"fe96478a-66d2-4d1b-a8b7-227239946195","version":0,"typeName":"hive_column","state":"ACTIVE"},"typeName":"hive_column","values":{"name":"id","qualifiedName":"default.tablel635zvcnas.id@primary","position":0,"owner":"jenkins","type":"int","table":{"jsonClass":"org.apache.atlas.typesystem.json.InstanceSerialization$_Id","id":"d8107606-79ae-41e5-97cb-db019597407f","version":0,"typeName":"hive_table","state":"ACTIVE"}},"traitNames":[],"traits":{},"systemAttributes":{}},"operationType":"ENTITY_CREATE","traits":[]}}
(KafkaNotification:218)
2017-09-15 19:06:26,788 DEBUG - [NotificationHookConsumer thread-0:] ~ Sending message for
topic ATLAS_ENTITIES: {"version":{"version":"1.0.0"},"message":{"entity":{"jsonClass":"org.apache.atlas.typesystem.json.InstanceSerialization$_Reference","id":{"jsonClass":"org.apache.atlas.typesystem.json.InstanceSerialization$_Id","id":"fc634cb9-2244-4cd9-8ffc-420a2edbdc11","version":0,"typeName":"hive_column","state":"ACTIVE"},"typeName":"hive_column","values":{"name":"name","qualifiedName":"default.tablel635zvcnas.name@primary","position":1,"owner":"jenkins","type":"string","table":{"jsonClass":"org.apache.atlas.typesystem.json.InstanceSerialization$_Id","id":"d8107606-79ae-41e5-97cb-db019597407f","version":0,"typeName":"hive_table","state":"ACTIVE"}},"traitNames":[],"traits":{},"systemAttributes":{}},"operationType":"ENTITY_CREATE","traits":[]}}
(KafkaNotification:218)
2017-09-15 19:06:26,788 DEBUG - [NotificationHookConsumer thread-0:] ~ Sending message for
topic ATLAS_ENTITIES: {"version":{"version":"1.0.0"},"message":{"entity":{"jsonClass":"org.apache.atlas.typesystem.json.InstanceSerialization$_Reference","id":{"jsonClass":"org.apache.atlas.typesystem.json.InstanceSerialization$_Id","id":"3f4f33e7-9e88-43a5-8ef6-c41385ee0da0","version":0,"typeName":"hive_storagedesc","state":"ACTIVE"},"typeName":"hive_storagedesc","values":{"location":"<https://builds.apache.org/job/Atlas-0.8-IntegrationTests/ws/target/metastore/tablel635zvcnas","serdeInfo">:{"jsonClass":"org.apache.atlas.typesystem.json.InstanceSerialization$_Struct","typeName":"hive_serde","values":{"serializationLib":"org.apache.hadoop.hive.serde2.lazy.LazySimpleSerDe","parameters":{"serialization.format":"1"}}},"qualifiedName":"default.tablel635zvcnas@primary_storage","outputFormat":"org.apache.hadoop.hive.ql.io.HiveIgnoreKeyTextOutputFormat","compressed":false,"numBuckets":-1,"inputFormat":"org.apache.hadoop.mapred.TextInputFormat","storedAsSubDirectories":false,"table":{"jsonClass":"org.apache.atlas.typesystem.json.InstanceSerialization$_Id","id":"d8107606-79ae-41e5-97cb-db019597407f","version":0,"typeName":"hive_table","state":"ACTIVE"}},"traitNames":[],"traits":{},"systemAttributes":{}},"operationType":"ENTITY_CREATE","traits":[]}}
(KafkaNotification:218)
2017-09-15 19:06:28,174 INFO  - [ShutdownMonitor:] ~ Stopping service org.apache.atlas.notification.NotificationHookConsumer
(Services:65)
2017-09-15 19:06:28,175 INFO  - [ShutdownMonitor:] ~ ==> stopConsumerThreads() (NotificationHookConsumer:181)
2017-09-15 19:06:28,175 INFO  - [ShutdownMonitor:] ~ ==> HookConsumer shutdown() (NotificationHookConsumer$HookConsumer:485)
2017-09-15 19:06:28,175 INFO  - [ShutdownMonitor:] ~ [atlas-hook-consumer-thread], Shutting
down (Logging$class:68)
2017-09-15 19:06:28,474 DEBUG - [main-SendThread(localhost:19026):] ~ ==> InMemoryJAASConfiguration.getAppConfigurationEntry(Client)
(InMemoryJAASConfiguration:208)
2017-09-15 19:06:28,475 DEBUG - [main-SendThread(localhost:19026):] ~ <== InMemoryJAASConfiguration.getAppConfigurationEntry(Client):
{} (InMemoryJAASConfiguration:238)
2017-09-15 19:06:28,476 WARN  - [main-SendThread(localhost:19026):] ~ Session 0x15e86eb632e0000
for server null, unexpected error, closing socket connection and attempting reconnect (ClientCnxn$SendThread:1102)
java.net.ConnectException: Connection refused
	at sun.nio.ch.SocketChannelImpl.checkConnect(Native Method)
	at sun.nio.ch.SocketChannelImpl.finishConnect(SocketChannelImpl.java:744)
	at org.apache.zookeeper.ClientCnxnSocketNIO.doTransport(ClientCnxnSocketNIO.java:361)
	at org.apache.zookeeper.ClientCnxn$SendThread.run(ClientCnxn.java:1081)
2017-09-15 19:06:28,594 DEBUG - [main-SendThread(localhost:19026):] ~ ==> InMemoryJAASConfiguration.getAppConfigurationEntry(Client)
(InMemoryJAASConfiguration:208)
2017-09-15 19:06:28,594 DEBUG - [main-SendThread(localhost:19026):] ~ <== InMemoryJAASConfiguration.getAppConfigurationEntry(Client):
{} (InMemoryJAASConfiguration:238)
2017-09-15 19:06:29,782 DEBUG - [main-SendThread(localhost:19026):] ~ ==> InMemoryJAASConfiguration.getAppConfigurationEntry(Client)
(InMemoryJAASConfiguration:208)
2017-09-15 19:06:29,782 DEBUG - [main-SendThread(localhost:19026):] ~ <== InMemoryJAASConfiguration.getAppConfigurationEntry(Client):
{} (InMemoryJAASConfiguration:238)
2017-09-15 19:06:29,783 WARN  - [main-SendThread(localhost:19026):] ~ Session 0x15e86eb632e0000
for server null, unexpected error, closing socket connection and attempting reconnect (ClientCnxn$SendThread:1102)
java.net.ConnectException: Connection refused
	at sun.nio.ch.SocketChannelImpl.checkConnect(Native Method)
	at sun.nio.ch.SocketChannelImpl.finishConnect(SocketChannelImpl.java:744)
	at org.apache.zookeeper.ClientCnxnSocketNIO.doTransport(ClientCnxnSocketNIO.java:361)
	at org.apache.zookeeper.ClientCnxn$SendThread.run(ClientCnxn.java:1081)
2017-09-15 19:06:30,012 DEBUG - [main-SendThread(localhost:19026):] ~ ==> InMemoryJAASConfiguration.getAppConfigurationEntry(Client)
(InMemoryJAASConfiguration:208)
2017-09-15 19:06:30,013 DEBUG - [main-SendThread(localhost:19026):] ~ <== InMemoryJAASConfiguration.getAppConfigurationEntry(Client):
{} (InMemoryJAASConfiguration:238)
2017-09-15 19:06:30,222 DEBUG - [main-SendThread(localhost:19026):] ~ ==> InMemoryJAASConfiguration.getAppConfigurationEntry(Client)
(InMemoryJAASConfiguration:208)
2017-09-15 19:06:30,222 DEBUG - [main-SendThread(localhost:19026):] ~ <== InMemoryJAASConfiguration.getAppConfigurationEntry(Client):
{} (InMemoryJAASConfiguration:238)
2017-09-15 19:06:30,223 WARN  - [main-SendThread(localhost:19026):] ~ Session 0x15e86eb632e0000
for server null, unexpected error, closing socket connection and attempting reconnect (ClientCnxn$SendThread:1102)
java.net.ConnectException: Connection refused
	at sun.nio.ch.SocketChannelImpl.checkConnect(Native Method)
	at sun.nio.ch.SocketChannelImpl.finishConnect(SocketChannelImpl.java:744)
	at org.apache.zookeeper.ClientCnxnSocketNIO.doTransport(ClientCnxnSocketNIO.java:361)
	at org.apache.zookeeper.ClientCnxn$SendThread.run(ClientCnxn.java:1081)
2017-09-15 19:06:30,638 DEBUG - [main-SendThread(localhost:19026):] ~ ==> InMemoryJAASConfiguration.getAppConfigurationEntry(Client)
(InMemoryJAASConfiguration:208)
2017-09-15 19:06:30,639 DEBUG - [main-SendThread(localhost:19026):] ~ <== InMemoryJAASConfiguration.getAppConfigurationEntry(Client):
{} (InMemoryJAASConfiguration:238)
2017-09-15 19:06:32,310 DEBUG - [main-SendThread(localhost:19026):] ~ ==> InMemoryJAASConfiguration.getAppConfigurationEntry(Client)
(InMemoryJAASConfiguration:208)
2017-09-15 19:06:32,310 DEBUG - [main-SendThread(localhost:19026):] ~ <== InMemoryJAASConfiguration.getAppConfigurationEntry(Client):
{} (InMemoryJAASConfiguration:238)
2017-09-15 19:06:32,311 WARN  - [main-SendThread(localhost:19026):] ~ Session 0x15e86eb632e0000
for server null, unexpected error, closing socket connection and attempting reconnect (ClientCnxn$SendThread:1102)
java.net.ConnectException: Connection refused
	at sun.nio.ch.SocketChannelImpl.checkConnect(Native Method)
	at sun.nio.ch.SocketChannelImpl.finishConnect(SocketChannelImpl.java:744)
	at org.apache.zookeeper.ClientCnxnSocketNIO.doTransport(ClientCnxnSocketNIO.java:361)
	at org.apache.zookeeper.ClientCnxn$SendThread.run(ClientCnxn.java:1081)
2017-09-15 19:06:32,379 DEBUG - [main-SendThread(localhost:19026):] ~ ==> InMemoryJAASConfiguration.getAppConfigurationEntry(Client)
(InMemoryJAASConfiguration:208)
2017-09-15 19:06:32,381 DEBUG - [main-SendThread(localhost:19026):] ~ <== InMemoryJAASConfiguration.getAppConfigurationEntry(Client):
{} (InMemoryJAASConfiguration:238)
2017-09-15 19:06:33,229 DEBUG - [main-SendThread(localhost:19026):] ~ ==> InMemoryJAASConfiguration.getAppConfigurationEntry(Client)
(InMemoryJAASConfiguration:208)
2017-09-15 19:06:33,230 DEBUG - [main-SendThread(localhost:19026):] ~ <== InMemoryJAASConfiguration.getAppConfigurationEntry(Client):
{} (InMemoryJAASConfiguration:238)
2017-09-15 19:06:33,230 WARN  - [main-SendThread(localhost:19026):] ~ Session 0x15e86eb632e0000
for server null, unexpected error, closing socket connection and attempting reconnect (ClientCnxn$SendThread:1102)
java.net.ConnectException: Connection refused
	at sun.nio.ch.SocketChannelImpl.checkConnect(Native Method)
	at sun.nio.ch.SocketChannelImpl.finishConnect(SocketChannelImpl.java:744)
	at org.apache.zookeeper.ClientCnxnSocketNIO.doTransport(ClientCnxnSocketNIO.java:361)
	at org.apache.zookeeper.ClientCnxn$SendThread.run(ClientCnxn.java:1081)
2017-09-15 19:06:33,432 DEBUG - [main-SendThread(localhost:19026):] ~ ==> InMemoryJAASConfiguration.getAppConfigurationEntry(Client)
(InMemoryJAASConfiguration:208)
2017-09-15 19:06:33,432 DEBUG - [main-SendThread(localhost:19026):] ~ <== InMemoryJAASConfiguration.getAppConfigurationEntry(Client):
{} (InMemoryJAASConfiguration:238)
2017-09-15 19:06:35,033 DEBUG - [main-SendThread(localhost:19026):] ~ ==> InMemoryJAASConfiguration.getAppConfigurationEntry(Client)
(InMemoryJAASConfiguration:208)
2017-09-15 19:06:35,033 DEBUG - [main-SendThread(localhost:19026):] ~ <== InMemoryJAASConfiguration.getAppConfigurationEntry(Client):
{} (InMemoryJAASConfiguration:238)
2017-09-15 19:06:35,255 DEBUG - [main-SendThread(localhost:19026):] ~ ==> InMemoryJAASConfiguration.getAppConfigurationEntry(Client)
(InMemoryJAASConfiguration:208)
2017-09-15 19:06:35,255 DEBUG - [main-SendThread(localhost:19026):] ~ <== InMemoryJAASConfiguration.getAppConfigurationEntry(Client):
{} (InMemoryJAASConfiguration:238)
2017-09-15 19:06:35,256 WARN  - [main-SendThread(localhost:19026):] ~ Session 0x15e86eb632e0000
for server null, unexpected error, closing socket connection and attempting reconnect (ClientCnxn$SendThread:1102)
java.net.ConnectException: Connection refused
	at sun.nio.ch.SocketChannelImpl.checkConnect(Native Method)
	at sun.nio.ch.SocketChannelImpl.finishConnect(SocketChannelImpl.java:744)
	at org.apache.zookeeper.ClientCnxnSocketNIO.doTransport(ClientCnxnSocketNIO.java:361)
	at org.apache.zookeeper.ClientCnxn$SendThread.run(ClientCnxn.java:1081)
2017-09-15 19:06:35,500 DEBUG - [main-SendThread(localhost:19026):] ~ ==> InMemoryJAASConfiguration.getAppConfigurationEntry(Client)
(InMemoryJAASConfiguration:208)
2017-09-15 19:06:35,501 DEBUG - [main-SendThread(localhost:19026):] ~ <== InMemoryJAASConfiguration.getAppConfigurationEntry(Client):
{} (InMemoryJAASConfiguration:238)
2017-09-15 19:06:35,501 WARN  - [main-SendThread(localhost:19026):] ~ Session 0x15e86eb632e0000
for server null, unexpected error, closing socket connection and attempting reconnect (ClientCnxn$SendThread:1102)
java.net.ConnectException: Connection refused
	at sun.nio.ch.SocketChannelImpl.checkConnect(Native Method)
	at sun.nio.ch.SocketChannelImpl.finishConnect(SocketChannelImpl.java:744)
	at org.apache.zookeeper.ClientCnxnSocketNIO.doTransport(ClientCnxnSocketNIO.java:361)
	at org.apache.zookeeper.ClientCnxn$SendThread.run(ClientCnxn.java:1081)
2017-09-15 19:06:35,529 DEBUG - [main-SendThread(localhost:19026):] ~ ==> InMemoryJAASConfiguration.getAppConfigurationEntry(Client)
(InMemoryJAASConfiguration:208)
2017-09-15 19:06:35,530 DEBUG - [main-SendThread(localhost:19026):] ~ <== InMemoryJAASConfiguration.getAppConfigurationEntry(Client):
{} (InMemoryJAASConfiguration:238)
[ERROR] 
java.net.SocketTimeoutException: Read timed out
	at java.net.SocketInputStream.socketRead0(Native Method)
	at java.net.SocketInputStream.read(SocketInputStream.java:152)
	at java.net.SocketInputStream.read(SocketInputStream.java:122)
	at sun.nio.cs.StreamDecoder.readBytes(StreamDecoder.java:283)
	at sun.nio.cs.StreamDecoder.implRead(StreamDecoder.java:325)
	at sun.nio.cs.StreamDecoder.read(StreamDecoder.java:177)
	at java.io.InputStreamReader.read(InputStreamReader.java:184)
	at java.io.BufferedReader.fill(BufferedReader.java:154)
	at java.io.BufferedReader.readLine(BufferedReader.java:317)
	at java.io.LineNumberReader.readLine(LineNumberReader.java:199)
	at org.eclipse.jetty.maven.plugin.JettyStopMojo.execute(JettyStopMojo.java:100)
	at org.apache.maven.plugin.DefaultBuildPluginManager.executeMojo(DefaultBuildPluginManager.java:134)
	at org.apache.maven.lifecycle.internal.MojoExecutor.execute(MojoExecutor.java:208)
	at org.apache.maven.lifecycle.internal.MojoExecutor.execute(MojoExecutor.java:154)
	at org.apache.maven.lifecycle.internal.MojoExecutor.execute(MojoExecutor.java:146)
	at org.apache.maven.lifecycle.internal.LifecycleModuleBuilder.buildProject(LifecycleModuleBuilder.java:117)
	at org.apache.maven.lifecycle.internal.LifecycleModuleBuilder.buildProject(LifecycleModuleBuilder.java:81)
	at org.apache.maven.lifecycle.internal.builder.singlethreaded.SingleThreadedBuilder.build(SingleThreadedBuilder.java:51)
	at org.apache.maven.lifecycle.internal.LifecycleStarter.execute(LifecycleStarter.java:128)
	at org.apache.maven.DefaultMaven.doExecute(DefaultMaven.java:309)
	at org.apache.maven.DefaultMaven.doExecute(DefaultMaven.java:194)
	at org.apache.maven.DefaultMaven.execute(DefaultMaven.java:107)
	at org.apache.maven.cli.MavenCli.execute(MavenCli.java:993)
	at org.apache.maven.cli.MavenCli.doMain(MavenCli.java:345)
	at org.apache.maven.cli.MavenCli.main(MavenCli.java:191)
	at sun.reflect.NativeMethodAccessorImpl.invoke0(Native Method)
	at sun.reflect.NativeMethodAccessorImpl.invoke(NativeMethodAccessorImpl.java:57)
	at sun.reflect.DelegatingMethodAccessorImpl.invoke(DelegatingMethodAccessorImpl.java:43)
	at java.lang.reflect.Method.invoke(Method.java:606)
	at org.codehaus.plexus.classworlds.launcher.Launcher.launchEnhanced(Launcher.java:289)
	at org.codehaus.plexus.classworlds.launcher.Launcher.launch(Launcher.java:229)
	at org.codehaus.plexus.classworlds.launcher.Launcher.mainWithExitCode(Launcher.java:415)
	at org.codehaus.plexus.classworlds.launcher.Launcher.main(Launcher.java:356)
[INFO] 
[INFO] --- maven-source-plugin:2.4:jar-no-fork (attach-sources) @ hive-bridge ---
[INFO] Building jar: <https://builds.apache.org/job/Atlas-0.8-IntegrationTests/ws/addons/hive-bridge/target/hive-bridge-0.8.2-SNAPSHOT-sources.jar>
[INFO] 
[INFO] --- maven-source-plugin:2.4:test-jar-no-fork (attach-sources) @ hive-bridge ---
[INFO] Building jar: <https://builds.apache.org/job/Atlas-0.8-IntegrationTests/ws/addons/hive-bridge/target/hive-bridge-0.8.2-SNAPSHOT-test-sources.jar>
[INFO] 
[INFO] --- maven-failsafe-plugin:2.19.1:verify (verify) @ hive-bridge ---
[INFO] ------------------------------------------------------------------------
[INFO] Reactor Summary:
[INFO] 
[INFO] Apache Atlas Server Build Tools .................... SUCCESS [  1.028 s]
[INFO] apache-atlas ....................................... SUCCESS [  5.614 s]
[INFO] Apache Atlas Integration ........................... SUCCESS [ 29.560 s]
[INFO] Apache Atlas Common ................................ SUCCESS [ 16.127 s]
[INFO] Apache Atlas Typesystem ............................ SUCCESS [01:08 min]
[INFO] Apache Atlas Client ................................ SUCCESS [ 18.681 s]
[INFO] Apache Atlas Server API ............................ SUCCESS [ 11.003 s]
[INFO] Apache Atlas Notification .......................... SUCCESS [ 17.601 s]
[INFO] Apache Atlas Graph Database Projects ............... SUCCESS [  0.648 s]
[INFO] Apache Atlas Graph Database API .................... SUCCESS [  7.971 s]
[INFO] Graph Database Common Code ......................... SUCCESS [  8.066 s]
[INFO] Apache Atlas Titan 1.0.0 GraphDB Impl .............. SUCCESS [ 32.572 s]
[INFO] Shaded version of Apache hbase client .............. SUCCESS [  9.051 s]
[INFO] Apache Atlas Titan 0.5.4 Graph DB Impl ............. SUCCESS [ 47.283 s]
[INFO] Apache Atlas Graph Database Implementation Dependencies SUCCESS [  0.764 s]
[INFO] Shaded version of Apache hbase server .............. SUCCESS [ 24.825 s]
[INFO] Apache Atlas Repository ............................ SUCCESS [01:54 min]
[INFO] Apache Atlas Authorization ......................... SUCCESS [ 11.831 s]
[INFO] Apache Atlas Business Catalog ...................... SUCCESS [ 15.838 s]
[INFO] Apache Atlas UI .................................... SUCCESS [01:40 min]
[INFO] Apache Atlas Web Application ....................... SUCCESS [04:56 min]
[INFO] Apache Atlas Documentation ......................... SUCCESS [  8.067 s]
[INFO] Apache Atlas FileSystem Model ...................... SUCCESS [  2.593 s]
[INFO] Apache Atlas Plugin Classloader .................... SUCCESS [ 10.582 s]
[INFO] Apache Atlas Hive Bridge Shim ...................... SUCCESS [  9.235 s]
[INFO] Apache Atlas Hive Bridge ........................... FAILURE [05:34 min]
[INFO] Apache Atlas Falcon Bridge Shim .................... SKIPPED
[INFO] Apache Atlas Falcon Bridge ......................... SKIPPED
[INFO] Apache Atlas Sqoop Bridge Shim ..................... SKIPPED
[INFO] Apache Atlas Sqoop Bridge .......................... SKIPPED
[INFO] Apache Atlas Storm Bridge Shim ..................... SKIPPED
[INFO] Apache Atlas Storm Bridge .......................... SKIPPED
[INFO] Apache Atlas Distribution .......................... SKIPPED
[INFO] ------------------------------------------------------------------------
[INFO] BUILD FAILURE
[INFO] ------------------------------------------------------------------------
[INFO] Total time: 20:05 min
[INFO] Finished at: 2017-09-15T19:06:35Z
[INFO] Final Memory: 584M/2242M
[INFO] ------------------------------------------------------------------------
[ERROR] Failed to execute goal org.apache.maven.plugins:maven-failsafe-plugin:2.19.1:verify
(verify) on project hive-bridge: There are test failures.
[ERROR] 
[ERROR] Please refer to <https://builds.apache.org/job/Atlas-0.8-IntegrationTests/ws/addons/hive-bridge/target/failsafe-reports>
for the individual test results.
[ERROR] -> [Help 1]
[ERROR] 
[ERROR] To see the full stack trace of the errors, re-run Maven with the -e switch.
[ERROR] Re-run Maven using the -X switch to enable full debug logging.
[ERROR] 
[ERROR] For more information about the errors and possible solutions, please read the following
articles:
[ERROR] [Help 1] http://cwiki.apache.org/confluence/display/MAVEN/MojoFailureException
[ERROR] 
[ERROR] After correcting the problems, you can resume the build with the command
[ERROR]   mvn <goals> -rf :hive-bridge
Build step 'Execute shell' marked build as failure
[CHECKSTYLE] Collecting checkstyle analysis files...
[CHECKSTYLE] Searching for all files in <https://builds.apache.org/job/Atlas-0.8-IntegrationTests/ws/>
that match the pattern **/target/checkstyle-result.xml
[CHECKSTYLE] Parsing 24 files in <https://builds.apache.org/job/Atlas-0.8-IntegrationTests/ws/>
[CHECKSTYLE] Successfully parsed file <https://builds.apache.org/job/Atlas-0.8-IntegrationTests/ws/addons/hdfs-model/target/checkstyle-result.xml>
with 0 unique warnings and 0 duplicates.
[CHECKSTYLE] Successfully parsed file <https://builds.apache.org/job/Atlas-0.8-IntegrationTests/ws/addons/hive-bridge-shim/target/checkstyle-result.xml>
with 15 unique warnings and 0 duplicates.
[CHECKSTYLE] Successfully parsed file <https://builds.apache.org/job/Atlas-0.8-IntegrationTests/ws/authorization/target/checkstyle-result.xml>
with 482 unique warnings and 0 duplicates.
[CHECKSTYLE] Successfully parsed file <https://builds.apache.org/job/Atlas-0.8-IntegrationTests/ws/catalog/target/checkstyle-result.xml>
with 2619 unique warnings and 0 duplicates.
[CHECKSTYLE] Successfully parsed file <https://builds.apache.org/job/Atlas-0.8-IntegrationTests/ws/client/target/checkstyle-result.xml>
with 4257 unique warnings and 0 duplicates.
[CHECKSTYLE] Successfully parsed file <https://builds.apache.org/job/Atlas-0.8-IntegrationTests/ws/common/target/checkstyle-result.xml>
with 5463 unique warnings and 0 duplicates.
[CHECKSTYLE] Successfully parsed file <https://builds.apache.org/job/Atlas-0.8-IntegrationTests/ws/dashboardv2/target/checkstyle-result.xml>
with 5463 unique warnings and 0 duplicates.
[CHECKSTYLE] Successfully parsed file <https://builds.apache.org/job/Atlas-0.8-IntegrationTests/ws/docs/target/checkstyle-result.xml>
with 5463 unique warnings and 0 duplicates.
[CHECKSTYLE] Successfully parsed file <https://builds.apache.org/job/Atlas-0.8-IntegrationTests/ws/graphdb/api/target/checkstyle-result.xml>
with 5732 unique warnings and 0 duplicates.
[CHECKSTYLE] Successfully parsed file <https://builds.apache.org/job/Atlas-0.8-IntegrationTests/ws/graphdb/common/target/checkstyle-result.xml>
with 5919 unique warnings and 0 duplicates.
[CHECKSTYLE] Successfully parsed file <https://builds.apache.org/job/Atlas-0.8-IntegrationTests/ws/graphdb/graphdb-impls/target/checkstyle-result.xml>
with 5919 unique warnings and 0 duplicates.
[CHECKSTYLE] Successfully parsed file <https://builds.apache.org/job/Atlas-0.8-IntegrationTests/ws/graphdb/target/checkstyle-result.xml>
with 5919 unique warnings and 0 duplicates.
[CHECKSTYLE] Successfully parsed file <https://builds.apache.org/job/Atlas-0.8-IntegrationTests/ws/graphdb/titan0/target/checkstyle-result.xml>
with 8304 unique warnings and 0 duplicates.
[CHECKSTYLE] Successfully parsed file <https://builds.apache.org/job/Atlas-0.8-IntegrationTests/ws/graphdb/titan1/target/checkstyle-result.xml>
with 9252 unique warnings and 0 duplicates.
[CHECKSTYLE] Successfully parsed file <https://builds.apache.org/job/Atlas-0.8-IntegrationTests/ws/intg/target/checkstyle-result.xml>
with 15567 unique warnings and 0 duplicates.
[CHECKSTYLE] Successfully parsed file <https://builds.apache.org/job/Atlas-0.8-IntegrationTests/ws/notification/target/checkstyle-result.xml>
with 16777 unique warnings and 0 duplicates.
[CHECKSTYLE] Successfully parsed file <https://builds.apache.org/job/Atlas-0.8-IntegrationTests/ws/plugin-classloader/target/checkstyle-result.xml>
with 16885 unique warnings and 0 duplicates.
[CHECKSTYLE] Successfully parsed file <https://builds.apache.org/job/Atlas-0.8-IntegrationTests/ws/repository/target/checkstyle-result.xml>
with 35350 unique warnings and 0 duplicates.
[CHECKSTYLE] Successfully parsed file <https://builds.apache.org/job/Atlas-0.8-IntegrationTests/ws/server-api/target/checkstyle-result.xml>
with 35729 unique warnings and 0 duplicates.
[CHECKSTYLE] Successfully parsed file <https://builds.apache.org/job/Atlas-0.8-IntegrationTests/ws/shaded/hbase-client-shaded/target/checkstyle-result.xml>
with 35729 unique warnings and 0 duplicates.
[CHECKSTYLE] Successfully parsed file <https://builds.apache.org/job/Atlas-0.8-IntegrationTests/ws/shaded/hbase-server-shaded/target/checkstyle-result.xml>
with 35729 unique warnings and 0 duplicates.
[CHECKSTYLE] Successfully parsed file <https://builds.apache.org/job/Atlas-0.8-IntegrationTests/ws/target/checkstyle-result.xml>
with 35729 unique warnings and 0 duplicates.
[CHECKSTYLE] Successfully parsed file <https://builds.apache.org/job/Atlas-0.8-IntegrationTests/ws/typesystem/target/checkstyle-result.xml>
with 39947 unique warnings and 0 duplicates.
[CHECKSTYLE] Successfully parsed file <https://builds.apache.org/job/Atlas-0.8-IntegrationTests/ws/webapp/target/checkstyle-result.xml>
with 48064 unique warnings and 0 duplicates.
<Git Blamer> Using GitBlamer to create author and commit information for all warnings.
<Git Blamer> GIT_COMMIT=4d5e69a85c5ca38ca2216e005feb21f46c5798b8, workspace=<https://builds.apache.org/job/Atlas-0.8-IntegrationTests/ws/>
 > git rev-parse 4d5e69a85c5ca38ca2216e005feb21f46c5798b8^{commit} # timeout=10
[FINDBUGS] Collecting findbugs analysis files...
[FINDBUGS] Searching for all files in <https://builds.apache.org/job/Atlas-0.8-IntegrationTests/ws/>
that match the pattern **/target/findbugs.xml
[FINDBUGS] Parsing 15 files in <https://builds.apache.org/job/Atlas-0.8-IntegrationTests/ws/>
[FINDBUGS] Successfully parsed file <https://builds.apache.org/job/Atlas-0.8-IntegrationTests/ws/addons/hive-bridge-shim/target/findbugs.xml>
with 0 unique warnings and 0 duplicates.
[FINDBUGS] Successfully parsed file <https://builds.apache.org/job/Atlas-0.8-IntegrationTests/ws/authorization/target/findbugs.xml>
with 0 unique warnings and 0 duplicates.
[FINDBUGS] Successfully parsed file <https://builds.apache.org/job/Atlas-0.8-IntegrationTests/ws/catalog/target/findbugs.xml>
with 0 unique warnings and 0 duplicates.
[FINDBUGS] Successfully parsed file <https://builds.apache.org/job/Atlas-0.8-IntegrationTests/ws/client/target/findbugs.xml>
with 0 unique warnings and 0 duplicates.
[FINDBUGS] Successfully parsed file <https://builds.apache.org/job/Atlas-0.8-IntegrationTests/ws/common/target/findbugs.xml>
with 0 unique warnings and 0 duplicates.
[FINDBUGS] Successfully parsed file <https://builds.apache.org/job/Atlas-0.8-IntegrationTests/ws/graphdb/api/target/findbugs.xml>
with 0 unique warnings and 0 duplicates.
[FINDBUGS] Successfully parsed file <https://builds.apache.org/job/Atlas-0.8-IntegrationTests/ws/graphdb/common/target/findbugs.xml>
with 0 unique warnings and 0 duplicates.
[FINDBUGS] Successfully parsed file <https://builds.apache.org/job/Atlas-0.8-IntegrationTests/ws/graphdb/titan0/target/findbugs.xml>
with 0 unique warnings and 0 duplicates.
[FINDBUGS] Successfully parsed file <https://builds.apache.org/job/Atlas-0.8-IntegrationTests/ws/intg/target/findbugs.xml>
with 0 unique warnings and 0 duplicates.
[FINDBUGS] Successfully parsed file <https://builds.apache.org/job/Atlas-0.8-IntegrationTests/ws/notification/target/findbugs.xml>
with 0 unique warnings and 0 duplicates.
[FINDBUGS] Successfully parsed file <https://builds.apache.org/job/Atlas-0.8-IntegrationTests/ws/plugin-classloader/target/findbugs.xml>
with 0 unique warnings and 0 duplicates.
[FINDBUGS] Successfully parsed file <https://builds.apache.org/job/Atlas-0.8-IntegrationTests/ws/repository/target/findbugs.xml>
with 0 unique warnings and 0 duplicates.
[FINDBUGS] Successfully parsed file <https://builds.apache.org/job/Atlas-0.8-IntegrationTests/ws/server-api/target/findbugs.xml>
with 0 unique warnings and 0 duplicates.
[FINDBUGS] Successfully parsed file <https://builds.apache.org/job/Atlas-0.8-IntegrationTests/ws/typesystem/target/findbugs.xml>
with 0 unique warnings and 0 duplicates.
[FINDBUGS] Successfully parsed file <https://builds.apache.org/job/Atlas-0.8-IntegrationTests/ws/webapp/target/findbugs.xml>
with 0 unique warnings and 0 duplicates.
<Git Blamer> Using GitBlamer to create author and commit information for all warnings.
<Git Blamer> GIT_COMMIT=4d5e69a85c5ca38ca2216e005feb21f46c5798b8, workspace=<https://builds.apache.org/job/Atlas-0.8-IntegrationTests/ws/>
Archiving artifacts
[Fast Archiver] No prior successful build to compare, so performing full copy of artifacts
TestNG Reports Processing: START
Looking for TestNG results report in workspace using pattern: **/target/surefire-reports/testng-results.xml,**/target/failsafe-reports/testng-results.xml
Saving reports...
Processing '/x1/jenkins/jenkins-home/jobs/Atlas-0.8-IntegrationTests/builds/61/testng/testng-results-1.xml'
Processing '/x1/jenkins/jenkins-home/jobs/Atlas-0.8-IntegrationTests/builds/61/testng/testng-results.xml'
21.348314% of tests failed, which exceeded threshold of 0%. Marking build as UNSTABLE
TestNG Reports Processing: FINISH

Mime
View raw message