atlas-dev mailing list archives

Site index · List index
Message view « Date » · « Thread »
Top « Date » · « Thread »
From Apache Jenkins Server <jenk...@builds.apache.org>
Subject Build failed in Jenkins: Atlas-master-UnitTests #91
Date Fri, 22 Sep 2017 00:35:24 GMT
See <https://builds.apache.org/job/Atlas-master-UnitTests/91/display/redirect?page=changes>

Changes:

[ssubramanian] ATLAS-2159: Incorrect createTime retrieved for entity attributes in

------------------------------------------
[...truncated 187.89 KB...]
[INFO] 
[INFO] --- findbugs-maven-plugin:3.0.1:findbugs (findbugs) @ atlas-hbase-client-shaded ---
[INFO] 
[INFO] <<< findbugs-maven-plugin:3.0.1:check (findbugs-check) < :findbugs @ atlas-hbase-client-shaded
<<<
[INFO] 
[INFO] 
[INFO] --- findbugs-maven-plugin:3.0.1:check (findbugs-check) @ atlas-hbase-client-shaded
---
[INFO] 
[INFO] --- maven-install-plugin:2.5.2:install (default-install) @ atlas-hbase-client-shaded
---
[INFO] Installing <https://builds.apache.org/job/Atlas-master-UnitTests/ws/shaded/hbase-client-shaded/target/atlas-hbase-client-shaded-0.9-SNAPSHOT.jar>
to /home/jenkins/.m2/repository/org/apache/atlas/atlas-hbase-client-shaded/0.9-SNAPSHOT/atlas-hbase-client-shaded-0.9-SNAPSHOT.jar
[INFO] Installing <https://builds.apache.org/job/Atlas-master-UnitTests/ws/shaded/hbase-client-shaded/dependency-reduced-pom.xml>
to /home/jenkins/.m2/repository/org/apache/atlas/atlas-hbase-client-shaded/0.9-SNAPSHOT/atlas-hbase-client-shaded-0.9-SNAPSHOT.pom
[INFO] Installing <https://builds.apache.org/job/Atlas-master-UnitTests/ws/shaded/hbase-client-shaded/target/atlas-hbase-client-shaded-0.9-SNAPSHOT-sources.jar>
to /home/jenkins/.m2/repository/org/apache/atlas/atlas-hbase-client-shaded/0.9-SNAPSHOT/atlas-hbase-client-shaded-0.9-SNAPSHOT-sources.jar
[INFO] Installing <https://builds.apache.org/job/Atlas-master-UnitTests/ws/shaded/hbase-client-shaded/target/atlas-hbase-client-shaded-0.9-SNAPSHOT-test-sources.jar>
to /home/jenkins/.m2/repository/org/apache/atlas/atlas-hbase-client-shaded/0.9-SNAPSHOT/atlas-hbase-client-shaded-0.9-SNAPSHOT-test-sources.jar
[INFO] 
[INFO] ------------------------------------------------------------------------
[INFO] Building Apache Atlas Titan 0.5.4 Graph DB Impl 0.9-SNAPSHOT
[INFO] ------------------------------------------------------------------------
[INFO] 
[INFO] --- maven-clean-plugin:2.5:clean (default-clean) @ atlas-graphdb-titan0 ---
[INFO] Deleting <https://builds.apache.org/job/Atlas-master-UnitTests/ws/graphdb/titan0>
(includes = [**/*.pyc], excludes = [])
[INFO] 
[INFO] --- buildnumber-maven-plugin:1.4:create (default) @ atlas-graphdb-titan0 ---
[INFO] Executing: /bin/sh -c cd '<https://builds.apache.org/job/Atlas-master-UnitTests/ws/graphdb/titan0'>
&& 'git' 'rev-parse' '--verify' 'HEAD'
[INFO] Working directory: <https://builds.apache.org/job/Atlas-master-UnitTests/ws/graphdb/titan0>
[INFO] Storing buildNumber: 9d01689d326f938443de715a090afe26f6df1300 at timestamp: 1506040225649
[WARNING] Cannot get the branch information from the git repository: 
Detecting the current branch failed: fatal: ref HEAD is not a symbolic ref

[INFO] Executing: /bin/sh -c cd '<https://builds.apache.org/job/Atlas-master-UnitTests/ws/graphdb/titan0'>
&& 'git' 'rev-parse' '--verify' 'HEAD'
[INFO] Working directory: <https://builds.apache.org/job/Atlas-master-UnitTests/ws/graphdb/titan0>
[INFO] Storing buildScmBranch: UNKNOWN
[INFO] 
[INFO] --- apache-rat-plugin:0.7:check (rat-check) @ atlas-graphdb-titan0 ---
[INFO] Exclude: **/dependency-reduced-pom.xml
[INFO] Exclude: **/javax.script.ScriptEngineFactory
[INFO] Exclude: .reviewboardrc
[INFO] Exclude: 3party-licenses/**
[INFO] Exclude: **/.cache
[INFO] Exclude: **/.cache-main
[INFO] Exclude: **/.cache-tests
[INFO] Exclude: **/.checkstyle
[INFO] Exclude: *.txt
[INFO] Exclude: **/*.json
[INFO] Exclude: .pc/**
[INFO] Exclude: debian/**
[INFO] Exclude: .svn/**
[INFO] Exclude: .git/**
[INFO] Exclude: .gitignore
[INFO] Exclude: **/.idea/**
[INFO] Exclude: **/*.twiki
[INFO] Exclude: **/*.iml
[INFO] Exclude: **/*.json
[INFO] Exclude: **/*.log
[INFO] Exclude: **/target/**
[INFO] Exclude: **/target*/**
[INFO] Exclude: **/build/**
[INFO] Exclude: **/*.patch
[INFO] Exclude: derby.log
[INFO] Exclude: **/logs/**
[INFO] Exclude: **/.classpath
[INFO] Exclude: **/.project
[INFO] Exclude: **/.settings/**
[INFO] Exclude: **/test-output/**
[INFO] Exclude: **/mock/**
[INFO] Exclude: **/data/**
[INFO] Exclude: **/maven-eclipse.xml
[INFO] Exclude: **/.externalToolBuilders/**
[INFO] Exclude: **/build.log
[INFO] Exclude: **/.bowerrc
[INFO] Exclude: *.json
[INFO] Exclude: **/overlays/**
[INFO] Exclude: dev-support/**
[INFO] Exclude: **/users-credentials.properties
[INFO] Exclude: **/public/css/animate.min.css
[INFO] Exclude: **/public/css/bootstrap-sidebar.css
[INFO] Exclude: **/public/js/external_lib/**
[INFO] Exclude: **/node_modules/**
[INFO] Exclude: **/public/js/libs/**
[INFO] Exclude: **/atlas.data/**
[INFO] Exclude: **/${sys:atlas.data}/**
[INFO] Exclude: **/policy-store.txt
[INFO] Exclude: **/*rebel*.xml
[INFO] Exclude: **/*rebel*.xml.bak
[INFO] 
[INFO] --- maven-remote-resources-plugin:1.5:process (default) @ atlas-graphdb-titan0 ---
[INFO] 
[INFO] --- maven-resources-plugin:2.7:resources (default-resources) @ atlas-graphdb-titan0
---
[INFO] Using 'UTF-8' encoding to copy filtered resources.
[INFO] skip non existing resourceDirectory <https://builds.apache.org/job/Atlas-master-UnitTests/ws/graphdb/titan0/src/main/resources>
[INFO] Copying 0 resource to META-INF
[INFO] Copying 3 resources
[INFO] 
[INFO] --- maven-compiler-plugin:3.1:compile (default-compile) @ atlas-graphdb-titan0 ---
[INFO] Changes detected - recompiling the module!
[INFO] Compiling 35 source files to <https://builds.apache.org/job/Atlas-master-UnitTests/ws/graphdb/titan0/target/classes>
[WARNING] <https://builds.apache.org/job/Atlas-master-UnitTests/ws/graphdb/titan0/src/main/java/com/thinkaurelius/titan/diskstorage/hbase/HTable0_98.java>:
Some input files use or override a deprecated API.
[WARNING] <https://builds.apache.org/job/Atlas-master-UnitTests/ws/graphdb/titan0/src/main/java/com/thinkaurelius/titan/diskstorage/hbase/HTable0_98.java>:
Recompile with -Xlint:deprecation for details.
[WARNING] <https://builds.apache.org/job/Atlas-master-UnitTests/ws/graphdb/titan0/src/main/java/org/apache/atlas/repository/graphdb/titan0/Titan0Graph.java>:
Some input files use unchecked or unsafe operations.
[WARNING] <https://builds.apache.org/job/Atlas-master-UnitTests/ws/graphdb/titan0/src/main/java/org/apache/atlas/repository/graphdb/titan0/Titan0Graph.java>:
Recompile with -Xlint:unchecked for details.
[INFO] 
[INFO] --- maven-resources-plugin:2.7:testResources (default-testResources) @ atlas-graphdb-titan0
---
[INFO] Using 'UTF-8' encoding to copy filtered resources.
[INFO] Copying 1 resource
[INFO] skip non existing resourceDirectory <https://builds.apache.org/job/Atlas-master-UnitTests/ws/graphdb/titan0/typesystem/src/test/resources>
[INFO] Copying 3 resources
[INFO] 
[INFO] --- maven-compiler-plugin:3.1:testCompile (default-testCompile) @ atlas-graphdb-titan0
---
[INFO] Changes detected - recompiling the module!
[INFO] Compiling 6 source files to <https://builds.apache.org/job/Atlas-master-UnitTests/ws/graphdb/titan0/target/test-classes>
[WARNING] <https://builds.apache.org/job/Atlas-master-UnitTests/ws/graphdb/titan0/src/test/java/org/apache/atlas/repository/graphdb/titan0/Titan0DatabaseTest.java>:
Some input files use unchecked or unsafe operations.
[WARNING] <https://builds.apache.org/job/Atlas-master-UnitTests/ws/graphdb/titan0/src/test/java/org/apache/atlas/repository/graphdb/titan0/Titan0DatabaseTest.java>:
Recompile with -Xlint:unchecked for details.
[INFO] 
[INFO] --- maven-surefire-plugin:2.18.1:test (default-test) @ atlas-graphdb-titan0 ---
[INFO] Surefire report directory: <https://builds.apache.org/job/Atlas-master-UnitTests/ws/graphdb/titan0/target/surefire-reports>
[INFO] Using configured provider org.apache.maven.surefire.testng.TestNGProvider
[WARNING] file.encoding cannot be set as system property, use <argLine>-Dfile.encoding=...<argLine>
instead

-------------------------------------------------------
 T E S T S
-------------------------------------------------------
Running org.apache.atlas.repository.graphdb.titan0.AbstractGraphDatabaseTest
Running com.thinkaurelius.titan.diskstorage.hbase.HBaseKeyColumnValueStoreTest
Running org.apache.atlas.repository.graphdb.titan0.GraphQueryTest
Running org.apache.atlas.repository.graphdb.titan0.Titan0DatabaseTest
Running com.thinkaurelius.titan.diskstorage.locking.LocalLockMediatorTest
Running org.apache.atlas.repository.graphdb.titan0.Titan0DatabaseValidationTest
Tests run: 0, Failures: 0, Errors: 0, Skipped: 0, Time elapsed: 0.396 sec - in org.apache.atlas.repository.graphdb.titan0.AbstractGraphDatabaseTest
Tests run: 1, Failures: 1, Errors: 0, Skipped: 0, Time elapsed: 1.14 sec <<< FAILURE!
- in com.thinkaurelius.titan.diskstorage.locking.LocalLockMediatorTest
testLock(com.thinkaurelius.titan.diskstorage.locking.LocalLockMediatorTest)  Time elapsed:
0.134 sec  <<< FAILURE!
java.lang.AssertionError: expected:<true> but was:<false>
	at org.testng.Assert.fail(Assert.java:89)
	at org.testng.Assert.failNotEquals(Assert.java:489)
	at org.testng.Assert.assertTrue(Assert.java:37)
	at org.testng.Assert.assertTrue(Assert.java:47)
	at com.thinkaurelius.titan.diskstorage.locking.LocalLockMediatorTest.testLock(LocalLockMediatorTest.java:46)

Tests run: 3, Failures: 0, Errors: 0, Skipped: 0, Time elapsed: 1.512 sec - in com.thinkaurelius.titan.diskstorage.hbase.HBaseKeyColumnValueStoreTest
Tests run: 1, Failures: 0, Errors: 0, Skipped: 0, Time elapsed: 12.713 sec - in org.apache.atlas.repository.graphdb.titan0.Titan0DatabaseValidationTest
Tests run: 10, Failures: 0, Errors: 0, Skipped: 0, Time elapsed: 16.526 sec - in org.apache.atlas.repository.graphdb.titan0.Titan0DatabaseTest
Tests run: 9, Failures: 0, Errors: 0, Skipped: 0, Time elapsed: 42.141 sec - in org.apache.atlas.repository.graphdb.titan0.GraphQueryTest

Results :

Failed tests: 
  LocalLockMediatorTest.testLock:46 expected:<true> but was:<false>

Tests run: 24, Failures: 1, Errors: 0, Skipped: 0

[INFO] ------------------------------------------------------------------------
[INFO] Reactor Summary:
[INFO] 
[INFO] Apache Atlas Server Build Tools .................... SUCCESS [  0.952 s]
[INFO] apache-atlas ....................................... SUCCESS [  5.041 s]
[INFO] Apache Atlas Integration ........................... SUCCESS [ 37.915 s]
[INFO] Apache Atlas Common ................................ SUCCESS [ 15.437 s]
[INFO] Apache Atlas Typesystem ............................ SUCCESS [01:11 min]
[INFO] Apache Atlas Client ................................ SUCCESS [ 21.663 s]
[INFO] Apache Atlas Server API ............................ SUCCESS [ 10.071 s]
[INFO] Apache Atlas Notification .......................... SUCCESS [ 23.787 s]
[INFO] Apache Atlas Graph Database Projects ............... SUCCESS [  0.616 s]
[INFO] Apache Atlas Graph Database API .................... SUCCESS [  7.623 s]
[INFO] Graph Database Common Code ......................... SUCCESS [  7.512 s]
[INFO] Apache Atlas Titan 1.0.0 GraphDB Impl .............. SUCCESS [ 33.096 s]
[INFO] Shaded version of Apache hbase client .............. SUCCESS [  8.775 s]
[INFO] Apache Atlas Titan 0.5.4 Graph DB Impl ............. FAILURE [ 45.706 s]
[INFO] Apache Atlas Graph Database Implementation Dependencies SKIPPED
[INFO] Shaded version of Apache hbase server .............. SKIPPED
[INFO] Apache Atlas Repository ............................ SKIPPED
[INFO] Apache Atlas Authorization ......................... SKIPPED
[INFO] Apache Atlas Business Catalog ...................... SKIPPED
[INFO] Apache Atlas UI .................................... SKIPPED
[INFO] Apache Atlas Web Application ....................... SKIPPED
[INFO] Apache Atlas Documentation ......................... SKIPPED
[INFO] Apache Atlas FileSystem Model ...................... SKIPPED
[INFO] Apache Atlas Plugin Classloader .................... SKIPPED
[INFO] Apache Atlas Hive Bridge Shim ...................... SKIPPED
[INFO] Apache Atlas Hive Bridge ........................... SKIPPED
[INFO] Apache Atlas Falcon Bridge Shim .................... SKIPPED
[INFO] Apache Atlas Falcon Bridge ......................... SKIPPED
[INFO] Apache Atlas Sqoop Bridge Shim ..................... SKIPPED
[INFO] Apache Atlas Sqoop Bridge .......................... SKIPPED
[INFO] Apache Atlas Storm Bridge Shim ..................... SKIPPED
[INFO] Apache Atlas Storm Bridge .......................... SKIPPED
[INFO] Apache Atlas Distribution .......................... SKIPPED
[INFO] ------------------------------------------------------------------------
[INFO] BUILD FAILURE
[INFO] ------------------------------------------------------------------------
[INFO] Total time: 04:52 min
[INFO] Finished at: 2017-09-22T00:31:11Z
[INFO] Final Memory: 136M/1762M
[INFO] ------------------------------------------------------------------------
[ERROR] Failed to execute goal org.apache.maven.plugins:maven-surefire-plugin:2.18.1:test
(default-test) on project atlas-graphdb-titan0: There are test failures.
[ERROR] 
[ERROR] Please refer to <https://builds.apache.org/job/Atlas-master-UnitTests/ws/graphdb/titan0/target/surefire-reports>
for the individual test results.
[ERROR] -> [Help 1]
[ERROR] 
[ERROR] To see the full stack trace of the errors, re-run Maven with the -e switch.
[ERROR] Re-run Maven using the -X switch to enable full debug logging.
[ERROR] 
[ERROR] For more information about the errors and possible solutions, please read the following
articles:
[ERROR] [Help 1] http://cwiki.apache.org/confluence/display/MAVEN/MojoFailureException
[ERROR] 
[ERROR] After correcting the problems, you can resume the build with the command
[ERROR]   mvn <goals> -rf :atlas-graphdb-titan0
Build step 'Execute shell' marked build as failure
[CHECKSTYLE] Collecting checkstyle analysis files...
[CHECKSTYLE] Searching for all files in <https://builds.apache.org/job/Atlas-master-UnitTests/ws/>
that match the pattern **/target/checkstyle-result.xml
[CHECKSTYLE] Parsing 12 files in <https://builds.apache.org/job/Atlas-master-UnitTests/ws/>
[CHECKSTYLE] Successfully parsed file <https://builds.apache.org/job/Atlas-master-UnitTests/ws/client/target/checkstyle-result.xml>
with 1637 unique warnings and 0 duplicates.
[CHECKSTYLE] Successfully parsed file <https://builds.apache.org/job/Atlas-master-UnitTests/ws/common/target/checkstyle-result.xml>
with 2851 unique warnings and 0 duplicates.
[CHECKSTYLE] Successfully parsed file <https://builds.apache.org/job/Atlas-master-UnitTests/ws/graphdb/api/target/checkstyle-result.xml>
with 3120 unique warnings and 0 duplicates.
[CHECKSTYLE] Successfully parsed file <https://builds.apache.org/job/Atlas-master-UnitTests/ws/graphdb/common/target/checkstyle-result.xml>
with 3307 unique warnings and 0 duplicates.
[CHECKSTYLE] Successfully parsed file <https://builds.apache.org/job/Atlas-master-UnitTests/ws/graphdb/target/checkstyle-result.xml>
with 3307 unique warnings and 0 duplicates.
[CHECKSTYLE] Successfully parsed file <https://builds.apache.org/job/Atlas-master-UnitTests/ws/graphdb/titan1/target/checkstyle-result.xml>
with 4255 unique warnings and 0 duplicates.
[CHECKSTYLE] Successfully parsed file <https://builds.apache.org/job/Atlas-master-UnitTests/ws/intg/target/checkstyle-result.xml>
with 12204 unique warnings and 0 duplicates.
[CHECKSTYLE] Successfully parsed file <https://builds.apache.org/job/Atlas-master-UnitTests/ws/notification/target/checkstyle-result.xml>
with 13414 unique warnings and 0 duplicates.
[CHECKSTYLE] Successfully parsed file <https://builds.apache.org/job/Atlas-master-UnitTests/ws/server-api/target/checkstyle-result.xml>
with 13793 unique warnings and 0 duplicates.
[CHECKSTYLE] Successfully parsed file <https://builds.apache.org/job/Atlas-master-UnitTests/ws/shaded/hbase-client-shaded/target/checkstyle-result.xml>
with 13793 unique warnings and 0 duplicates.
[CHECKSTYLE] Successfully parsed file <https://builds.apache.org/job/Atlas-master-UnitTests/ws/target/checkstyle-result.xml>
with 13793 unique warnings and 0 duplicates.
[CHECKSTYLE] Successfully parsed file <https://builds.apache.org/job/Atlas-master-UnitTests/ws/typesystem/target/checkstyle-result.xml>
with 18011 unique warnings and 0 duplicates.
<Git Blamer> Using GitBlamer to create author and commit information for all warnings.
<Git Blamer> GIT_COMMIT=9d01689d326f938443de715a090afe26f6df1300, workspace=<https://builds.apache.org/job/Atlas-master-UnitTests/ws/>
 > git rev-parse 9d01689d326f938443de715a090afe26f6df1300^{commit} # timeout=10
[CHECKSTYLE] Computing warning deltas based on reference build #59
[FINDBUGS] Collecting findbugs analysis files...
[FINDBUGS] Searching for all files in <https://builds.apache.org/job/Atlas-master-UnitTests/ws/>
that match the pattern **/target/findbugs.xml
[FINDBUGS] Parsing 8 files in <https://builds.apache.org/job/Atlas-master-UnitTests/ws/>
[FINDBUGS] Successfully parsed file <https://builds.apache.org/job/Atlas-master-UnitTests/ws/client/target/findbugs.xml>
with 0 unique warnings and 0 duplicates.
[FINDBUGS] Successfully parsed file <https://builds.apache.org/job/Atlas-master-UnitTests/ws/common/target/findbugs.xml>
with 0 unique warnings and 0 duplicates.
[FINDBUGS] Successfully parsed file <https://builds.apache.org/job/Atlas-master-UnitTests/ws/graphdb/api/target/findbugs.xml>
with 0 unique warnings and 0 duplicates.
[FINDBUGS] Successfully parsed file <https://builds.apache.org/job/Atlas-master-UnitTests/ws/graphdb/common/target/findbugs.xml>
with 0 unique warnings and 0 duplicates.
[FINDBUGS] Successfully parsed file <https://builds.apache.org/job/Atlas-master-UnitTests/ws/intg/target/findbugs.xml>
with 0 unique warnings and 0 duplicates.
[FINDBUGS] Successfully parsed file <https://builds.apache.org/job/Atlas-master-UnitTests/ws/notification/target/findbugs.xml>
with 0 unique warnings and 0 duplicates.
[FINDBUGS] Successfully parsed file <https://builds.apache.org/job/Atlas-master-UnitTests/ws/server-api/target/findbugs.xml>
with 0 unique warnings and 0 duplicates.
[FINDBUGS] Successfully parsed file <https://builds.apache.org/job/Atlas-master-UnitTests/ws/typesystem/target/findbugs.xml>
with 0 unique warnings and 0 duplicates.
<Git Blamer> Using GitBlamer to create author and commit information for all warnings.
<Git Blamer> GIT_COMMIT=9d01689d326f938443de715a090afe26f6df1300, workspace=<https://builds.apache.org/job/Atlas-master-UnitTests/ws/>
[FINDBUGS] Computing warning deltas based on reference build #59
Archiving artifacts
TestNG Reports Processing: START
Looking for TestNG results report in workspace using pattern: **/target/surefire-reports/testng-results.xml,**/target/failsafe-reports/testng-results.xml
Saving reports...
Processing '/x1/jenkins/jenkins-home/jobs/Atlas-master-UnitTests/builds/91/testng/testng-results-1.xml'
Processing '/x1/jenkins/jenkins-home/jobs/Atlas-master-UnitTests/builds/91/testng/testng-results-2.xml'
Processing '/x1/jenkins/jenkins-home/jobs/Atlas-master-UnitTests/builds/91/testng/testng-results-3.xml'
Processing '/x1/jenkins/jenkins-home/jobs/Atlas-master-UnitTests/builds/91/testng/testng-results-4.xml'
Processing '/x1/jenkins/jenkins-home/jobs/Atlas-master-UnitTests/builds/91/testng/testng-results-5.xml'
Processing '/x1/jenkins/jenkins-home/jobs/Atlas-master-UnitTests/builds/91/testng/testng-results.xml'
TestNG Reports Processing: FINISH

Mime
View raw message