atlas-dev mailing list archives

Site index · List index
Message view « Date » · « Thread »
Top « Date » · « Thread »
From Apache Jenkins Server <jenk...@builds.apache.org>
Subject Build failed in Jenkins: Atlas-0.8-IntegrationTests #56
Date Thu, 14 Sep 2017 03:09:24 GMT
See <https://builds.apache.org/job/Atlas-0.8-IntegrationTests/56/display/redirect?page=changes>

Changes:

[amestry] ATLAS-2134: Code Improvements.

------------------------------------------
[...truncated 42.69 MB...]
2017-09-14 03:02:07,659 DEBUG - [NotificationHookConsumer thread-0:] ~ Sending message for
topic ATLAS_ENTITIES: {"version":{"version":"1.0.0"},"message":{"entity":{"jsonClass":"org.apache.atlas.typesystem.json.InstanceSerialization$_Reference","id":{"jsonClass":"org.apache.atlas.typesystem.json.InstanceSerialization$_Id","id":"5b02ca08-2938-4ff5-aacd-bd4d692addad","version":0,"typeName":"hive_column","state":"ACTIVE"},"typeName":"hive_column","values":{"name":"name","qualifiedName":"default.tablek8urmyl5gq.name@primary","position":1,"owner":"jenkins","type":"string","table":{"jsonClass":"org.apache.atlas.typesystem.json.InstanceSerialization$_Id","id":"6d0adea5-ec43-4ca8-a3ac-4780eee1fe69","version":0,"typeName":"hive_table","state":"ACTIVE"}},"traitNames":[],"traits":{},"systemAttributes":{}},"operationType":"ENTITY_CREATE","traits":[]}}
(KafkaNotification:218)
2017-09-14 03:02:07,659 DEBUG - [NotificationHookConsumer thread-0:] ~ Sending message for
topic ATLAS_ENTITIES: {"version":{"version":"1.0.0"},"message":{"entity":{"jsonClass":"org.apache.atlas.typesystem.json.InstanceSerialization$_Reference","id":{"jsonClass":"org.apache.atlas.typesystem.json.InstanceSerialization$_Id","id":"b04ab767-b504-4d22-8097-1304a05073d1","version":0,"typeName":"hive_storagedesc","state":"ACTIVE"},"typeName":"hive_storagedesc","values":{"location":"<https://builds.apache.org/job/Atlas-0.8-IntegrationTests/ws/target/metastore/tablek8urmyl5gq","serdeInfo">:{"jsonClass":"org.apache.atlas.typesystem.json.InstanceSerialization$_Struct","typeName":"hive_serde","values":{"serializationLib":"org.apache.hadoop.hive.serde2.lazy.LazySimpleSerDe","parameters":{"serialization.format":"1"}}},"qualifiedName":"default.tablek8urmyl5gq@primary_storage","outputFormat":"org.apache.hadoop.hive.ql.io.HiveIgnoreKeyTextOutputFormat","compressed":false,"numBuckets":-1,"inputFormat":"org.apache.hadoop.mapred.TextInputFormat","storedAsSubDirectories":false,"table":{"jsonClass":"org.apache.atlas.typesystem.json.InstanceSerialization$_Id","id":"6d0adea5-ec43-4ca8-a3ac-4780eee1fe69","version":0,"typeName":"hive_table","state":"ACTIVE"}},"traitNames":[],"traits":{},"systemAttributes":{}},"operationType":"ENTITY_CREATE","traits":[]}}
(KafkaNotification:218)
2017-09-14 03:02:07,660 DEBUG - [NotificationHookConsumer thread-0:] ~ Sending message for
topic ATLAS_ENTITIES: {"version":{"version":"1.0.0"},"message":{"entity":{"jsonClass":"org.apache.atlas.typesystem.json.InstanceSerialization$_Reference","id":{"jsonClass":"org.apache.atlas.typesystem.json.InstanceSerialization$_Id","id":"b62d2fa8-1f41-4cca-849a-cbd9af7c70a9","version":0,"typeName":"hive_table","state":"ACTIVE"},"typeName":"hive_table","values":{"tableType":"VIRTUAL_VIEW","name":"tablevxoi1vojch","viewExpandedText":"select
`tablek8urmyl5gq`.`id`, `tablek8urmyl5gq`.`name` from `default`.`tablek8URMYl5gq`","createTime":"2017-09-14T02:59:51.000Z","temporary":false,"db":{"jsonClass":"org.apache.atlas.typesystem.json.InstanceSerialization$_Id","id":"fae63d45-bece-4340-8584-feb154624851","version":0,"typeName":"hive_db","state":"ACTIVE"},"viewOriginalText":"select
* from tablek8URMYl5gq","retention":0,"qualifiedName":"default.tablevxoi1vojch@primary","columns":[{"jsonClass":"org.apache.atlas.typesystem.json.InstanceSerialization$_Reference","id":{"jsonClass":"org.apache.atlas.typesystem.json.InstanceSerialization$_Id","id":"b05deb7f-cdae-49e2-adae-703ee36f542b","version":0,"typeName":"hive_column","state":"ACTIVE"},"typeName":"hive_column","values":{"name":"id","qualifiedName":"default.tablevxoi1vojch.id@primary","position":0,"owner":"jenkins","type":"int","table":{"jsonClass":"org.apache.atlas.typesystem.json.InstanceSerialization$_Id","id":"b62d2fa8-1f41-4cca-849a-cbd9af7c70a9","version":0,"typeName":"hive_table","state":"ACTIVE"}},"traitNames":[],"traits":{},"systemAttributes":{"createdBy":"jenkins","modifiedBy":"jenkins","createdTime":"2017-09-14T03:02:07.269Z","modifiedTime":"2017-09-14T03:02:07.269Z"}},{"jsonClass":"org.apache.atlas.typesystem.json.InstanceSerialization$_Reference","id":{"jsonClass":"org.apache.atlas.typesystem.json.InstanceSerialization$_Id","id":"72e98080-8471-4f0b-a280-a8fb6b635744","version":0,"typeName":"hive_column","state":"ACTIVE"},"typeName":"hive_column","values":{"name":"name","qualifiedName":"default.tablevxoi1vojch.name@primary","position":1,"owner":"jenkins","type":"string","table":{"jsonClass":"org.apache.atlas.typesystem.json.InstanceSerialization$_Id","id":"b62d2fa8-1f41-4cca-849a-cbd9af7c70a9","version":0,"typeName":"hive_table","state":"ACTIVE"}},"traitNames":[],"traits":{},"systemAttributes":{"createdBy":"jenkins","modifiedBy":"jenkins","createdTime":"2017-09-14T03:02:07.269Z","modifiedTime":"2017-09-14T03:02:07.269Z"}}],"lastAccessTime":"2017-09-14T02:59:51.000Z","owner":"jenkins","sd":{"jsonClass":"org.apache.atlas.typesystem.json.InstanceSerialization$_Reference","id":{"jsonClass":"org.apache.atlas.typesystem.json.InstanceSerialization$_Id","id":"a9b2a5df-a6c8-48bb-9086-091913393b8c","version":0,"typeName":"hive_storagedesc","state":"ACTIVE"},"typeName":"hive_storagedesc","values":{"serdeInfo":{"jsonClass":"org.apache.atlas.typesystem.json.InstanceSerialization$_Struct","typeName":"hive_serde","values":{}},"qualifiedName":"default.tablevxoi1vojch@primary_storage","outputFormat":"org.apache.hadoop.hive.ql.io.HiveSequenceFileOutputFormat","compressed":false,"numBuckets":-1,"inputFormat":"org.apache.hadoop.mapred.SequenceFileInputFormat","storedAsSubDirectories":false,"table":{"jsonClass":"org.apache.atlas.typesystem.json.InstanceSerialization$_Id","id":"b62d2fa8-1f41-4cca-849a-cbd9af7c70a9","version":0,"typeName":"hive_table","state":"ACTIVE"}},"traitNames":[],"traits":{},"systemAttributes":{"createdBy":"jenkins","modifiedBy":"jenkins","createdTime":"2017-09-14T03:02:07.269Z","modifiedTime":"2017-09-14T03:02:07.269Z"}},"parameters":{"transient_lastDdlTime":"1505357991"}},"traitNames":[],"traits":{},"systemAttributes":{}},"operationType":"ENTITY_CREATE","traits":[]}}
(KafkaNotification:218)
2017-09-14 03:02:07,660 DEBUG - [NotificationHookConsumer thread-0:] ~ Sending message for
topic ATLAS_ENTITIES: {"version":{"version":"1.0.0"},"message":{"entity":{"jsonClass":"org.apache.atlas.typesystem.json.InstanceSerialization$_Reference","id":{"jsonClass":"org.apache.atlas.typesystem.json.InstanceSerialization$_Id","id":"b05deb7f-cdae-49e2-adae-703ee36f542b","version":0,"typeName":"hive_column","state":"ACTIVE"},"typeName":"hive_column","values":{"name":"id","qualifiedName":"default.tablevxoi1vojch.id@primary","position":0,"owner":"jenkins","type":"int","table":{"jsonClass":"org.apache.atlas.typesystem.json.InstanceSerialization$_Id","id":"b62d2fa8-1f41-4cca-849a-cbd9af7c70a9","version":0,"typeName":"hive_table","state":"ACTIVE"}},"traitNames":[],"traits":{},"systemAttributes":{}},"operationType":"ENTITY_CREATE","traits":[]}}
(KafkaNotification:218)
2017-09-14 03:02:07,660 DEBUG - [NotificationHookConsumer thread-0:] ~ Sending message for
topic ATLAS_ENTITIES: {"version":{"version":"1.0.0"},"message":{"entity":{"jsonClass":"org.apache.atlas.typesystem.json.InstanceSerialization$_Reference","id":{"jsonClass":"org.apache.atlas.typesystem.json.InstanceSerialization$_Id","id":"72e98080-8471-4f0b-a280-a8fb6b635744","version":0,"typeName":"hive_column","state":"ACTIVE"},"typeName":"hive_column","values":{"name":"name","qualifiedName":"default.tablevxoi1vojch.name@primary","position":1,"owner":"jenkins","type":"string","table":{"jsonClass":"org.apache.atlas.typesystem.json.InstanceSerialization$_Id","id":"b62d2fa8-1f41-4cca-849a-cbd9af7c70a9","version":0,"typeName":"hive_table","state":"ACTIVE"}},"traitNames":[],"traits":{},"systemAttributes":{}},"operationType":"ENTITY_CREATE","traits":[]}}
(KafkaNotification:218)
2017-09-14 03:02:07,661 DEBUG - [NotificationHookConsumer thread-0:] ~ Sending message for
topic ATLAS_ENTITIES: {"version":{"version":"1.0.0"},"message":{"entity":{"jsonClass":"org.apache.atlas.typesystem.json.InstanceSerialization$_Reference","id":{"jsonClass":"org.apache.atlas.typesystem.json.InstanceSerialization$_Id","id":"a9b2a5df-a6c8-48bb-9086-091913393b8c","version":0,"typeName":"hive_storagedesc","state":"ACTIVE"},"typeName":"hive_storagedesc","values":{"serdeInfo":{"jsonClass":"org.apache.atlas.typesystem.json.InstanceSerialization$_Struct","typeName":"hive_serde","values":{}},"qualifiedName":"default.tablevxoi1vojch@primary_storage","outputFormat":"org.apache.hadoop.hive.ql.io.HiveSequenceFileOutputFormat","compressed":false,"numBuckets":-1,"inputFormat":"org.apache.hadoop.mapred.SequenceFileInputFormat","storedAsSubDirectories":false,"table":{"jsonClass":"org.apache.atlas.typesystem.json.InstanceSerialization$_Id","id":"b62d2fa8-1f41-4cca-849a-cbd9af7c70a9","version":0,"typeName":"hive_table","state":"ACTIVE"}},"traitNames":[],"traits":{},"systemAttributes":{}},"operationType":"ENTITY_CREATE","traits":[]}}
(KafkaNotification:218)
2017-09-14 03:02:07,661 DEBUG - [NotificationHookConsumer thread-0:] ~ Sending message for
topic ATLAS_ENTITIES: {"version":{"version":"1.0.0"},"message":{"entity":{"jsonClass":"org.apache.atlas.typesystem.json.InstanceSerialization$_Reference","id":{"jsonClass":"org.apache.atlas.typesystem.json.InstanceSerialization$_Id","id":"3e092a28-c51d-4d34-a9e6-04a5f3bf3f14","version":0,"typeName":"hive_process","state":"ACTIVE"},"typeName":"hive_process","values":{"queryId":"jenkins_20170914025951_aeb57f5c-8222-402f-b1d4-39b075874ebc","name":"create
view tablevxoi1vojch as select * from tablek8urmyl5gq","startTime":"2017-09-14T02:59:51.294Z","queryPlan":"Not
Supported","operationType":"CREATEVIEW","outputs":[{"jsonClass":"org.apache.atlas.typesystem.json.InstanceSerialization$_Id","id":"b62d2fa8-1f41-4cca-849a-cbd9af7c70a9","version":0,"typeName":"DataSet","state":"ACTIVE"}],"endTime":"2017-09-14T02:59:51.522Z","recentQueries":["create
view tablevxoi1vojch as select * from tablek8urmyl5gq"],"inputs":[{"jsonClass":"org.apache.atlas.typesystem.json.InstanceSerialization$_Id","id":"6d0adea5-ec43-4ca8-a3ac-4780eee1fe69","version":0,"typeName":"DataSet","state":"ACTIVE"}],"qualifiedName":"default.tablevxoi1vojch@primary:1505357991000","queryText":"create
view tablevxoi1vojch as select * from tablek8urmyl5gq","clusterName":"primary","userName":"jenkins"},"traitNames":[],"traits":{},"systemAttributes":{}},"operationType":"ENTITY_CREATE","traits":[]}}
(KafkaNotification:218)
2017-09-14 03:02:08,534 INFO  - [ShutdownMonitor:] ~ Stopping service org.apache.atlas.notification.NotificationHookConsumer
(Services:65)
2017-09-14 03:02:08,534 INFO  - [ShutdownMonitor:] ~ ==> stopConsumerThreads() (NotificationHookConsumer:181)
2017-09-14 03:02:08,534 INFO  - [ShutdownMonitor:] ~ ==> HookConsumer shutdown() (NotificationHookConsumer$HookConsumer:485)
2017-09-14 03:02:08,534 INFO  - [ShutdownMonitor:] ~ [atlas-hook-consumer-thread], Shutting
down (Logging$class:68)
2017-09-14 03:02:08,891 DEBUG - [main-SendThread(localhost:19026):] ~ ==> InMemoryJAASConfiguration.getAppConfigurationEntry(Client)
(InMemoryJAASConfiguration:208)
2017-09-14 03:02:08,892 DEBUG - [main-SendThread(localhost:19026):] ~ <== InMemoryJAASConfiguration.getAppConfigurationEntry(Client):
{} (InMemoryJAASConfiguration:238)
2017-09-14 03:02:08,892 WARN  - [main-SendThread(localhost:19026):] ~ Session 0x15e7e5274a00001
for server null, unexpected error, closing socket connection and attempting reconnect (ClientCnxn$SendThread:1102)
java.net.ConnectException: Connection refused
	at sun.nio.ch.SocketChannelImpl.checkConnect(Native Method)
	at sun.nio.ch.SocketChannelImpl.finishConnect(SocketChannelImpl.java:744)
	at org.apache.zookeeper.ClientCnxnSocketNIO.doTransport(ClientCnxnSocketNIO.java:361)
	at org.apache.zookeeper.ClientCnxn$SendThread.run(ClientCnxn.java:1081)
2017-09-14 03:02:09,168 DEBUG - [Curator-Framework-0-SendThread(localhost:19026):] ~ ==>
InMemoryJAASConfiguration.getAppConfigurationEntry(Client) (InMemoryJAASConfiguration:208)
2017-09-14 03:02:09,169 DEBUG - [Curator-Framework-0-SendThread(localhost:19026):] ~ <==
InMemoryJAASConfiguration.getAppConfigurationEntry(Client): {} (InMemoryJAASConfiguration:238)
2017-09-14 03:02:10,482 DEBUG - [main-SendThread(localhost:19026):] ~ ==> InMemoryJAASConfiguration.getAppConfigurationEntry(Client)
(InMemoryJAASConfiguration:208)
2017-09-14 03:02:10,483 DEBUG - [main-SendThread(localhost:19026):] ~ <== InMemoryJAASConfiguration.getAppConfigurationEntry(Client):
{} (InMemoryJAASConfiguration:238)
2017-09-14 03:02:10,484 WARN  - [main-SendThread(localhost:19026):] ~ Session 0x15e7e5274a00001
for server null, unexpected error, closing socket connection and attempting reconnect (ClientCnxn$SendThread:1102)
java.net.ConnectException: Connection refused
	at sun.nio.ch.SocketChannelImpl.checkConnect(Native Method)
	at sun.nio.ch.SocketChannelImpl.finishConnect(SocketChannelImpl.java:744)
	at org.apache.zookeeper.ClientCnxnSocketNIO.doTransport(ClientCnxnSocketNIO.java:361)
	at org.apache.zookeeper.ClientCnxn$SendThread.run(ClientCnxn.java:1081)
2017-09-14 03:02:10,613 DEBUG - [Curator-Framework-0-SendThread(localhost:19026):] ~ ==>
InMemoryJAASConfiguration.getAppConfigurationEntry(Client) (InMemoryJAASConfiguration:208)
2017-09-14 03:02:10,614 DEBUG - [Curator-Framework-0-SendThread(localhost:19026):] ~ <==
InMemoryJAASConfiguration.getAppConfigurationEntry(Client): {} (InMemoryJAASConfiguration:238)
2017-09-14 03:02:10,719 DEBUG - [main-SendThread(localhost:19026):] ~ ==> InMemoryJAASConfiguration.getAppConfigurationEntry(Client)
(InMemoryJAASConfiguration:208)
2017-09-14 03:02:10,720 DEBUG - [main-SendThread(localhost:19026):] ~ <== InMemoryJAASConfiguration.getAppConfigurationEntry(Client):
{} (InMemoryJAASConfiguration:238)
2017-09-14 03:02:10,720 WARN  - [main-SendThread(localhost:19026):] ~ Session 0x15e7e5274a00001
for server null, unexpected error, closing socket connection and attempting reconnect (ClientCnxn$SendThread:1102)
java.net.ConnectException: Connection refused
	at sun.nio.ch.SocketChannelImpl.checkConnect(Native Method)
	at sun.nio.ch.SocketChannelImpl.finishConnect(SocketChannelImpl.java:744)
	at org.apache.zookeeper.ClientCnxnSocketNIO.doTransport(ClientCnxnSocketNIO.java:361)
	at org.apache.zookeeper.ClientCnxn$SendThread.run(ClientCnxn.java:1081)
2017-09-14 03:02:11,028 DEBUG - [Curator-Framework-0-SendThread(localhost:19026):] ~ ==>
InMemoryJAASConfiguration.getAppConfigurationEntry(Client) (InMemoryJAASConfiguration:208)
2017-09-14 03:02:11,029 DEBUG - [Curator-Framework-0-SendThread(localhost:19026):] ~ <==
InMemoryJAASConfiguration.getAppConfigurationEntry(Client): {} (InMemoryJAASConfiguration:238)
2017-09-14 03:02:12,473 DEBUG - [Curator-Framework-0-SendThread(localhost:19026):] ~ ==>
InMemoryJAASConfiguration.getAppConfigurationEntry(Client) (InMemoryJAASConfiguration:208)
2017-09-14 03:02:12,473 DEBUG - [Curator-Framework-0-SendThread(localhost:19026):] ~ <==
InMemoryJAASConfiguration.getAppConfigurationEntry(Client): {} (InMemoryJAASConfiguration:238)
2017-09-14 03:02:12,631 DEBUG - [main-SendThread(localhost:19026):] ~ ==> InMemoryJAASConfiguration.getAppConfigurationEntry(Client)
(InMemoryJAASConfiguration:208)
2017-09-14 03:02:12,631 DEBUG - [main-SendThread(localhost:19026):] ~ <== InMemoryJAASConfiguration.getAppConfigurationEntry(Client):
{} (InMemoryJAASConfiguration:238)
2017-09-14 03:02:12,632 WARN  - [main-SendThread(localhost:19026):] ~ Session 0x15e7e5274a00001
for server null, unexpected error, closing socket connection and attempting reconnect (ClientCnxn$SendThread:1102)
java.net.ConnectException: Connection refused
	at sun.nio.ch.SocketChannelImpl.checkConnect(Native Method)
	at sun.nio.ch.SocketChannelImpl.finishConnect(SocketChannelImpl.java:744)
	at org.apache.zookeeper.ClientCnxnSocketNIO.doTransport(ClientCnxnSocketNIO.java:361)
	at org.apache.zookeeper.ClientCnxn$SendThread.run(ClientCnxn.java:1081)
2017-09-14 03:02:13,452 DEBUG - [Curator-Framework-0-SendThread(localhost:19026):] ~ ==>
InMemoryJAASConfiguration.getAppConfigurationEntry(Client) (InMemoryJAASConfiguration:208)
2017-09-14 03:02:13,452 DEBUG - [Curator-Framework-0-SendThread(localhost:19026):] ~ <==
InMemoryJAASConfiguration.getAppConfigurationEntry(Client): {} (InMemoryJAASConfiguration:238)
2017-09-14 03:02:13,467 DEBUG - [main-SendThread(localhost:19026):] ~ ==> InMemoryJAASConfiguration.getAppConfigurationEntry(Client)
(InMemoryJAASConfiguration:208)
2017-09-14 03:02:13,468 DEBUG - [main-SendThread(localhost:19026):] ~ <== InMemoryJAASConfiguration.getAppConfigurationEntry(Client):
{} (InMemoryJAASConfiguration:238)
2017-09-14 03:02:13,468 WARN  - [main-SendThread(localhost:19026):] ~ Session 0x15e7e5274a00001
for server null, unexpected error, closing socket connection and attempting reconnect (ClientCnxn$SendThread:1102)
java.net.ConnectException: Connection refused
	at sun.nio.ch.SocketChannelImpl.checkConnect(Native Method)
	at sun.nio.ch.SocketChannelImpl.finishConnect(SocketChannelImpl.java:744)
	at org.apache.zookeeper.ClientCnxnSocketNIO.doTransport(ClientCnxnSocketNIO.java:361)
	at org.apache.zookeeper.ClientCnxn$SendThread.run(ClientCnxn.java:1081)
2017-09-14 03:02:15,203 DEBUG - [main-SendThread(localhost:19026):] ~ ==> InMemoryJAASConfiguration.getAppConfigurationEntry(Client)
(InMemoryJAASConfiguration:208)
2017-09-14 03:02:15,203 DEBUG - [main-SendThread(localhost:19026):] ~ <== InMemoryJAASConfiguration.getAppConfigurationEntry(Client):
{} (InMemoryJAASConfiguration:238)
2017-09-14 03:02:15,204 WARN  - [main-SendThread(localhost:19026):] ~ Session 0x15e7e5274a00001
for server null, unexpected error, closing socket connection and attempting reconnect (ClientCnxn$SendThread:1102)
java.net.ConnectException: Connection refused
	at sun.nio.ch.SocketChannelImpl.checkConnect(Native Method)
	at sun.nio.ch.SocketChannelImpl.finishConnect(SocketChannelImpl.java:744)
	at org.apache.zookeeper.ClientCnxnSocketNIO.doTransport(ClientCnxnSocketNIO.java:361)
	at org.apache.zookeeper.ClientCnxn$SendThread.run(ClientCnxn.java:1081)
2017-09-14 03:02:15,305 DEBUG - [Curator-Framework-0-SendThread(localhost:19026):] ~ ==>
InMemoryJAASConfiguration.getAppConfigurationEntry(Client) (InMemoryJAASConfiguration:208)
2017-09-14 03:02:15,305 DEBUG - [Curator-Framework-0-SendThread(localhost:19026):] ~ <==
InMemoryJAASConfiguration.getAppConfigurationEntry(Client): {} (InMemoryJAASConfiguration:238)
2017-09-14 03:02:15,668 DEBUG - [main-SendThread(localhost:19026):] ~ ==> InMemoryJAASConfiguration.getAppConfigurationEntry(Client)
(InMemoryJAASConfiguration:208)
2017-09-14 03:02:15,668 DEBUG - [main-SendThread(localhost:19026):] ~ <== InMemoryJAASConfiguration.getAppConfigurationEntry(Client):
{} (InMemoryJAASConfiguration:238)
2017-09-14 03:02:15,668 WARN  - [main-SendThread(localhost:19026):] ~ Session 0x15e7e5274a00001
for server null, unexpected error, closing socket connection and attempting reconnect (ClientCnxn$SendThread:1102)
java.net.ConnectException: Connection refused
	at sun.nio.ch.SocketChannelImpl.checkConnect(Native Method)
	at sun.nio.ch.SocketChannelImpl.finishConnect(SocketChannelImpl.java:744)
	at org.apache.zookeeper.ClientCnxnSocketNIO.doTransport(ClientCnxnSocketNIO.java:361)
	at org.apache.zookeeper.ClientCnxn$SendThread.run(ClientCnxn.java:1081)
2017-09-14 03:02:15,708 DEBUG - [Curator-Framework-0-SendThread(localhost:19026):] ~ ==>
InMemoryJAASConfiguration.getAppConfigurationEntry(Client) (InMemoryJAASConfiguration:208)
2017-09-14 03:02:15,709 DEBUG - [Curator-Framework-0-SendThread(localhost:19026):] ~ <==
InMemoryJAASConfiguration.getAppConfigurationEntry(Client): {} (InMemoryJAASConfiguration:238)
[ERROR] 
java.net.SocketTimeoutException: Read timed out
	at java.net.SocketInputStream.socketRead0(Native Method)
	at java.net.SocketInputStream.read(SocketInputStream.java:152)
	at java.net.SocketInputStream.read(SocketInputStream.java:122)
	at sun.nio.cs.StreamDecoder.readBytes(StreamDecoder.java:283)
	at sun.nio.cs.StreamDecoder.implRead(StreamDecoder.java:325)
	at sun.nio.cs.StreamDecoder.read(StreamDecoder.java:177)
	at java.io.InputStreamReader.read(InputStreamReader.java:184)
	at java.io.BufferedReader.fill(BufferedReader.java:154)
	at java.io.BufferedReader.readLine(BufferedReader.java:317)
	at java.io.LineNumberReader.readLine(LineNumberReader.java:199)
	at org.eclipse.jetty.maven.plugin.JettyStopMojo.execute(JettyStopMojo.java:100)
	at org.apache.maven.plugin.DefaultBuildPluginManager.executeMojo(DefaultBuildPluginManager.java:134)
	at org.apache.maven.lifecycle.internal.MojoExecutor.execute(MojoExecutor.java:208)
	at org.apache.maven.lifecycle.internal.MojoExecutor.execute(MojoExecutor.java:154)
	at org.apache.maven.lifecycle.internal.MojoExecutor.execute(MojoExecutor.java:146)
	at org.apache.maven.lifecycle.internal.LifecycleModuleBuilder.buildProject(LifecycleModuleBuilder.java:117)
	at org.apache.maven.lifecycle.internal.LifecycleModuleBuilder.buildProject(LifecycleModuleBuilder.java:81)
	at org.apache.maven.lifecycle.internal.builder.singlethreaded.SingleThreadedBuilder.build(SingleThreadedBuilder.java:51)
	at org.apache.maven.lifecycle.internal.LifecycleStarter.execute(LifecycleStarter.java:128)
	at org.apache.maven.DefaultMaven.doExecute(DefaultMaven.java:309)
	at org.apache.maven.DefaultMaven.doExecute(DefaultMaven.java:194)
	at org.apache.maven.DefaultMaven.execute(DefaultMaven.java:107)
	at org.apache.maven.cli.MavenCli.execute(MavenCli.java:993)
	at org.apache.maven.cli.MavenCli.doMain(MavenCli.java:345)
	at org.apache.maven.cli.MavenCli.main(MavenCli.java:191)
	at sun.reflect.NativeMethodAccessorImpl.invoke0(Native Method)
	at sun.reflect.NativeMethodAccessorImpl.invoke(NativeMethodAccessorImpl.java:57)
	at sun.reflect.DelegatingMethodAccessorImpl.invoke(DelegatingMethodAccessorImpl.java:43)
	at java.lang.reflect.Method.invoke(Method.java:606)
	at org.codehaus.plexus.classworlds.launcher.Launcher.launchEnhanced(Launcher.java:289)
	at org.codehaus.plexus.classworlds.launcher.Launcher.launch(Launcher.java:229)
	at org.codehaus.plexus.classworlds.launcher.Launcher.mainWithExitCode(Launcher.java:415)
	at org.codehaus.plexus.classworlds.launcher.Launcher.main(Launcher.java:356)
[INFO] 
[INFO] --- maven-source-plugin:2.4:jar-no-fork (attach-sources) @ hive-bridge ---
[INFO] Building jar: <https://builds.apache.org/job/Atlas-0.8-IntegrationTests/ws/addons/hive-bridge/target/hive-bridge-0.8.2-SNAPSHOT-sources.jar>
[INFO] 
[INFO] --- maven-source-plugin:2.4:test-jar-no-fork (attach-sources) @ hive-bridge ---
[INFO] Building jar: <https://builds.apache.org/job/Atlas-0.8-IntegrationTests/ws/addons/hive-bridge/target/hive-bridge-0.8.2-SNAPSHOT-test-sources.jar>
[INFO] 
[INFO] --- maven-failsafe-plugin:2.19.1:verify (verify) @ hive-bridge ---
[INFO] ------------------------------------------------------------------------
[INFO] Reactor Summary:
[INFO] 
[INFO] Apache Atlas Server Build Tools .................... SUCCESS [  3.560 s]
[INFO] apache-atlas ....................................... SUCCESS [ 15.969 s]
[INFO] Apache Atlas Integration ........................... SUCCESS [ 43.106 s]
[INFO] Apache Atlas Common ................................ SUCCESS [ 24.746 s]
[INFO] Apache Atlas Typesystem ............................ SUCCESS [01:29 min]
[INFO] Apache Atlas Client ................................ SUCCESS [ 20.214 s]
[INFO] Apache Atlas Server API ............................ SUCCESS [ 11.448 s]
[INFO] Apache Atlas Notification .......................... SUCCESS [ 20.323 s]
[INFO] Apache Atlas Graph Database Projects ............... SUCCESS [  0.684 s]
[INFO] Apache Atlas Graph Database API .................... SUCCESS [  8.637 s]
[INFO] Graph Database Common Code ......................... SUCCESS [  9.143 s]
[INFO] Apache Atlas Titan 1.0.0 GraphDB Impl .............. SUCCESS [ 39.735 s]
[INFO] Shaded version of Apache hbase client .............. SUCCESS [ 11.400 s]
[INFO] Apache Atlas Titan 0.5.4 Graph DB Impl ............. SUCCESS [ 54.092 s]
[INFO] Apache Atlas Graph Database Implementation Dependencies SUCCESS [  1.186 s]
[INFO] Shaded version of Apache hbase server .............. SUCCESS [ 25.705 s]
[INFO] Apache Atlas Repository ............................ SUCCESS [01:59 min]
[INFO] Apache Atlas Authorization ......................... SUCCESS [ 12.510 s]
[INFO] Apache Atlas Business Catalog ...................... SUCCESS [ 15.987 s]
[INFO] Apache Atlas UI .................................... SUCCESS [01:38 min]
[INFO] Apache Atlas Web Application ....................... SUCCESS [04:46 min]
[INFO] Apache Atlas Documentation ......................... SUCCESS [  7.367 s]
[INFO] Apache Atlas FileSystem Model ...................... SUCCESS [  1.890 s]
[INFO] Apache Atlas Plugin Classloader .................... SUCCESS [  9.246 s]
[INFO] Apache Atlas Hive Bridge Shim ...................... SUCCESS [  9.622 s]
[INFO] Apache Atlas Hive Bridge ........................... FAILURE [05:11 min]
[INFO] Apache Atlas Falcon Bridge Shim .................... SKIPPED
[INFO] Apache Atlas Falcon Bridge ......................... SKIPPED
[INFO] Apache Atlas Sqoop Bridge Shim ..................... SKIPPED
[INFO] Apache Atlas Sqoop Bridge .......................... SKIPPED
[INFO] Apache Atlas Storm Bridge Shim ..................... SKIPPED
[INFO] Apache Atlas Storm Bridge .......................... SKIPPED
[INFO] Apache Atlas Distribution .......................... SKIPPED
[INFO] ------------------------------------------------------------------------
[INFO] BUILD FAILURE
[INFO] ------------------------------------------------------------------------
[INFO] Total time: 20:57 min
[INFO] Finished at: 2017-09-14T03:02:16Z
[INFO] Final Memory: 575M/2109M
[INFO] ------------------------------------------------------------------------
2017-09-14 03:02:18,696 DEBUG - [main-SendThread(localhost:19026):] ~ ==> InMemoryJAASConfiguration.getAppConfigurationEntry(Client)
(InMemoryJAASConfiguration:208)
2017-09-14 03:02:18,697 DEBUG - [main-SendThread(localhost:19026):] ~ <== InMemoryJAASConfiguration.getAppConfigurationEntry(Client):
{} (InMemoryJAASConfiguration:238)
2017-09-14 03:02:18,697 WARN  - [main-SendThread(localhost:19026):] ~ Session 0x15e7e5274a00001
for server null, unexpected error, closing socket connection and attempting reconnect (ClientCnxn$SendThread:1102)
java.net.ConnectException: Connection refused
	at sun.nio.ch.SocketChannelImpl.checkConnect(Native Method)
	at sun.nio.ch.SocketChannelImpl.finishConnect(SocketChannelImpl.java:744)
	at org.apache.zookeeper.ClientCnxnSocketNIO.doTransport(ClientCnxnSocketNIO.java:361)
	at org.apache.zookeeper.ClientCnxn$SendThread.run(ClientCnxn.java:1081)
[ERROR] Failed to execute goal org.apache.maven.plugins:maven-failsafe-plugin:2.19.1:verify
(verify) on project hive-bridge: There are test failures.
[ERROR] 
[ERROR] Please refer to <https://builds.apache.org/job/Atlas-0.8-IntegrationTests/ws/addons/hive-bridge/target/failsafe-reports>
for the individual test results.
[ERROR] -> [Help 1]
[ERROR] 
[ERROR] To see the full stack trace of the errors, re-run Maven with the -e switch.
[ERROR] Re-run Maven using the -X switch to enable full debug logging.
[ERROR] 
[ERROR] For more information about the errors and possible solutions, please read the following
articles:
[ERROR] [Help 1] http://cwiki.apache.org/confluence/display/MAVEN/MojoFailureException
[ERROR] 
[ERROR] After correcting the problems, you can resume the build with the command
[ERROR]   mvn <goals> -rf :hive-bridge
Build step 'Execute shell' marked build as failure
[CHECKSTYLE] Collecting checkstyle analysis files...
[CHECKSTYLE] Searching for all files in <https://builds.apache.org/job/Atlas-0.8-IntegrationTests/ws/>
that match the pattern **/target/checkstyle-result.xml
[CHECKSTYLE] Parsing 24 files in <https://builds.apache.org/job/Atlas-0.8-IntegrationTests/ws/>
[CHECKSTYLE] Successfully parsed file <https://builds.apache.org/job/Atlas-0.8-IntegrationTests/ws/addons/hdfs-model/target/checkstyle-result.xml>
with 0 unique warnings and 0 duplicates.
[CHECKSTYLE] Successfully parsed file <https://builds.apache.org/job/Atlas-0.8-IntegrationTests/ws/addons/hive-bridge-shim/target/checkstyle-result.xml>
with 15 unique warnings and 0 duplicates.
[CHECKSTYLE] Successfully parsed file <https://builds.apache.org/job/Atlas-0.8-IntegrationTests/ws/authorization/target/checkstyle-result.xml>
with 482 unique warnings and 0 duplicates.
[CHECKSTYLE] Successfully parsed file <https://builds.apache.org/job/Atlas-0.8-IntegrationTests/ws/catalog/target/checkstyle-result.xml>
with 2619 unique warnings and 0 duplicates.
[CHECKSTYLE] Successfully parsed file <https://builds.apache.org/job/Atlas-0.8-IntegrationTests/ws/client/target/checkstyle-result.xml>
with 4257 unique warnings and 0 duplicates.
[CHECKSTYLE] Successfully parsed file <https://builds.apache.org/job/Atlas-0.8-IntegrationTests/ws/common/target/checkstyle-result.xml>
with 5463 unique warnings and 0 duplicates.
[CHECKSTYLE] Successfully parsed file <https://builds.apache.org/job/Atlas-0.8-IntegrationTests/ws/dashboardv2/target/checkstyle-result.xml>
with 5463 unique warnings and 0 duplicates.
[CHECKSTYLE] Successfully parsed file <https://builds.apache.org/job/Atlas-0.8-IntegrationTests/ws/docs/target/checkstyle-result.xml>
with 5463 unique warnings and 0 duplicates.
[CHECKSTYLE] Successfully parsed file <https://builds.apache.org/job/Atlas-0.8-IntegrationTests/ws/graphdb/api/target/checkstyle-result.xml>
with 5732 unique warnings and 0 duplicates.
[CHECKSTYLE] Successfully parsed file <https://builds.apache.org/job/Atlas-0.8-IntegrationTests/ws/graphdb/common/target/checkstyle-result.xml>
with 5919 unique warnings and 0 duplicates.
[CHECKSTYLE] Successfully parsed file <https://builds.apache.org/job/Atlas-0.8-IntegrationTests/ws/graphdb/graphdb-impls/target/checkstyle-result.xml>
with 5919 unique warnings and 0 duplicates.
[CHECKSTYLE] Successfully parsed file <https://builds.apache.org/job/Atlas-0.8-IntegrationTests/ws/graphdb/target/checkstyle-result.xml>
with 5919 unique warnings and 0 duplicates.
[CHECKSTYLE] Successfully parsed file <https://builds.apache.org/job/Atlas-0.8-IntegrationTests/ws/graphdb/titan0/target/checkstyle-result.xml>
with 8304 unique warnings and 0 duplicates.
[CHECKSTYLE] Successfully parsed file <https://builds.apache.org/job/Atlas-0.8-IntegrationTests/ws/graphdb/titan1/target/checkstyle-result.xml>
with 9252 unique warnings and 0 duplicates.
[CHECKSTYLE] Successfully parsed file <https://builds.apache.org/job/Atlas-0.8-IntegrationTests/ws/intg/target/checkstyle-result.xml>
with 15567 unique warnings and 0 duplicates.
[CHECKSTYLE] Successfully parsed file <https://builds.apache.org/job/Atlas-0.8-IntegrationTests/ws/notification/target/checkstyle-result.xml>
with 16777 unique warnings and 0 duplicates.
[CHECKSTYLE] Successfully parsed file <https://builds.apache.org/job/Atlas-0.8-IntegrationTests/ws/plugin-classloader/target/checkstyle-result.xml>
with 16885 unique warnings and 0 duplicates.
[CHECKSTYLE] Successfully parsed file <https://builds.apache.org/job/Atlas-0.8-IntegrationTests/ws/repository/target/checkstyle-result.xml>
with 35311 unique warnings and 0 duplicates.
[CHECKSTYLE] Successfully parsed file <https://builds.apache.org/job/Atlas-0.8-IntegrationTests/ws/server-api/target/checkstyle-result.xml>
with 35690 unique warnings and 0 duplicates.
[CHECKSTYLE] Successfully parsed file <https://builds.apache.org/job/Atlas-0.8-IntegrationTests/ws/shaded/hbase-client-shaded/target/checkstyle-result.xml>
with 35690 unique warnings and 0 duplicates.
[CHECKSTYLE] Successfully parsed file <https://builds.apache.org/job/Atlas-0.8-IntegrationTests/ws/shaded/hbase-server-shaded/target/checkstyle-result.xml>
with 35690 unique warnings and 0 duplicates.
[CHECKSTYLE] Successfully parsed file <https://builds.apache.org/job/Atlas-0.8-IntegrationTests/ws/target/checkstyle-result.xml>
with 35690 unique warnings and 0 duplicates.
[CHECKSTYLE] Successfully parsed file <https://builds.apache.org/job/Atlas-0.8-IntegrationTests/ws/typesystem/target/checkstyle-result.xml>
with 39908 unique warnings and 0 duplicates.
[CHECKSTYLE] Successfully parsed file <https://builds.apache.org/job/Atlas-0.8-IntegrationTests/ws/webapp/target/checkstyle-result.xml>
with 48025 unique warnings and 0 duplicates.
<Git Blamer> Using GitBlamer to create author and commit information for all warnings.
<Git Blamer> GIT_COMMIT=4c7430ddf8865cb1163decf75d71735e991399ff, workspace=<https://builds.apache.org/job/Atlas-0.8-IntegrationTests/ws/>
 > git rev-parse 4c7430ddf8865cb1163decf75d71735e991399ff^{commit} # timeout=10
<Git Blamer> Skipping file <https://builds.apache.org/job/Atlas-0.8-IntegrationTests/ws/repository/src/main/java/org/apache/atlas/discovery/SearchIndexer.java,>
no result found.
[FINDBUGS] Collecting findbugs analysis files...
[FINDBUGS] Searching for all files in <https://builds.apache.org/job/Atlas-0.8-IntegrationTests/ws/>
that match the pattern **/target/findbugs.xml
[FINDBUGS] Parsing 15 files in <https://builds.apache.org/job/Atlas-0.8-IntegrationTests/ws/>
[FINDBUGS] Successfully parsed file <https://builds.apache.org/job/Atlas-0.8-IntegrationTests/ws/addons/hive-bridge-shim/target/findbugs.xml>
with 0 unique warnings and 0 duplicates.
[FINDBUGS] Successfully parsed file <https://builds.apache.org/job/Atlas-0.8-IntegrationTests/ws/authorization/target/findbugs.xml>
with 0 unique warnings and 0 duplicates.
[FINDBUGS] Successfully parsed file <https://builds.apache.org/job/Atlas-0.8-IntegrationTests/ws/catalog/target/findbugs.xml>
with 0 unique warnings and 0 duplicates.
[FINDBUGS] Successfully parsed file <https://builds.apache.org/job/Atlas-0.8-IntegrationTests/ws/client/target/findbugs.xml>
with 0 unique warnings and 0 duplicates.
[FINDBUGS] Successfully parsed file <https://builds.apache.org/job/Atlas-0.8-IntegrationTests/ws/common/target/findbugs.xml>
with 0 unique warnings and 0 duplicates.
[FINDBUGS] Successfully parsed file <https://builds.apache.org/job/Atlas-0.8-IntegrationTests/ws/graphdb/api/target/findbugs.xml>
with 0 unique warnings and 0 duplicates.
[FINDBUGS] Successfully parsed file <https://builds.apache.org/job/Atlas-0.8-IntegrationTests/ws/graphdb/common/target/findbugs.xml>
with 0 unique warnings and 0 duplicates.
[FINDBUGS] Successfully parsed file <https://builds.apache.org/job/Atlas-0.8-IntegrationTests/ws/graphdb/titan0/target/findbugs.xml>
with 0 unique warnings and 0 duplicates.
[FINDBUGS] Successfully parsed file <https://builds.apache.org/job/Atlas-0.8-IntegrationTests/ws/intg/target/findbugs.xml>
with 0 unique warnings and 0 duplicates.
[FINDBUGS] Successfully parsed file <https://builds.apache.org/job/Atlas-0.8-IntegrationTests/ws/notification/target/findbugs.xml>
with 0 unique warnings and 0 duplicates.
[FINDBUGS] Successfully parsed file <https://builds.apache.org/job/Atlas-0.8-IntegrationTests/ws/plugin-classloader/target/findbugs.xml>
with 0 unique warnings and 0 duplicates.
[FINDBUGS] Successfully parsed file <https://builds.apache.org/job/Atlas-0.8-IntegrationTests/ws/repository/target/findbugs.xml>
with 0 unique warnings and 0 duplicates.
[FINDBUGS] Successfully parsed file <https://builds.apache.org/job/Atlas-0.8-IntegrationTests/ws/server-api/target/findbugs.xml>
with 0 unique warnings and 0 duplicates.
[FINDBUGS] Successfully parsed file <https://builds.apache.org/job/Atlas-0.8-IntegrationTests/ws/typesystem/target/findbugs.xml>
with 0 unique warnings and 0 duplicates.
[FINDBUGS] Successfully parsed file <https://builds.apache.org/job/Atlas-0.8-IntegrationTests/ws/webapp/target/findbugs.xml>
with 0 unique warnings and 0 duplicates.
<Git Blamer> Using GitBlamer to create author and commit information for all warnings.
<Git Blamer> GIT_COMMIT=4c7430ddf8865cb1163decf75d71735e991399ff, workspace=<https://builds.apache.org/job/Atlas-0.8-IntegrationTests/ws/>
Archiving artifacts
[Fast Archiver] No prior successful build to compare, so performing full copy of artifacts
TestNG Reports Processing: START
Looking for TestNG results report in workspace using pattern: **/target/surefire-reports/testng-results.xml,**/target/failsafe-reports/testng-results.xml
Saving reports...
Processing '/x1/jenkins/jenkins-home/jobs/Atlas-0.8-IntegrationTests/builds/56/testng/testng-results-1.xml'
Processing '/x1/jenkins/jenkins-home/jobs/Atlas-0.8-IntegrationTests/builds/56/testng/testng-results.xml'
21.348314% of tests failed, which exceeded threshold of 0%. Marking build as UNSTABLE
TestNG Reports Processing: FINISH

Mime
View raw message