atlas-dev mailing list archives

Site index · List index
Message view « Date » · « Thread »
Top « Date » · « Thread »
From Apache Jenkins Server <jenk...@builds.apache.org>
Subject Build failed in Jenkins: Atlas-0.8-IntegrationTests #57
Date Thu, 14 Sep 2017 06:14:42 GMT
See <https://builds.apache.org/job/Atlas-0.8-IntegrationTests/57/display/redirect?page=changes>

Changes:

[madhan] ATLAS-2117: basic search updates to handle issue caused by tokenization

------------------------------------------
[...truncated 490.24 KB...]
127.0.0.1 - - [14/Sep/2017:06:09:57 +0000] "GET /api/atlas/entities/blah HTTP/1.1" 404 - "-"
"Java/1.7.0_80"
127.0.0.1 - - [14/Sep/2017:06:09:57 +0000] "POST /api/atlas/entities HTTP/1.1" 201 - "-" "Java/1.7.0_80"
127.0.0.1 - - [14/Sep/2017:06:09:57 +0000] "POST /api/atlas/entities HTTP/1.1" 201 - "-" "Java/1.7.0_80"
127.0.0.1 - - [14/Sep/2017:06:09:57 +0000] "GET /api/atlas/v2/types/typedef/name/PII_TraitOuBASQBQhW
HTTP/1.1" 404 - "-" "Java/1.7.0_80"
127.0.0.1 - - [14/Sep/2017:06:09:57 +0000] "POST /api/atlas/types HTTP/1.1" 201 - "-" "Java/1.7.0_80"
127.0.0.1 - - [14/Sep/2017:06:09:58 +0000] "POST /api/atlas/entities/76b6a9ae-5d8f-46ca-9d5f-f6e3c078d303/traits
HTTP/1.1" 201 - "-" "Java/1.7.0_80"
127.0.0.1 - - [14/Sep/2017:06:09:58 +0000] "GET /api/atlas/entities/76b6a9ae-5d8f-46ca-9d5f-f6e3c078d303/traitDefinitions/PII_TraitOuBASQBQhW
HTTP/1.1" 200 - "-" "Java/1.7.0_80"
127.0.0.1 - - [14/Sep/2017:06:09:58 +0000] "GET /api/atlas/entities/76b6a9ae-5d8f-46ca-9d5f-f6e3c078d303/traitDefinitions
HTTP/1.1" 200 - "-" "Java/1.7.0_80"
127.0.0.1 - - [14/Sep/2017:06:09:58 +0000] "POST /api/atlas/entities HTTP/1.1" 201 - "-" "Java/1.7.0_80"
127.0.0.1 - - [14/Sep/2017:06:09:58 +0000] "POST /api/atlas/entities HTTP/1.1" 201 - "-" "Java/1.7.0_80"
127.0.0.1 - - [14/Sep/2017:06:09:58 +0000] "GET /api/atlas/entities/3257039d-5fa0-4af9-943a-0d76c60c1586/traits
HTTP/1.1" 200 - "-" "Java/1.7.0_80"
127.0.0.1 - - [14/Sep/2017:06:09:58 +0000] "POST /api/atlas/entities HTTP/1.1" 201 - "-" "Java/1.7.0_80"
127.0.0.1 - - [14/Sep/2017:06:09:58 +0000] "POST /api/atlas/entities HTTP/1.1" 201 - "-" "Java/1.7.0_80"
127.0.0.1 - - [14/Sep/2017:06:09:58 +0000] "POST /api/atlas/entities/b368a392-fc6d-4039-8a1a-4cd9ec0a2619
HTTP/1.1" 200 - "-" "Java/1.7.0_80"
127.0.0.1 - - [14/Sep/2017:06:09:58 +0000] "GET /api/atlas/entities/b368a392-fc6d-4039-8a1a-4cd9ec0a2619
HTTP/1.1" 200 - "-" "Java/1.7.0_80"
127.0.0.1 - - [14/Sep/2017:06:09:58 +0000] "POST /api/atlas/entities HTTP/1.1" 201 - "-" "Java/1.7.0_80"
127.0.0.1 - - [14/Sep/2017:06:09:58 +0000] "POST /api/atlas/entities HTTP/1.1" 201 - "-" "Java/1.7.0_80"
127.0.0.1 - - [14/Sep/2017:06:09:59 +0000] "POST /api/atlas/entities/qualifiedName?type=hive_table&property=qualifiedName&value=tablegl8PU0dR5t
HTTP/1.1" 200 - "-" "Java/1.7.0_80"
127.0.0.1 - - [14/Sep/2017:06:09:59 +0000] "GET /api/atlas/entities/3bcb8370-5d4e-49e2-9b9b-3c9911fcd812
HTTP/1.1" 200 - "-" "Java/1.7.0_80"
127.0.0.1 - - [14/Sep/2017:06:09:59 +0000] "POST /api/atlas/entities HTTP/1.1" 201 - "-" "Java/1.7.0_80"
127.0.0.1 - - [14/Sep/2017:06:09:59 +0000] "GET /api/atlas/entities/a81f8818-2ac1-40ac-ae6f-c1c777a29ddd/audit?count=10
HTTP/1.1" 200 - "-" "Java/1.7.0_80"
127.0.0.1 - - [14/Sep/2017:06:09:59 +0000] "POST /api/atlas/entities HTTP/1.1" 201 - "-" "Java/1.7.0_80"
127.0.0.1 - - [14/Sep/2017:06:09:59 +0000] "POST /api/atlas/entities HTTP/1.1" 201 - "-" "Java/1.7.0_80"
127.0.0.1 - - [14/Sep/2017:06:09:59 +0000] "POST /api/atlas/entities HTTP/1.1" 201 - "-" "Java/1.7.0_80"
127.0.0.1 - - [14/Sep/2017:06:09:59 +0000] "POST /api/atlas/entities HTTP/1.1" 400 - "-" "Java/1.7.0_80"
127.0.0.1 - - [14/Sep/2017:06:09:59 +0000] "POST /api/atlas/entities HTTP/1.1" 201 - "-" "Java/1.7.0_80"
127.0.0.1 - - [14/Sep/2017:06:10:00 +0000] "GET /api/atlas/v2/types/typedef/name/pnh2YVmA5N
HTTP/1.1" 404 - "-" "Java/1.7.0_80"
127.0.0.1 - - [14/Sep/2017:06:10:00 +0000] "POST /api/atlas/types HTTP/1.1" 201 - "-" "Java/1.7.0_80"
127.0.0.1 - - [14/Sep/2017:06:10:00 +0000] "POST /api/atlas/entities HTTP/1.1" 201 - "-" "Java/1.7.0_80"
127.0.0.1 - - [14/Sep/2017:06:10:00 +0000] "GET /api/atlas/entities/971b1979-8d46-4211-98f3-b2ec541bd871
HTTP/1.1" 200 - "-" "Java/1.7.0_80"
127.0.0.1 - - [14/Sep/2017:06:10:00 +0000] "GET /api/atlas/v2/entity/guid/1b2da17e-f1a1-4705-b809-ab3f5f7e1aa8
HTTP/1.1" 200 - "-" "Java/1.7.0_80"
127.0.0.1 - - [14/Sep/2017:06:10:00 +0000] "POST /api/atlas/v2/entity/ HTTP/1.1" 200 - "-"
"Java/1.7.0_80"
127.0.0.1 - - [14/Sep/2017:06:10:00 +0000] "POST /api/atlas/v2/entity/guid/random/classifications
HTTP/1.1" 404 - "-" "Java/1.7.0_80"
127.0.0.1 - - [14/Sep/2017:06:10:00 +0000] "POST /api/atlas/v2/entity/bulk/ HTTP/1.1" 200
- "-" "Java/1.7.0_80"
127.0.0.1 - - [14/Sep/2017:06:10:01 +0000] "POST /api/atlas/v2/entity/ HTTP/1.1" 200 - "-"
"Java/1.7.0_80"
127.0.0.1 - - [14/Sep/2017:06:10:01 +0000] "POST /api/atlas/v2/entity/ HTTP/1.1" 200 - "-"
"Java/1.7.0_80"
127.0.0.1 - - [14/Sep/2017:06:10:01 +0000] "DELETE /api/atlas/v2/entity/bulk/?guid=b4a4765a-6398-4eaa-af09-4516687a0aef&guid=138ff9bb-6e6e-4866-a5e6-ed88f7a75431
HTTP/1.1" 200 - "-" "Java/1.7.0_80"
127.0.0.1 - - [14/Sep/2017:06:10:01 +0000] "POST /api/atlas/v2/entity/ HTTP/1.1" 200 - "-"
"Java/1.7.0_80"
127.0.0.1 - - [14/Sep/2017:06:10:01 +0000] "DELETE /api/atlas/v2/entity/uniqueAttribute/type/hive_db_v2?attr:name=dbwZvIxLI41g%ED%96%AC%E9%BC%B1%D2%A1%E1%AA%A9%EE%9D%92%E7%8D%83%EC%AE%8A%E7%95%B2%EE%A3%81%EE%95%A3
HTTP/1.1" 200 - "-" "Java/1.7.0_80"
127.0.0.1 - - [14/Sep/2017:06:10:01 +0000] "DELETE /api/atlas/v2/entity/guid/random/classification/blah_trait
HTTP/1.1" 400 - "-" "Java/1.7.0_80"
127.0.0.1 - - [14/Sep/2017:06:10:01 +0000] "GET /api/atlas/discovery/search/dsl?query=hive_db_v2+where+name%3D'dbwZvIxLI41g'&limit=10&offset=0
HTTP/1.1" 200 - "-" "Java/1.7.0_80"
127.0.0.1 - - [14/Sep/2017:06:10:02 +0000] "GET /api/atlas/discovery/search/dsl?query=hive_db_v2+where+name%3D'dbwZvIxLI41g'&limit=10&offset=0
HTTP/1.1" 200 - "-" "Java/1.7.0_80"
127.0.0.1 - - [14/Sep/2017:06:10:03 +0000] "POST /api/atlas/v2/entity/ HTTP/1.1" 200 - "-"
"Java/1.7.0_80"
127.0.0.1 - - [14/Sep/2017:06:10:03 +0000] "GET /api/atlas/discovery/search/dsl?query=hive_db_v2+where+name%3D'dbwZvIxLI41g'&limit=10&offset=0
HTTP/1.1" 200 - "-" "Java/1.7.0_80"
127.0.0.1 - - [14/Sep/2017:06:10:03 +0000] "POST /api/atlas/v2/types/typedefs/ HTTP/1.1" 200
- "-" "Java/1.7.0_80"
127.0.0.1 - - [14/Sep/2017:06:10:04 +0000] "POST /api/atlas/v2/entity/ HTTP/1.1" 200 - "-"
"Java/1.7.0_80"
127.0.0.1 - - [14/Sep/2017:06:10:04 +0000] "PUT /api/atlas/v2/types/typedefs/ HTTP/1.1" 200
- "-" "Java/1.7.0_80"
127.0.0.1 - - [14/Sep/2017:06:10:04 +0000] "GET /api/atlas/v2/entity/guid/8c75adc5-369a-42f4-961d-b4f5918ece76
HTTP/1.1" 200 - "-" "Java/1.7.0_80"
127.0.0.1 - - [14/Sep/2017:06:10:04 +0000] "POST /api/atlas/v2/entity/ HTTP/1.1" 404 - "-"
"Java/1.7.0_80"
127.0.0.1 - - [14/Sep/2017:06:10:04 +0000] "POST /api/atlas/v2/entity/ HTTP/1.1" 200 - "-"
"Java/1.7.0_80"
127.0.0.1 - - [14/Sep/2017:06:10:04 +0000] "POST /api/atlas/v2/entity/ HTTP/1.1" 200 - "-"
"Java/1.7.0_80"
127.0.0.1 - - [14/Sep/2017:06:10:04 +0000] "GET /api/atlas/v2/entity/uniqueAttribute/type/hive_db_v2?attr:name=dbwZvIxLI41g
HTTP/1.1" 200 - "-" "Java/1.7.0_80"
127.0.0.1 - - [14/Sep/2017:06:10:04 +0000] "GET /api/atlas/v2/entity/guid/blah HTTP/1.1" 404
- "-" "Java/1.7.0_80"
127.0.0.1 - - [14/Sep/2017:06:10:04 +0000] "POST /api/atlas/v2/entity/ HTTP/1.1" 200 - "-"
"Java/1.7.0_80"
127.0.0.1 - - [14/Sep/2017:06:10:05 +0000] "GET /api/atlas/entities/3a4863a0-61cc-48ae-bb91-4421cf128808/audit?count=10
HTTP/1.1" 200 - "-" "Java/1.7.0_80"
127.0.0.1 - - [14/Sep/2017:06:10:05 +0000] "POST /api/atlas/v2/entity/ HTTP/1.1" 200 - "-"
"Java/1.7.0_80"
127.0.0.1 - - [14/Sep/2017:06:10:05 +0000] "POST /api/atlas/v2/entity/ HTTP/1.1" 200 - "-"
"Java/1.7.0_80"
127.0.0.1 - - [14/Sep/2017:06:10:05 +0000] "GET /api/atlas/v2/types/typedef/name/lIXF1wJ62j
HTTP/1.1" 404 - "-" "Java/1.7.0_80"
127.0.0.1 - - [14/Sep/2017:06:10:05 +0000] "POST /api/atlas/v2/types/typedefs/ HTTP/1.1" 200
- "-" "Java/1.7.0_80"
127.0.0.1 - - [14/Sep/2017:06:10:05 +0000] "POST /api/atlas/v2/entity/ HTTP/1.1" 200 - "-"
"Java/1.7.0_80"
127.0.0.1 - - [14/Sep/2017:06:10:05 +0000] "GET /api/atlas/v2/entity/guid/592bd66e-9fd6-44c2-856c-55fe04275ca3
HTTP/1.1" 200 - "-" "Java/1.7.0_80"
127.0.0.1 - - [14/Sep/2017:06:10:05 +0000] "GET /api/atlas/discovery/search/dsl?query=from+hive_db_v1+name%3D%22dbqOtXDQGbdi%22
HTTP/1.1" 200 - "-" "Java/1.7.0_80"
127.0.0.1 - - [14/Sep/2017:06:10:06 +0000] "GET /api/atlas/discovery/search/dsl?query=from+blah
HTTP/1.1" 400 - "-" "Java/1.7.0_80"
127.0.0.1 - - [14/Sep/2017:06:10:06 +0000] "GET /api/atlas/discovery/search?query=* HTTP/1.1"
200 - "-" "Java/1.7.0_80"
127.0.0.1 - - [14/Sep/2017:06:10:06 +0000] "GET /api/atlas/discovery/search?query=from+hive_db_v1+name%3D%22dbqOtXDQGbdi%22
HTTP/1.1" 200 - "-" "Java/1.7.0_80"
127.0.0.1 - - [14/Sep/2017:06:10:07 +0000] "GET /api/atlas/discovery/search/gremlin?query=g.V.has('type',+'hive_table_v1').toList()
HTTP/1.1" 200 - "-" "Java/1.7.0_80"
127.0.0.1 - - [14/Sep/2017:06:10:08 +0000] "POST /api/atlas/v2/types/typedefs/ HTTP/1.1" 200
- "-" "Java/1.7.0_80"
127.0.0.1 - - [14/Sep/2017:06:10:08 +0000] "POST /api/atlas/v2/types/typedefs/ HTTP/1.1" 409
- "-" "Java/1.7.0_80"
127.0.0.1 - - [14/Sep/2017:06:10:08 +0000] "GET /api/atlas/v2/types/enumdef/name/blah HTTP/1.1"
404 - "-" "Java/1.7.0_80"
127.0.0.1 - - [14/Sep/2017:06:10:08 +0000] "GET /api/atlas/v2/types/enumdef/guid/blah HTTP/1.1"
404 - "-" "Java/1.7.0_80"
127.0.0.1 - - [14/Sep/2017:06:10:08 +0000] "GET /api/atlas/v2/types/structdef/name/blah HTTP/1.1"
404 - "-" "Java/1.7.0_80"
127.0.0.1 - - [14/Sep/2017:06:10:08 +0000] "GET /api/atlas/v2/types/structdef/guid/blah HTTP/1.1"
404 - "-" "Java/1.7.0_80"
127.0.0.1 - - [14/Sep/2017:06:10:08 +0000] "GET /api/atlas/v2/types/classificationdef/name/blah
HTTP/1.1" 404 - "-" "Java/1.7.0_80"
127.0.0.1 - - [14/Sep/2017:06:10:08 +0000] "GET /api/atlas/v2/types/classificationdef/guid/blah
HTTP/1.1" 404 - "-" "Java/1.7.0_80"
127.0.0.1 - - [14/Sep/2017:06:10:08 +0000] "GET /api/atlas/v2/types/entitydef/name/blah HTTP/1.1"
404 - "-" "Java/1.7.0_80"
127.0.0.1 - - [14/Sep/2017:06:10:08 +0000] "GET /api/atlas/v2/types/entitydef/guid/blah HTTP/1.1"
404 - "-" "Java/1.7.0_80"
127.0.0.1 - - [14/Sep/2017:06:10:08 +0000] "POST /api/atlas/v2/types/typedefs/ HTTP/1.1" 200
- "-" "Java/1.7.0_80"
127.0.0.1 - - [14/Sep/2017:06:10:09 +0000] "GET /api/atlas/v2/types/typedefs/?supertype=AjTKVu5axlO&type=CLASS
HTTP/1.1" 200 - "-" "Java/1.7.0_80"
127.0.0.1 - - [14/Sep/2017:06:10:09 +0000] "GET /api/atlas/v2/types/typedefs/?notsupertype=BcQe8KJ4iR0&supertype=AjTKVu5axlO&type=CLASS
HTTP/1.1" 200 - "-" "Java/1.7.0_80"
127.0.0.1 - - [14/Sep/2017:06:10:09 +0000] "POST /api/atlas/v2/types/typedefs/ HTTP/1.1" 200
- "-" "Java/1.7.0_80"
127.0.0.1 - - [14/Sep/2017:06:10:09 +0000] "PUT /api/atlas/v2/types/typedefs/ HTTP/1.1" 200
- "-" "Java/1.7.0_80"
127.0.0.1 - - [14/Sep/2017:06:10:09 +0000] "GET /api/atlas/v2/types/typedefs/?type=ENTITY
HTTP/1.1" 200 - "-" "Java/1.7.0_80"
127.0.0.1 - - [14/Sep/2017:06:10:09 +0000] "POST /api/atlas/types HTTP/1.1" 201 - "-" "Java/1.7.0_80"
127.0.0.1 - - [14/Sep/2017:06:10:09 +0000] "POST /api/atlas/types HTTP/1.1" 409 - "-" "Java/1.7.0_80"
127.0.0.1 - - [14/Sep/2017:06:10:09 +0000] "GET /api/atlas/types/blah HTTP/1.1" 404 - "-"
"Java/1.7.0_80"
127.0.0.1 - - [14/Sep/2017:06:10:10 +0000] "GET /api/atlas/v2/types/typedef/name/class_trait
HTTP/1.1" 404 - "-" "Java/1.7.0_80"
127.0.0.1 - - [14/Sep/2017:06:10:10 +0000] "POST /api/atlas/types HTTP/1.1" 201 - "-" "Java/1.7.0_80"
127.0.0.1 - - [14/Sep/2017:06:10:10 +0000] "GET /api/atlas/v2/types/typedef/name/secure_trait
HTTP/1.1" 404 - "-" "Java/1.7.0_80"
127.0.0.1 - - [14/Sep/2017:06:10:10 +0000] "POST /api/atlas/types HTTP/1.1" 201 - "-" "Java/1.7.0_80"
127.0.0.1 - - [14/Sep/2017:06:10:10 +0000] "GET /api/atlas/v2/types/typedef/name/pii_trait
HTTP/1.1" 404 - "-" "Java/1.7.0_80"
127.0.0.1 - - [14/Sep/2017:06:10:10 +0000] "POST /api/atlas/types HTTP/1.1" 201 - "-" "Java/1.7.0_80"
127.0.0.1 - - [14/Sep/2017:06:10:10 +0000] "GET /api/atlas/v2/types/typedef/name/ssn_trait
HTTP/1.1" 404 - "-" "Java/1.7.0_80"
127.0.0.1 - - [14/Sep/2017:06:10:10 +0000] "POST /api/atlas/types HTTP/1.1" 201 - "-" "Java/1.7.0_80"
127.0.0.1 - - [14/Sep/2017:06:10:10 +0000] "GET /api/atlas/v2/types/typedef/name/salary_trait
HTTP/1.1" 404 - "-" "Java/1.7.0_80"
127.0.0.1 - - [14/Sep/2017:06:10:10 +0000] "POST /api/atlas/types HTTP/1.1" 201 - "-" "Java/1.7.0_80"
127.0.0.1 - - [14/Sep/2017:06:10:10 +0000] "GET /api/atlas/v2/types/typedef/name/sox_trait
HTTP/1.1" 404 - "-" "Java/1.7.0_80"
127.0.0.1 - - [14/Sep/2017:06:10:10 +0000] "POST /api/atlas/types HTTP/1.1" 201 - "-" "Java/1.7.0_80"
127.0.0.1 - - [14/Sep/2017:06:10:10 +0000] "GET /api/atlas/types?type=TRAIT HTTP/1.1" 200
- "-" "Java/1.7.0_80"
127.0.0.1 - - [14/Sep/2017:06:10:10 +0000] "GET /api/atlas/v2/types/typedef/name/ADfA0OVu3bo
HTTP/1.1" 404 - "-" "Java/1.7.0_80"
127.0.0.1 - - [14/Sep/2017:06:10:10 +0000] "POST /api/atlas/types HTTP/1.1" 201 - "-" "Java/1.7.0_80"
127.0.0.1 - - [14/Sep/2017:06:10:11 +0000] "GET /api/atlas/v2/types/typedef/name/A1G4PoMXnpR9
HTTP/1.1" 404 - "-" "Java/1.7.0_80"
127.0.0.1 - - [14/Sep/2017:06:10:11 +0000] "POST /api/atlas/types HTTP/1.1" 201 - "-" "Java/1.7.0_80"
127.0.0.1 - - [14/Sep/2017:06:10:11 +0000] "GET /api/atlas/v2/types/typedef/name/BRPNZOMGBLQ
HTTP/1.1" 404 - "-" "Java/1.7.0_80"
127.0.0.1 - - [14/Sep/2017:06:10:11 +0000] "POST /api/atlas/types HTTP/1.1" 201 - "-" "Java/1.7.0_80"
127.0.0.1 - - [14/Sep/2017:06:10:11 +0000] "GET /api/atlas/v2/types/typedef/name/CCLFZgXFvEK
HTTP/1.1" 404 - "-" "Java/1.7.0_80"
127.0.0.1 - - [14/Sep/2017:06:10:11 +0000] "POST /api/atlas/types HTTP/1.1" 201 - "-" "Java/1.7.0_80"
127.0.0.1 - - [14/Sep/2017:06:10:12 +0000] "GET /api/atlas/types?type=CLASS&supertype=ADfA0OVu3bo&notsupertype=BRPNZOMGBLQ
HTTP/1.1" 200 - "-" "Java/1.7.0_80"
127.0.0.1 - - [14/Sep/2017:06:10:12 +0000] "POST /api/atlas/types HTTP/1.1" 201 - "-" "Java/1.7.0_80"
127.0.0.1 - - [14/Sep/2017:06:10:12 +0000] "PUT /api/atlas/types HTTP/1.1" 200 - "-" "Java/1.7.0_80"
127.0.0.1 - - [14/Sep/2017:06:10:12 +0000] "GET /api/atlas/types/I9Kz72IH9T HTTP/1.1" 200
- "-" "Java/1.7.0_80"
127.0.0.1 - - [14/Sep/2017:06:10:13 +0000] "POST /api/atlas/v2/types/typedefs/ HTTP/1.1" 409
- "-" "Java/1.7.0_80"
Tests run: 134, Failures: 1, Errors: 0, Skipped: 5, Time elapsed: 153.595 sec <<<
FAILURE! - in TestSuite
runQuickStart(org.apache.atlas.examples.QuickStartV2IT)  Time elapsed: 1.172 sec  <<<
FAILURE!
org.apache.atlas.AtlasServiceException: Metadata service API org.apache.atlas.AtlasBaseClient$APIInfo@6c39d254
failed with status 409 (Conflict) Response Body ({"errorCode":"ATLAS-409-00-001","errorMessage":"Given
type Dimension already exists"})
	at org.apache.atlas.examples.QuickStartV2IT.runQuickStart(QuickStartV2IT.java:49)


Results :

Failed tests: 
  QuickStartV2IT.runQuickStart:49 » AtlasService Metadata service API org.apache...

Tests run: 134, Failures: 1, Errors: 0, Skipped: 5

[INFO] 
[INFO] --- jetty-maven-plugin:9.2.12.v20150709:stop (stop-jetty) @ atlas-webapp ---
[INFO] Waiting 10 seconds for jetty to stop
[INFO] Stopped ServerConnector@1366e082{HTTP/1.1}{0.0.0.0:31000}
[INFO] Closing Spring root WebApplicationContext
[INFO] Shutting down log4j
[INFO] Stopped o.e.j.m.p.JettyWebAppContext@420d2ab0{/,<https://builds.apache.org/job/Atlas-0.8-IntegrationTests/ws/webapp/target/atlas-webapp-0.8.2-SNAPSHOT/,UNAVAILABLE}{/home/jenkins/jenkins-slave/workspace/Atlas-0.8-IntegrationTests/webapp/target/atlas-webapp-0.8.2-SNAPSHOT.war}>
[INFO] Server reports itself as stopped
[INFO] 
[INFO] --- maven-source-plugin:2.4:jar-no-fork (attach-sources) @ atlas-webapp ---
[INFO] Building jar: <https://builds.apache.org/job/Atlas-0.8-IntegrationTests/ws/webapp/target/atlas-webapp-0.8.2-SNAPSHOT-sources.jar>
log4j:WARN No appenders could be found for logger (org.apache.zookeeper.ClientCnxn).
log4j:WARN Please initialize the log4j system properly.
log4j:WARN See http://logging.apache.org/log4j/1.2/faq.html#noconfig for more info.
[INFO] 
[INFO] --- maven-source-plugin:2.4:test-jar-no-fork (attach-sources) @ atlas-webapp ---
[INFO] Building jar: <https://builds.apache.org/job/Atlas-0.8-IntegrationTests/ws/webapp/target/atlas-webapp-0.8.2-SNAPSHOT-test-sources.jar>
[INFO] 
[INFO] --- maven-failsafe-plugin:2.19.1:verify (verify) @ atlas-webapp ---
[INFO] ------------------------------------------------------------------------
[INFO] Reactor Summary:
[INFO] 
[INFO] Apache Atlas Server Build Tools .................... SUCCESS [  0.876 s]
[INFO] apache-atlas ....................................... SUCCESS [  4.505 s]
[INFO] Apache Atlas Integration ........................... SUCCESS [ 26.949 s]
[INFO] Apache Atlas Common ................................ SUCCESS [ 14.682 s]
[INFO] Apache Atlas Typesystem ............................ SUCCESS [01:06 min]
[INFO] Apache Atlas Client ................................ SUCCESS [ 17.134 s]
[INFO] Apache Atlas Server API ............................ SUCCESS [  9.619 s]
[INFO] Apache Atlas Notification .......................... SUCCESS [ 15.250 s]
[INFO] Apache Atlas Graph Database Projects ............... SUCCESS [  0.585 s]
[INFO] Apache Atlas Graph Database API .................... SUCCESS [  7.656 s]
[INFO] Graph Database Common Code ......................... SUCCESS [  7.673 s]
[INFO] Apache Atlas Titan 1.0.0 GraphDB Impl .............. SUCCESS [ 33.668 s]
[INFO] Shaded version of Apache hbase client .............. SUCCESS [  9.077 s]
[INFO] Apache Atlas Titan 0.5.4 Graph DB Impl ............. SUCCESS [ 45.540 s]
[INFO] Apache Atlas Graph Database Implementation Dependencies SUCCESS [  0.668 s]
[INFO] Shaded version of Apache hbase server .............. SUCCESS [ 24.599 s]
[INFO] Apache Atlas Repository ............................ SUCCESS [02:00 min]
[INFO] Apache Atlas Authorization ......................... SUCCESS [ 11.407 s]
[INFO] Apache Atlas Business Catalog ...................... SUCCESS [ 17.987 s]
[INFO] Apache Atlas UI .................................... SUCCESS [01:43 min]
[INFO] Apache Atlas Web Application ....................... FAILURE [04:13 min]
[INFO] Apache Atlas Documentation ......................... SKIPPED
[INFO] Apache Atlas FileSystem Model ...................... SKIPPED
[INFO] Apache Atlas Plugin Classloader .................... SKIPPED
[INFO] Apache Atlas Hive Bridge Shim ...................... SKIPPED
[INFO] Apache Atlas Hive Bridge ........................... SKIPPED
[INFO] Apache Atlas Falcon Bridge Shim .................... SKIPPED
[INFO] Apache Atlas Falcon Bridge ......................... SKIPPED
[INFO] Apache Atlas Sqoop Bridge Shim ..................... SKIPPED
[INFO] Apache Atlas Sqoop Bridge .......................... SKIPPED
[INFO] Apache Atlas Storm Bridge Shim ..................... SKIPPED
[INFO] Apache Atlas Storm Bridge .......................... SKIPPED
[INFO] Apache Atlas Distribution .......................... SKIPPED
[INFO] ------------------------------------------------------------------------
[INFO] BUILD FAILURE
[INFO] ------------------------------------------------------------------------
[INFO] Total time: 13:13 min
[INFO] Finished at: 2017-09-14T06:10:37Z
[INFO] Final Memory: 354M/1324M
[INFO] ------------------------------------------------------------------------
[ERROR] Failed to execute goal org.apache.maven.plugins:maven-failsafe-plugin:2.19.1:verify
(verify) on project atlas-webapp: There are test failures.
[ERROR] 
[ERROR] Please refer to <https://builds.apache.org/job/Atlas-0.8-IntegrationTests/ws/webapp/target/failsafe-reports>
for the individual test results.
[ERROR] -> [Help 1]
[ERROR] 
[ERROR] To see the full stack trace of the errors, re-run Maven with the -e switch.
[ERROR] Re-run Maven using the -X switch to enable full debug logging.
[ERROR] 
[ERROR] For more information about the errors and possible solutions, please read the following
articles:
[ERROR] [Help 1] http://cwiki.apache.org/confluence/display/MAVEN/MojoFailureException
[ERROR] 
[ERROR] After correcting the problems, you can resume the build with the command
[ERROR]   mvn <goals> -rf :atlas-webapp
Build step 'Execute shell' marked build as failure
[CHECKSTYLE] Collecting checkstyle analysis files...
[CHECKSTYLE] Searching for all files in <https://builds.apache.org/job/Atlas-0.8-IntegrationTests/ws/>
that match the pattern **/target/checkstyle-result.xml
[CHECKSTYLE] Parsing 19 files in <https://builds.apache.org/job/Atlas-0.8-IntegrationTests/ws/>
[CHECKSTYLE] Successfully parsed file <https://builds.apache.org/job/Atlas-0.8-IntegrationTests/ws/authorization/target/checkstyle-result.xml>
with 467 unique warnings and 0 duplicates.
[CHECKSTYLE] Successfully parsed file <https://builds.apache.org/job/Atlas-0.8-IntegrationTests/ws/catalog/target/checkstyle-result.xml>
with 2604 unique warnings and 0 duplicates.
[CHECKSTYLE] Successfully parsed file <https://builds.apache.org/job/Atlas-0.8-IntegrationTests/ws/client/target/checkstyle-result.xml>
with 4242 unique warnings and 0 duplicates.
[CHECKSTYLE] Successfully parsed file <https://builds.apache.org/job/Atlas-0.8-IntegrationTests/ws/common/target/checkstyle-result.xml>
with 5448 unique warnings and 0 duplicates.
[CHECKSTYLE] Successfully parsed file <https://builds.apache.org/job/Atlas-0.8-IntegrationTests/ws/dashboardv2/target/checkstyle-result.xml>
with 5448 unique warnings and 0 duplicates.
[CHECKSTYLE] Successfully parsed file <https://builds.apache.org/job/Atlas-0.8-IntegrationTests/ws/graphdb/api/target/checkstyle-result.xml>
with 5717 unique warnings and 0 duplicates.
[CHECKSTYLE] Successfully parsed file <https://builds.apache.org/job/Atlas-0.8-IntegrationTests/ws/graphdb/common/target/checkstyle-result.xml>
with 5904 unique warnings and 0 duplicates.
[CHECKSTYLE] Successfully parsed file <https://builds.apache.org/job/Atlas-0.8-IntegrationTests/ws/graphdb/graphdb-impls/target/checkstyle-result.xml>
with 5904 unique warnings and 0 duplicates.
[CHECKSTYLE] Successfully parsed file <https://builds.apache.org/job/Atlas-0.8-IntegrationTests/ws/graphdb/target/checkstyle-result.xml>
with 5904 unique warnings and 0 duplicates.
[CHECKSTYLE] Successfully parsed file <https://builds.apache.org/job/Atlas-0.8-IntegrationTests/ws/graphdb/titan0/target/checkstyle-result.xml>
with 8289 unique warnings and 0 duplicates.
[CHECKSTYLE] Successfully parsed file <https://builds.apache.org/job/Atlas-0.8-IntegrationTests/ws/graphdb/titan1/target/checkstyle-result.xml>
with 9237 unique warnings and 0 duplicates.
[CHECKSTYLE] Successfully parsed file <https://builds.apache.org/job/Atlas-0.8-IntegrationTests/ws/intg/target/checkstyle-result.xml>
with 15552 unique warnings and 0 duplicates.
[CHECKSTYLE] Successfully parsed file <https://builds.apache.org/job/Atlas-0.8-IntegrationTests/ws/notification/target/checkstyle-result.xml>
with 16762 unique warnings and 0 duplicates.
[CHECKSTYLE] Successfully parsed file <https://builds.apache.org/job/Atlas-0.8-IntegrationTests/ws/repository/target/checkstyle-result.xml>
with 35194 unique warnings and 0 duplicates.
[CHECKSTYLE] Successfully parsed file <https://builds.apache.org/job/Atlas-0.8-IntegrationTests/ws/server-api/target/checkstyle-result.xml>
with 35573 unique warnings and 0 duplicates.
[CHECKSTYLE] Successfully parsed file <https://builds.apache.org/job/Atlas-0.8-IntegrationTests/ws/shaded/hbase-client-shaded/target/checkstyle-result.xml>
with 35573 unique warnings and 0 duplicates.
[CHECKSTYLE] Successfully parsed file <https://builds.apache.org/job/Atlas-0.8-IntegrationTests/ws/shaded/hbase-server-shaded/target/checkstyle-result.xml>
with 35573 unique warnings and 0 duplicates.
[CHECKSTYLE] Successfully parsed file <https://builds.apache.org/job/Atlas-0.8-IntegrationTests/ws/target/checkstyle-result.xml>
with 35573 unique warnings and 0 duplicates.
[CHECKSTYLE] Successfully parsed file <https://builds.apache.org/job/Atlas-0.8-IntegrationTests/ws/typesystem/target/checkstyle-result.xml>
with 39791 unique warnings and 0 duplicates.
<Git Blamer> Using GitBlamer to create author and commit information for all warnings.
<Git Blamer> GIT_COMMIT=3dc90a2213ef3a2eb708dc83d68df2c3e7887c70, workspace=<https://builds.apache.org/job/Atlas-0.8-IntegrationTests/ws/>
 > git rev-parse 3dc90a2213ef3a2eb708dc83d68df2c3e7887c70^{commit} # timeout=10
[FINDBUGS] Collecting findbugs analysis files...
[FINDBUGS] Searching for all files in <https://builds.apache.org/job/Atlas-0.8-IntegrationTests/ws/>
that match the pattern **/target/findbugs.xml
[FINDBUGS] Parsing 12 files in <https://builds.apache.org/job/Atlas-0.8-IntegrationTests/ws/>
[FINDBUGS] Successfully parsed file <https://builds.apache.org/job/Atlas-0.8-IntegrationTests/ws/authorization/target/findbugs.xml>
with 0 unique warnings and 0 duplicates.
[FINDBUGS] Successfully parsed file <https://builds.apache.org/job/Atlas-0.8-IntegrationTests/ws/catalog/target/findbugs.xml>
with 0 unique warnings and 0 duplicates.
[FINDBUGS] Successfully parsed file <https://builds.apache.org/job/Atlas-0.8-IntegrationTests/ws/client/target/findbugs.xml>
with 0 unique warnings and 0 duplicates.
[FINDBUGS] Successfully parsed file <https://builds.apache.org/job/Atlas-0.8-IntegrationTests/ws/common/target/findbugs.xml>
with 0 unique warnings and 0 duplicates.
[FINDBUGS] Successfully parsed file <https://builds.apache.org/job/Atlas-0.8-IntegrationTests/ws/graphdb/api/target/findbugs.xml>
with 0 unique warnings and 0 duplicates.
[FINDBUGS] Successfully parsed file <https://builds.apache.org/job/Atlas-0.8-IntegrationTests/ws/graphdb/common/target/findbugs.xml>
with 0 unique warnings and 0 duplicates.
[FINDBUGS] Successfully parsed file <https://builds.apache.org/job/Atlas-0.8-IntegrationTests/ws/graphdb/titan0/target/findbugs.xml>
with 0 unique warnings and 0 duplicates.
[FINDBUGS] Successfully parsed file <https://builds.apache.org/job/Atlas-0.8-IntegrationTests/ws/intg/target/findbugs.xml>
with 0 unique warnings and 0 duplicates.
[FINDBUGS] Successfully parsed file <https://builds.apache.org/job/Atlas-0.8-IntegrationTests/ws/notification/target/findbugs.xml>
with 0 unique warnings and 0 duplicates.
[FINDBUGS] Successfully parsed file <https://builds.apache.org/job/Atlas-0.8-IntegrationTests/ws/repository/target/findbugs.xml>
with 0 unique warnings and 0 duplicates.
[FINDBUGS] Successfully parsed file <https://builds.apache.org/job/Atlas-0.8-IntegrationTests/ws/server-api/target/findbugs.xml>
with 0 unique warnings and 0 duplicates.
[FINDBUGS] Successfully parsed file <https://builds.apache.org/job/Atlas-0.8-IntegrationTests/ws/typesystem/target/findbugs.xml>
with 0 unique warnings and 0 duplicates.
<Git Blamer> Using GitBlamer to create author and commit information for all warnings.
<Git Blamer> GIT_COMMIT=3dc90a2213ef3a2eb708dc83d68df2c3e7887c70, workspace=<https://builds.apache.org/job/Atlas-0.8-IntegrationTests/ws/>
Archiving artifacts
[Fast Archiver] No prior successful build to compare, so performing full copy of artifacts
TestNG Reports Processing: START
Looking for TestNG results report in workspace using pattern: **/target/surefire-reports/testng-results.xml,**/target/failsafe-reports/testng-results.xml
Saving reports...
Processing '/x1/jenkins/jenkins-home/jobs/Atlas-0.8-IntegrationTests/builds/57/testng/testng-results.xml'
TestNG Reports Processing: FINISH

Mime
View raw message