atlas-dev mailing list archives

Site index · List index
Message view « Date » · « Thread »
Top « Date » · « Thread »
From Apache Jenkins Server <jenk...@builds.apache.org>
Subject Build failed in Jenkins: Atlas-master-IntegrationTests #119
Date Sat, 23 Sep 2017 00:48:02 GMT
See <https://builds.apache.org/job/Atlas-master-IntegrationTests/119/display/redirect?page=changes>

Changes:

[madhan] ATLAS-2160: added REST APIs to execute a saved-search

------------------------------------------
[...truncated 457.35 KB...]
127.0.0.1 - - [23/Sep/2017:00:43:13 +0000] "POST /api/atlas/types HTTP/1.1" 201 - "-" "Java/1.7.0_80"
127.0.0.1 - - [23/Sep/2017:00:43:13 +0000] "GET /api/atlas/v2/types/typedef/name/salary_trait
HTTP/1.1" 404 - "-" "Java/1.7.0_80"
127.0.0.1 - - [23/Sep/2017:00:43:13 +0000] "POST /api/atlas/types HTTP/1.1" 201 - "-" "Java/1.7.0_80"
127.0.0.1 - - [23/Sep/2017:00:43:13 +0000] "GET /api/atlas/v2/types/typedef/name/sox_trait
HTTP/1.1" 404 - "-" "Java/1.7.0_80"
127.0.0.1 - - [23/Sep/2017:00:43:13 +0000] "POST /api/atlas/types HTTP/1.1" 201 - "-" "Java/1.7.0_80"
127.0.0.1 - - [23/Sep/2017:00:43:13 +0000] "GET /api/atlas/types?type=TRAIT HTTP/1.1" 200
- "-" "Java/1.7.0_80"
127.0.0.1 - - [23/Sep/2017:00:43:13 +0000] "POST /api/atlas/types HTTP/1.1" 201 - "-" "Java/1.7.0_80"
127.0.0.1 - - [23/Sep/2017:00:43:13 +0000] "PUT /api/atlas/types HTTP/1.1" 200 - "-" "Java/1.7.0_80"
127.0.0.1 - - [23/Sep/2017:00:43:13 +0000] "GET /api/atlas/types/Hsynq9yO8O HTTP/1.1" 200
- "-" "Java/1.7.0_80"
127.0.0.1 - - [23/Sep/2017:00:43:13 +0000] "GET /api/atlas/v2/types/typedef/name/AOnzWVrKnUP
HTTP/1.1" 404 - "-" "Java/1.7.0_80"
127.0.0.1 - - [23/Sep/2017:00:43:13 +0000] "POST /api/atlas/types HTTP/1.1" 201 - "-" "Java/1.7.0_80"
127.0.0.1 - - [23/Sep/2017:00:43:13 +0000] "GET /api/atlas/v2/types/typedef/name/A1vblMk0qGVU
HTTP/1.1" 404 - "-" "Java/1.7.0_80"
127.0.0.1 - - [23/Sep/2017:00:43:13 +0000] "POST /api/atlas/types HTTP/1.1" 201 - "-" "Java/1.7.0_80"
127.0.0.1 - - [23/Sep/2017:00:43:14 +0000] "GET /api/atlas/v2/types/typedef/name/Be1W6VSfeKJ
HTTP/1.1" 404 - "-" "Java/1.7.0_80"
127.0.0.1 - - [23/Sep/2017:00:43:14 +0000] "POST /api/atlas/types HTTP/1.1" 201 - "-" "Java/1.7.0_80"
127.0.0.1 - - [23/Sep/2017:00:43:14 +0000] "GET /api/atlas/v2/types/typedef/name/Cj5G15W3zTY
HTTP/1.1" 404 - "-" "Java/1.7.0_80"
127.0.0.1 - - [23/Sep/2017:00:43:14 +0000] "POST /api/atlas/types HTTP/1.1" 201 - "-" "Java/1.7.0_80"
127.0.0.1 - - [23/Sep/2017:00:43:14 +0000] "GET /api/atlas/types?type=CLASS&supertype=AOnzWVrKnUP&notsupertype=Be1W6VSfeKJ
HTTP/1.1" 200 - "-" "Java/1.7.0_80"
127.0.0.1 - - [23/Sep/2017:00:43:14 +0000] "GET /api/atlas/types/blah HTTP/1.1" 404 - "-"
"Java/1.7.0_80"
127.0.0.1 - - [23/Sep/2017:00:43:18 +0000] "GET /api/atlas/v2/types/typedef/name/tableType
HTTP/1.1" 404 - "-" "Java/1.7.0_80"
127.0.0.1 - - [23/Sep/2017:00:43:18 +0000] "GET /api/atlas/v2/types/typedef/name/serdeType
HTTP/1.1" 404 - "-" "Java/1.7.0_80"
127.0.0.1 - - [23/Sep/2017:00:43:18 +0000] "GET /api/atlas/v2/types/typedef/name/classification
HTTP/1.1" 404 - "-" "Java/1.7.0_80"
127.0.0.1 - - [23/Sep/2017:00:43:18 +0000] "GET /api/atlas/v2/types/typedef/name/pii HTTP/1.1"
404 - "-" "Java/1.7.0_80"
127.0.0.1 - - [23/Sep/2017:00:43:18 +0000] "GET /api/atlas/v2/types/typedef/name/phi HTTP/1.1"
404 - "-" "Java/1.7.0_80"
127.0.0.1 - - [23/Sep/2017:00:43:18 +0000] "GET /api/atlas/v2/types/typedef/name/pci HTTP/1.1"
404 - "-" "Java/1.7.0_80"
127.0.0.1 - - [23/Sep/2017:00:43:18 +0000] "GET /api/atlas/v2/types/typedef/name/sox HTTP/1.1"
404 - "-" "Java/1.7.0_80"
127.0.0.1 - - [23/Sep/2017:00:43:18 +0000] "GET /api/atlas/v2/types/typedef/name/sec HTTP/1.1"
404 - "-" "Java/1.7.0_80"
127.0.0.1 - - [23/Sep/2017:00:43:18 +0000] "GET /api/atlas/v2/types/typedef/name/finance HTTP/1.1"
404 - "-" "Java/1.7.0_80"
127.0.0.1 - - [23/Sep/2017:00:43:18 +0000] "GET /api/atlas/v2/types/typedef/name/Facte00bx61KSg
HTTP/1.1" 404 - "-" "Java/1.7.0_80"
127.0.0.1 - - [23/Sep/2017:00:43:18 +0000] "GET /api/atlas/v2/types/typedef/name/ETLJB4NxCXcwR
HTTP/1.1" 404 - "-" "Java/1.7.0_80"
127.0.0.1 - - [23/Sep/2017:00:43:18 +0000] "GET /api/atlas/v2/types/typedef/name/DimensionZXXm990pMH
HTTP/1.1" 404 - "-" "Java/1.7.0_80"
127.0.0.1 - - [23/Sep/2017:00:43:18 +0000] "GET /api/atlas/v2/types/typedef/name/MetricKgYpzuxHDG
HTTP/1.1" 404 - "-" "Java/1.7.0_80"
127.0.0.1 - - [23/Sep/2017:00:43:18 +0000] "GET /api/atlas/v2/types/typedef/name/hive_db_v1
HTTP/1.1" 404 - "-" "Java/1.7.0_80"
127.0.0.1 - - [23/Sep/2017:00:43:18 +0000] "GET /api/atlas/v2/types/typedef/name/hive_column_v1
HTTP/1.1" 404 - "-" "Java/1.7.0_80"
127.0.0.1 - - [23/Sep/2017:00:43:18 +0000] "GET /api/atlas/v2/types/typedef/name/hive_table_v1
HTTP/1.1" 404 - "-" "Java/1.7.0_80"
127.0.0.1 - - [23/Sep/2017:00:43:18 +0000] "GET /api/atlas/v2/types/typedef/name/hive_process_v1
HTTP/1.1" 404 - "-" "Java/1.7.0_80"
127.0.0.1 - - [23/Sep/2017:00:43:18 +0000] "POST /api/atlas/types HTTP/1.1" 400 - "-" "Java/1.7.0_80"
Tests run: 143, Failures: 16, Errors: 0, Skipped: 100, Time elapsed: 18.73 sec <<<
FAILURE! - in TestSuite
setUp(org.apache.atlas.web.integration.EntityDiscoveryJerseyResourceIT)  Time elapsed: 3.563
sec  <<< FAILURE!
org.apache.atlas.AtlasServiceException: Metadata service API org.apache.atlas.AtlasBaseClient$APIInfo@46844725
failed with status 400 (Bad Request) Response Body ({"error":"Unknown datatype: hive_db"})
	at org.apache.atlas.web.integration.EntityDiscoveryJerseyResourceIT.setUp(EntityDiscoveryJerseyResourceIT.java:59)

setUp(org.apache.atlas.web.integration.EntityV2JerseyResourceIT)  Time elapsed: 0.52 sec 
<<< FAILURE!
org.apache.atlas.AtlasServiceException: Metadata service API org.apache.atlas.AtlasBaseClient$APIInfo@7c770cbd
failed with status 400 (Bad Request) Response Body ({"errorCode":"ATLAS-400-00-029","errorMessage":"Given
typename Process was invalid"})
	at org.apache.atlas.web.integration.EntityV2JerseyResourceIT.setUp(EntityV2JerseyResourceIT.java:80)

setUp(org.apache.atlas.web.integration.MetadataDiscoveryJerseyResourceIT)  Time elapsed: 0.369
sec  <<< FAILURE!
org.apache.atlas.AtlasServiceException: Metadata service API org.apache.atlas.AtlasBaseClient$APIInfo@79f4afd6
failed with status 400 (Bad Request) Response Body ({"error":"Given typename DataSet was invalid"})
	at org.apache.atlas.web.integration.MetadataDiscoveryJerseyResourceIT.createTypes(MetadataDiscoveryJerseyResourceIT.java:237)
	at org.apache.atlas.web.integration.MetadataDiscoveryJerseyResourceIT.setUp(MetadataDiscoveryJerseyResourceIT.java:63)

runQuickStart(org.apache.atlas.examples.QuickStartIT)  Time elapsed: 0.702 sec  <<<
FAILURE!
org.apache.atlas.AtlasServiceException: Metadata service API org.apache.atlas.AtlasBaseClient$APIInfo@6a1fbfb9
failed with status 400 (Bad Request) Response Body ({"error":"Given typename DataSet was invalid"})
	at org.apache.atlas.examples.QuickStartIT.runQuickStart(QuickStartIT.java:44)

runQuickStart(org.apache.atlas.examples.QuickStartV2IT)  Time elapsed: 0.468 sec  <<<
FAILURE!
org.apache.atlas.AtlasServiceException: Metadata service API org.apache.atlas.AtlasBaseClient$APIInfo@7c770cbd
failed with status 400 (Bad Request) Response Body ({"errorCode":"ATLAS-400-00-029","errorMessage":"Given
typename DataSet was invalid"})
	at org.apache.atlas.examples.QuickStartV2IT.runQuickStart(QuickStartV2IT.java:49)

setUp(org.apache.atlas.notification.NotificationHookConsumerIT)  Time elapsed: 0.306 sec 
<<< FAILURE!
org.apache.atlas.AtlasServiceException: Metadata service API org.apache.atlas.AtlasBaseClient$APIInfo@6ece5b5f
failed with status 400 (Bad Request) Response Body ({"error":"Given typename DataSet was invalid"})
	at org.apache.atlas.notification.NotificationHookConsumerIT.setUp(NotificationHookConsumerIT.java:55)

setUp(org.apache.atlas.web.integration.EntityLineageJerseyResourceIT)  Time elapsed: 0.302
sec  <<< FAILURE!
org.apache.atlas.AtlasServiceException: Metadata service API org.apache.atlas.AtlasBaseClient$APIInfo@77789e14
failed with status 400 (Bad Request) Response Body ({"error":"Given typename DataSet was invalid"})
	at org.apache.atlas.web.integration.EntityLineageJerseyResourceIT.setUp(EntityLineageJerseyResourceIT.java:61)

testInputsGraph(org.apache.atlas.web.integration.EntityLineageJerseyResourceIT)  Time elapsed:
0.001 sec  <<< FAILURE!
java.lang.IllegalArgumentException: Path segment is null

testInputsGraphForEntity(org.apache.atlas.web.integration.EntityLineageJerseyResourceIT) 
Time elapsed: 0.001 sec  <<< FAILURE!
java.lang.IllegalArgumentException: One or more of query value parameters are null

testOutputsGraph(org.apache.atlas.web.integration.EntityLineageJerseyResourceIT)  Time elapsed:
0 sec  <<< FAILURE!
java.lang.IllegalArgumentException: Path segment is null

testOutputsGraphForEntity(org.apache.atlas.web.integration.EntityLineageJerseyResourceIT)
 Time elapsed: 0 sec  <<< FAILURE!
java.lang.IllegalArgumentException: One or more of query value parameters are null

testSchema(org.apache.atlas.web.integration.EntityLineageJerseyResourceIT)  Time elapsed:
0.001 sec  <<< FAILURE!
java.lang.IllegalArgumentException: Path segment is null

testSchemaForDB(org.apache.atlas.web.integration.EntityLineageJerseyResourceIT)  Time elapsed:
0.001 sec  <<< FAILURE!
org.testng.TestException: 

Expected exception org.apache.atlas.AtlasServiceException but got java.lang.IllegalArgumentException:
Path segment is null
Caused by: java.lang.IllegalArgumentException: Path segment is null

testSchemaForEntity(org.apache.atlas.web.integration.EntityLineageJerseyResourceIT)  Time
elapsed: 0 sec  <<< FAILURE!
java.lang.IllegalArgumentException: One or more of query value parameters are null

setUp(org.apache.atlas.web.integration.EntityJerseyResourceIT)  Time elapsed: 0.312 sec  <<<
FAILURE!
org.apache.atlas.AtlasServiceException: Metadata service API org.apache.atlas.AtlasBaseClient$APIInfo@32b73779
failed with status 400 (Bad Request) Response Body ({"error":"Given typename DataSet was invalid"})
	at org.apache.atlas.web.integration.EntityJerseyResourceIT.setUp(EntityJerseyResourceIT.java:89)

setUp(org.apache.atlas.web.integration.DataSetLineageJerseyResourceIT)  Time elapsed: 3.912
sec  <<< FAILURE!
org.apache.atlas.AtlasServiceException: Metadata service API org.apache.atlas.AtlasBaseClient$APIInfo@157b3d78
failed with status 400 (Bad Request) Response Body ({"error":"Given typename DataSet was invalid"})
	at org.apache.atlas.web.integration.DataSetLineageJerseyResourceIT.setUp(DataSetLineageJerseyResourceIT.java:56)


Results :

Failed tests: 
  QuickStartIT.runQuickStart:44 » AtlasService Metadata service API org.apache.a...
  QuickStartV2IT.runQuickStart:49 » AtlasService Metadata service API org.apache...
  NotificationHookConsumerIT.setUp:55->BaseResourceIT.createTypeDefinitionsV1:357->BaseResourceIT.createType:204
» AtlasService
  DataSetLineageJerseyResourceIT.setUp:56->BaseResourceIT.createTypeDefinitionsV1:357->BaseResourceIT.createType:204
» AtlasService
  EntityDiscoveryJerseyResourceIT.setUp:59->BaseResourceIT.createInstance:215 » AtlasService
  EntityJerseyResourceIT.setUp:89->BaseResourceIT.createTypeDefinitionsV1:357->BaseResourceIT.createType:204
» AtlasService
  EntityLineageJerseyResourceIT.setUp:61->DataSetLineageJerseyResourceIT.setUp:56->BaseResourceIT.createTypeDefinitionsV1:357->BaseResourceIT.createType:204
» AtlasService
  EntityLineageJerseyResourceIT>DataSetLineageJerseyResourceIT.testInputsGraph:62 » IllegalArgument
  EntityLineageJerseyResourceIT>DataSetLineageJerseyResourceIT.testInputsGraphForEntity:81
» IllegalArgument
  EntityLineageJerseyResourceIT>DataSetLineageJerseyResourceIT.testOutputsGraph:98 » IllegalArgument
  EntityLineageJerseyResourceIT>DataSetLineageJerseyResourceIT.testOutputsGraphForEntity:117
» IllegalArgument
  EntityLineageJerseyResourceIT>DataSetLineageJerseyResourceIT.testSchema:134 » IllegalArgument
  EntityLineageJerseyResourceIT.testSchemaForDB » Test 
Expected exception org.a...
  EntityLineageJerseyResourceIT>DataSetLineageJerseyResourceIT.testSchemaForEntity:158
» IllegalArgument
  EntityV2JerseyResourceIT.setUp:80->BaseResourceIT.createTypeDefinitionsV2:454->BaseResourceIT.batchCreateTypes:157
» AtlasService
  MetadataDiscoveryJerseyResourceIT.setUp:63->createTypes:237->BaseResourceIT.createTypeDefinitionsV1:357->BaseResourceIT.createType:204
» AtlasService

Tests run: 142, Failures: 16, Errors: 0, Skipped: 99

[INFO] 
[INFO] --- jetty-maven-plugin:9.2.12.v20150709:stop (stop-jetty) @ atlas-webapp ---
[INFO] Waiting 10 seconds for jetty to stop
[INFO] Stopped ServerConnector@629cce0f{HTTP/1.1}{0.0.0.0:31000}
[INFO] Closing Spring root WebApplicationContext
[INFO] Shutting down log4j
[INFO] Stopped o.e.j.m.p.JettyWebAppContext@698ea996{/,<https://builds.apache.org/job/Atlas-master-IntegrationTests/ws/webapp/target/atlas-webapp-0.9-SNAPSHOT/,UNAVAILABLE}{/home/jenkins/jenkins-slave/workspace/Atlas-master-IntegrationTests/webapp/target/atlas-webapp-0.9-SNAPSHOT.war}>
[INFO] Server reports itself as stopped
[INFO] 
[INFO] --- maven-source-plugin:2.4:jar-no-fork (attach-sources) @ atlas-webapp ---
[INFO] Building jar: <https://builds.apache.org/job/Atlas-master-IntegrationTests/ws/webapp/target/atlas-webapp-0.9-SNAPSHOT-sources.jar>
log4j:WARN No appenders could be found for logger (org.apache.zookeeper.ClientCnxn).
log4j:WARN Please initialize the log4j system properly.
log4j:WARN See http://logging.apache.org/log4j/1.2/faq.html#noconfig for more info.
[INFO] 
[INFO] --- maven-source-plugin:2.4:test-jar-no-fork (attach-sources) @ atlas-webapp ---
[INFO] Building jar: <https://builds.apache.org/job/Atlas-master-IntegrationTests/ws/webapp/target/atlas-webapp-0.9-SNAPSHOT-test-sources.jar>
[INFO] 
[INFO] --- maven-failsafe-plugin:2.19.1:verify (verify) @ atlas-webapp ---
[INFO] ------------------------------------------------------------------------
[INFO] Reactor Summary:
[INFO] 
[INFO] Apache Atlas Server Build Tools .................... SUCCESS [  0.801 s]
[INFO] apache-atlas ....................................... SUCCESS [  4.413 s]
[INFO] Apache Atlas Integration ........................... SUCCESS [ 29.435 s]
[INFO] Apache Atlas Common ................................ SUCCESS [ 14.054 s]
[INFO] Apache Atlas Typesystem ............................ SUCCESS [01:02 min]
[INFO] Apache Atlas Client ................................ SUCCESS [ 16.598 s]
[INFO] Apache Atlas Server API ............................ SUCCESS [  9.421 s]
[INFO] Apache Atlas Notification .......................... SUCCESS [ 14.146 s]
[INFO] Apache Atlas Graph Database Projects ............... SUCCESS [  0.572 s]
[INFO] Apache Atlas Graph Database API .................... SUCCESS [  7.207 s]
[INFO] Graph Database Common Code ......................... SUCCESS [  7.365 s]
[INFO] Apache Atlas Titan 1.0.0 GraphDB Impl .............. SUCCESS [ 29.989 s]
[INFO] Shaded version of Apache hbase client .............. SUCCESS [  8.183 s]
[INFO] Apache Atlas Titan 0.5.4 Graph DB Impl ............. SUCCESS [ 41.637 s]
[INFO] Apache Atlas Graph Database Implementation Dependencies SUCCESS [  0.694 s]
[INFO] Shaded version of Apache hbase server .............. SUCCESS [ 22.735 s]
[INFO] Apache Atlas Repository ............................ SUCCESS [01:47 min]
[INFO] Apache Atlas Authorization ......................... SUCCESS [ 11.500 s]
[INFO] Apache Atlas Business Catalog ...................... SUCCESS [ 16.328 s]
[INFO] Apache Atlas UI .................................... SUCCESS [01:31 min]
[INFO] Apache Atlas Web Application ....................... FAILURE [01:43 min]
[INFO] Apache Atlas Documentation ......................... SKIPPED
[INFO] Apache Atlas FileSystem Model ...................... SKIPPED
[INFO] Apache Atlas Plugin Classloader .................... SKIPPED
[INFO] Apache Atlas Hive Bridge Shim ...................... SKIPPED
[INFO] Apache Atlas Hive Bridge ........................... SKIPPED
[INFO] Apache Atlas Falcon Bridge Shim .................... SKIPPED
[INFO] Apache Atlas Falcon Bridge ......................... SKIPPED
[INFO] Apache Atlas Sqoop Bridge Shim ..................... SKIPPED
[INFO] Apache Atlas Sqoop Bridge .......................... SKIPPED
[INFO] Apache Atlas Storm Bridge Shim ..................... SKIPPED
[INFO] Apache Atlas Storm Bridge .......................... SKIPPED
[INFO] Apache Atlas Distribution .......................... SKIPPED
[INFO] ------------------------------------------------------------------------
[INFO] BUILD FAILURE
[INFO] ------------------------------------------------------------------------
[INFO] Total time: 10:02 min
[INFO] Finished at: 2017-09-23T00:43:23Z
[INFO] Final Memory: 331M/1657M
[INFO] ------------------------------------------------------------------------
[ERROR] Failed to execute goal org.apache.maven.plugins:maven-failsafe-plugin:2.19.1:verify
(verify) on project atlas-webapp: There are test failures.
[ERROR] 
[ERROR] Please refer to <https://builds.apache.org/job/Atlas-master-IntegrationTests/ws/webapp/target/failsafe-reports>
for the individual test results.
[ERROR] -> [Help 1]
[ERROR] 
[ERROR] To see the full stack trace of the errors, re-run Maven with the -e switch.
[ERROR] Re-run Maven using the -X switch to enable full debug logging.
[ERROR] 
[ERROR] For more information about the errors and possible solutions, please read the following
articles:
[ERROR] [Help 1] http://cwiki.apache.org/confluence/display/MAVEN/MojoFailureException
[ERROR] 
[ERROR] After correcting the problems, you can resume the build with the command
[ERROR]   mvn <goals> -rf :atlas-webapp
Build step 'Execute shell' marked build as failure
[CHECKSTYLE] Collecting checkstyle analysis files...
[CHECKSTYLE] Searching for all files in <https://builds.apache.org/job/Atlas-master-IntegrationTests/ws/>
that match the pattern **/target/checkstyle-result.xml
[CHECKSTYLE] Parsing 19 files in <https://builds.apache.org/job/Atlas-master-IntegrationTests/ws/>
[CHECKSTYLE] Successfully parsed file <https://builds.apache.org/job/Atlas-master-IntegrationTests/ws/authorization/target/checkstyle-result.xml>
with 467 unique warnings and 0 duplicates.
[CHECKSTYLE] Successfully parsed file <https://builds.apache.org/job/Atlas-master-IntegrationTests/ws/catalog/target/checkstyle-result.xml>
with 2604 unique warnings and 0 duplicates.
[CHECKSTYLE] Successfully parsed file <https://builds.apache.org/job/Atlas-master-IntegrationTests/ws/client/target/checkstyle-result.xml>
with 4241 unique warnings and 0 duplicates.
[CHECKSTYLE] Successfully parsed file <https://builds.apache.org/job/Atlas-master-IntegrationTests/ws/common/target/checkstyle-result.xml>
with 5455 unique warnings and 0 duplicates.
[CHECKSTYLE] Successfully parsed file <https://builds.apache.org/job/Atlas-master-IntegrationTests/ws/dashboardv2/target/checkstyle-result.xml>
with 5455 unique warnings and 0 duplicates.
[CHECKSTYLE] Successfully parsed file <https://builds.apache.org/job/Atlas-master-IntegrationTests/ws/graphdb/api/target/checkstyle-result.xml>
with 5728 unique warnings and 0 duplicates.
[CHECKSTYLE] Successfully parsed file <https://builds.apache.org/job/Atlas-master-IntegrationTests/ws/graphdb/common/target/checkstyle-result.xml>
with 5915 unique warnings and 0 duplicates.
[CHECKSTYLE] Successfully parsed file <https://builds.apache.org/job/Atlas-master-IntegrationTests/ws/graphdb/graphdb-impls/target/checkstyle-result.xml>
with 5915 unique warnings and 0 duplicates.
[CHECKSTYLE] Successfully parsed file <https://builds.apache.org/job/Atlas-master-IntegrationTests/ws/graphdb/target/checkstyle-result.xml>
with 5915 unique warnings and 0 duplicates.
[CHECKSTYLE] Successfully parsed file <https://builds.apache.org/job/Atlas-master-IntegrationTests/ws/graphdb/titan0/target/checkstyle-result.xml>
with 8317 unique warnings and 0 duplicates.
[CHECKSTYLE] Successfully parsed file <https://builds.apache.org/job/Atlas-master-IntegrationTests/ws/graphdb/titan1/target/checkstyle-result.xml>
with 9284 unique warnings and 0 duplicates.
[CHECKSTYLE] Successfully parsed file <https://builds.apache.org/job/Atlas-master-IntegrationTests/ws/intg/target/checkstyle-result.xml>
with 17225 unique warnings and 0 duplicates.
[CHECKSTYLE] Successfully parsed file <https://builds.apache.org/job/Atlas-master-IntegrationTests/ws/notification/target/checkstyle-result.xml>
with 18435 unique warnings and 0 duplicates.
[CHECKSTYLE] Successfully parsed file <https://builds.apache.org/job/Atlas-master-IntegrationTests/ws/repository/target/checkstyle-result.xml>
with 38715 unique warnings and 0 duplicates.
[CHECKSTYLE] Successfully parsed file <https://builds.apache.org/job/Atlas-master-IntegrationTests/ws/server-api/target/checkstyle-result.xml>
with 39094 unique warnings and 0 duplicates.
[CHECKSTYLE] Successfully parsed file <https://builds.apache.org/job/Atlas-master-IntegrationTests/ws/shaded/hbase-client-shaded/target/checkstyle-result.xml>
with 39094 unique warnings and 0 duplicates.
[CHECKSTYLE] Successfully parsed file <https://builds.apache.org/job/Atlas-master-IntegrationTests/ws/shaded/hbase-server-shaded/target/checkstyle-result.xml>
with 39094 unique warnings and 0 duplicates.
[CHECKSTYLE] Successfully parsed file <https://builds.apache.org/job/Atlas-master-IntegrationTests/ws/target/checkstyle-result.xml>
with 39094 unique warnings and 0 duplicates.
[CHECKSTYLE] Successfully parsed file <https://builds.apache.org/job/Atlas-master-IntegrationTests/ws/typesystem/target/checkstyle-result.xml>
with 43312 unique warnings and 0 duplicates.
<Git Blamer> Using GitBlamer to create author and commit information for all warnings.
<Git Blamer> GIT_COMMIT=7cce1c4af84001c79b7e0d9ad2e566b8cbaf7ccb, workspace=<https://builds.apache.org/job/Atlas-master-IntegrationTests/ws/>
 > git rev-parse 7cce1c4af84001c79b7e0d9ad2e566b8cbaf7ccb^{commit} # timeout=10
[FINDBUGS] Collecting findbugs analysis files...
[FINDBUGS] Searching for all files in <https://builds.apache.org/job/Atlas-master-IntegrationTests/ws/>
that match the pattern **/target/findbugs.xml
[FINDBUGS] Parsing 12 files in <https://builds.apache.org/job/Atlas-master-IntegrationTests/ws/>
[FINDBUGS] Successfully parsed file <https://builds.apache.org/job/Atlas-master-IntegrationTests/ws/authorization/target/findbugs.xml>
with 0 unique warnings and 0 duplicates.
[FINDBUGS] Successfully parsed file <https://builds.apache.org/job/Atlas-master-IntegrationTests/ws/catalog/target/findbugs.xml>
with 0 unique warnings and 0 duplicates.
[FINDBUGS] Successfully parsed file <https://builds.apache.org/job/Atlas-master-IntegrationTests/ws/client/target/findbugs.xml>
with 0 unique warnings and 0 duplicates.
[FINDBUGS] Successfully parsed file <https://builds.apache.org/job/Atlas-master-IntegrationTests/ws/common/target/findbugs.xml>
with 0 unique warnings and 0 duplicates.
[FINDBUGS] Successfully parsed file <https://builds.apache.org/job/Atlas-master-IntegrationTests/ws/graphdb/api/target/findbugs.xml>
with 0 unique warnings and 0 duplicates.
[FINDBUGS] Successfully parsed file <https://builds.apache.org/job/Atlas-master-IntegrationTests/ws/graphdb/common/target/findbugs.xml>
with 0 unique warnings and 0 duplicates.
[FINDBUGS] Successfully parsed file <https://builds.apache.org/job/Atlas-master-IntegrationTests/ws/graphdb/titan0/target/findbugs.xml>
with 0 unique warnings and 0 duplicates.
[FINDBUGS] Successfully parsed file <https://builds.apache.org/job/Atlas-master-IntegrationTests/ws/intg/target/findbugs.xml>
with 0 unique warnings and 0 duplicates.
[FINDBUGS] Successfully parsed file <https://builds.apache.org/job/Atlas-master-IntegrationTests/ws/notification/target/findbugs.xml>
with 0 unique warnings and 0 duplicates.
[FINDBUGS] Successfully parsed file <https://builds.apache.org/job/Atlas-master-IntegrationTests/ws/repository/target/findbugs.xml>
with 0 unique warnings and 0 duplicates.
[FINDBUGS] Successfully parsed file <https://builds.apache.org/job/Atlas-master-IntegrationTests/ws/server-api/target/findbugs.xml>
with 0 unique warnings and 0 duplicates.
[FINDBUGS] Successfully parsed file <https://builds.apache.org/job/Atlas-master-IntegrationTests/ws/typesystem/target/findbugs.xml>
with 0 unique warnings and 0 duplicates.
<Git Blamer> Using GitBlamer to create author and commit information for all warnings.
<Git Blamer> GIT_COMMIT=7cce1c4af84001c79b7e0d9ad2e566b8cbaf7ccb, workspace=<https://builds.apache.org/job/Atlas-master-IntegrationTests/ws/>
Archiving artifacts
[Fast Archiver] No prior successful build to compare, so performing full copy of artifacts
TestNG Reports Processing: START
Looking for TestNG results report in workspace using pattern: **/target/surefire-reports/testng-results.xml,**/target/failsafe-reports/testng-results.xml
Saving reports...
Processing '/x1/jenkins/jenkins-home/jobs/Atlas-master-IntegrationTests/builds/119/testng/testng-results.xml'
5.263158% of tests failed, which exceeded threshold of 0%. Marking build as UNSTABLE
TestNG Reports Processing: FINISH

Mime
View raw message