atlas-dev mailing list archives

Site index · List index
Message view « Date » · « Thread »
Top « Date » · « Thread »
From Apache Jenkins Server <jenk...@builds.apache.org>
Subject Build failed in Jenkins: Atlas-master-UnitTests #78
Date Fri, 15 Sep 2017 16:42:18 GMT
See <https://builds.apache.org/job/Atlas-master-UnitTests/78/display/redirect?page=changes>

Changes:

[madhan] ATLAS-2102 : Atlas UI Improvements: Search results page. patch has

[madhan] ATLAS-2129: import fix to handle shutdown while in the middle of import

------------------------------------------
[...truncated 272.98 KB...]
	at org.apache.atlas.repository.store.graph.v1.AtlasEntityStoreV1BulkImportPercentTest.percentTest_Equal202(AtlasEntityStoreV1BulkImportPercentTest.java:116)

percentTest_Equal269(org.apache.atlas.repository.store.graph.v1.AtlasEntityStoreV1BulkImportPercentTest)
 Time elapsed: 0.002 sec  <<< FAILURE!
org.powermock.reflect.exceptions.MethodNotFoundException: No method found with name 'updateImportProgress'
with parameter types: [ org.slf4j.Logger$$EnhancerByMockitoWithCGLIB$$76139b96, java.lang.Integer,
java.lang.Integer, java.lang.Float, java.lang.String ] in class org.apache.atlas.repository.store.graph.v1.AtlasEntityStoreV1.
	at org.powermock.reflect.internal.WhiteboxImpl.throwExceptionIfMethodWasNotFound(WhiteboxImpl.java:1167)
	at org.powermock.reflect.internal.WhiteboxImpl.findMethodOrThrowException(WhiteboxImpl.java:875)
	at org.powermock.reflect.internal.WhiteboxImpl.doInvokeMethod(WhiteboxImpl.java:770)
	at org.powermock.reflect.internal.WhiteboxImpl.invokeMethod(WhiteboxImpl.java:753)
	at org.powermock.reflect.Whitebox.invokeMethod(Whitebox.java:466)
	at org.apache.atlas.repository.store.graph.v1.AtlasEntityStoreV1BulkImportPercentTest.invokeBulkImportProgress(AtlasEntityStoreV1BulkImportPercentTest.java:156)
	at org.apache.atlas.repository.store.graph.v1.AtlasEntityStoreV1BulkImportPercentTest.runWithSize(AtlasEntityStoreV1BulkImportPercentTest.java:151)
	at org.apache.atlas.repository.store.graph.v1.AtlasEntityStoreV1BulkImportPercentTest.percentTest_Equal269(AtlasEntityStoreV1BulkImportPercentTest.java:143)

percentTest_Equal4(org.apache.atlas.repository.store.graph.v1.AtlasEntityStoreV1BulkImportPercentTest)
 Time elapsed: 0.002 sec  <<< FAILURE!
org.powermock.reflect.exceptions.MethodNotFoundException: No method found with name 'updateImportProgress'
with parameter types: [ org.slf4j.Logger$$EnhancerByMockitoWithCGLIB$$76139b96, java.lang.Integer,
java.lang.Integer, java.lang.Float, java.lang.String ] in class org.apache.atlas.repository.store.graph.v1.AtlasEntityStoreV1.
	at org.powermock.reflect.internal.WhiteboxImpl.throwExceptionIfMethodWasNotFound(WhiteboxImpl.java:1167)
	at org.powermock.reflect.internal.WhiteboxImpl.findMethodOrThrowException(WhiteboxImpl.java:875)
	at org.powermock.reflect.internal.WhiteboxImpl.doInvokeMethod(WhiteboxImpl.java:770)
	at org.powermock.reflect.internal.WhiteboxImpl.invokeMethod(WhiteboxImpl.java:753)
	at org.powermock.reflect.Whitebox.invokeMethod(Whitebox.java:466)
	at org.apache.atlas.repository.store.graph.v1.AtlasEntityStoreV1BulkImportPercentTest.invokeBulkImportProgress(AtlasEntityStoreV1BulkImportPercentTest.java:156)
	at org.apache.atlas.repository.store.graph.v1.AtlasEntityStoreV1BulkImportPercentTest.runWithSize(AtlasEntityStoreV1BulkImportPercentTest.java:151)
	at org.apache.atlas.repository.store.graph.v1.AtlasEntityStoreV1BulkImportPercentTest.percentTest_Equal4(AtlasEntityStoreV1BulkImportPercentTest.java:63)

percentTest_Equal4323(org.apache.atlas.repository.store.graph.v1.AtlasEntityStoreV1BulkImportPercentTest)
 Time elapsed: 0.005 sec  <<< FAILURE!
org.powermock.reflect.exceptions.MethodNotFoundException: No method found with name 'updateImportProgress'
with parameter types: [ org.slf4j.Logger$$EnhancerByMockitoWithCGLIB$$76139b96, java.lang.Integer,
java.lang.Integer, java.lang.Float, java.lang.String ] in class org.apache.atlas.repository.store.graph.v1.AtlasEntityStoreV1.
	at org.powermock.reflect.internal.WhiteboxImpl.throwExceptionIfMethodWasNotFound(WhiteboxImpl.java:1167)
	at org.powermock.reflect.internal.WhiteboxImpl.findMethodOrThrowException(WhiteboxImpl.java:875)
	at org.powermock.reflect.internal.WhiteboxImpl.doInvokeMethod(WhiteboxImpl.java:770)
	at org.powermock.reflect.internal.WhiteboxImpl.invokeMethod(WhiteboxImpl.java:753)
	at org.powermock.reflect.Whitebox.invokeMethod(Whitebox.java:466)
	at org.apache.atlas.repository.store.graph.v1.AtlasEntityStoreV1BulkImportPercentTest.invokeBulkImportProgress(AtlasEntityStoreV1BulkImportPercentTest.java:156)
	at org.apache.atlas.repository.store.graph.v1.AtlasEntityStoreV1BulkImportPercentTest.runWithSize(AtlasEntityStoreV1BulkImportPercentTest.java:151)
	at org.apache.atlas.repository.store.graph.v1.AtlasEntityStoreV1BulkImportPercentTest.percentTest_Equal4323(AtlasEntityStoreV1BulkImportPercentTest.java:134)

Running org.apache.atlas.repository.graph.Gremlin3QueryOptimizerTest
Running org.apache.atlas.repository.graph.ReverseReferenceUpdateSoftDeleteTest
Running org.apache.atlas.repository.graph.GraphBackedRepositoryHardDeleteTest
Tests run: 1, Failures: 0, Errors: 0, Skipped: 0, Time elapsed: 39.676 sec - in org.apache.atlas.services.MetricsServiceTest
Running org.apache.atlas.repository.graph.GraphBackedRepositorySoftDeleteTest
Tests run: 1, Failures: 0, Errors: 0, Skipped: 0, Time elapsed: 44.623 sec - in org.apache.atlas.RepositoryServiceLoadingTest
Tests run: 0, Failures: 0, Errors: 0, Skipped: 0, Time elapsed: 44.939 sec - in org.apache.atlas.discovery.DataSetLineageServiceTest
Tests run: 6, Failures: 0, Errors: 0, Skipped: 0, Time elapsed: 45.448 sec - in org.apache.atlas.services.EntityDiscoveryServiceTest
Running org.apache.atlas.repository.graph.GraphBackedSearchIndexerMockTest
Running org.apache.atlas.repository.graph.GraphBackedMetadataRepositoryTest
Tests run: 10, Failures: 0, Errors: 0, Skipped: 0, Time elapsed: 47.079 sec - in org.apache.atlas.repository.store.graph.v1.AtlasRelationshipDefStoreV1Test
Running org.apache.atlas.repository.graph.GraphHelperMockTest
Tests run: 1, Failures: 0, Errors: 0, Skipped: 0, Time elapsed: 48.885 sec - in org.apache.atlas.repository.store.graph.v1.AtlasEntityDefStoreV1Test
Running org.apache.atlas.repository.impexp.ImportTransformerJSONTest
Running org.apache.atlas.repository.impexp.ImportTransformsTest
Tests run: 0, Failures: 0, Errors: 0, Skipped: 0, Time elapsed: 30.487 sec - in org.apache.atlas.repository.graph.AbstractGremlinQueryOptimizerTest
Running org.apache.atlas.repository.impexp.ExportServiceTest
Tests run: 0, Failures: 0, Errors: 0, Skipped: 0, Time elapsed: 31.399 sec - in org.apache.atlas.repository.graph.TestIntSequence
Tests run: 33, Failures: 0, Errors: 0, Skipped: 0, Time elapsed: 32.939 sec - in org.apache.atlas.repository.graph.Gremlin2QueryOptimizerTest
Running org.apache.atlas.repository.impexp.AtlasImportRequestTest
Running org.apache.atlas.repository.impexp.UniqueListTest
Tests run: 33, Failures: 0, Errors: 0, Skipped: 0, Time elapsed: 31.001 sec - in org.apache.atlas.repository.graph.Gremlin3QueryOptimizerTest
Tests run: 3, Failures: 0, Errors: 0, Skipped: 0, Time elapsed: 67.209 sec - in org.apache.atlas.service.StoreBackedTypeCacheMetadataServiceTest
Running org.apache.atlas.repository.impexp.ZipSinkTest
Running org.apache.atlas.repository.impexp.ZipSourceTest
Tests run: 5, Failures: 0, Errors: 0, Skipped: 0, Time elapsed: 68.807 sec - in org.apache.atlas.repository.store.graph.v1.AtlasRelationshipStoreSoftDeleteV1Test
Tests run: 5, Failures: 0, Errors: 0, Skipped: 0, Time elapsed: 70.668 sec - in org.apache.atlas.repository.store.graph.v1.InverseReferenceUpdateHardDeleteV1Test
Running org.apache.atlas.repository.impexp.TypeAttributeDifferenceTest
Running org.apache.atlas.repository.impexp.ImportTransformerTest
Tests run: 5, Failures: 0, Errors: 0, Skipped: 0, Time elapsed: 74.858 sec - in org.apache.atlas.repository.store.graph.v1.InverseReferenceUpdateSoftDeleteV1Test
Tests run: 5, Failures: 0, Errors: 0, Skipped: 0, Time elapsed: 75.486 sec - in org.apache.atlas.repository.store.graph.v1.AtlasRelationshipStoreHardDeleteV1Test
Running org.apache.atlas.repository.impexp.ImportServiceTest
Running org.apache.atlas.repository.audit.HBaseBasedAuditRepositoryTest
Tests run: 5, Failures: 0, Errors: 0, Skipped: 0, Time elapsed: 44.806 sec - in org.apache.atlas.repository.graph.GraphBackedSearchIndexerTest
Running org.apache.atlas.repository.audit.InMemoryAuditRepositoryTest
Tests run: 2, Failures: 0, Errors: 0, Skipped: 0, Time elapsed: 49.466 sec - in org.apache.atlas.repository.typestore.StoreBackedTypeCacheTest
Running org.apache.atlas.repository.audit.HBaseBasedAuditRepositoryHATest
Tests run: 5, Failures: 0, Errors: 0, Skipped: 0, Time elapsed: 82.295 sec - in org.apache.atlas.query.LineageQueryTest
Tests run: 1, Failures: 0, Errors: 0, Skipped: 0, Time elapsed: 33.387 sec - in org.apache.atlas.repository.impexp.ImportTransformerJSONTest
Tests run: 5, Failures: 0, Errors: 0, Skipped: 0, Time elapsed: 53.218 sec - in org.apache.atlas.repository.typestore.GraphBackedTypeStoreTest
Running org.apache.atlas.TestUtils
Running org.apache.atlas.repository.BaseTest
Tests run: 3, Failures: 0, Errors: 0, Skipped: 0, Time elapsed: 39.024 sec - in org.apache.atlas.repository.graph.GraphBackedSearchIndexerMockTest
Tests run: 2, Failures: 0, Errors: 0, Skipped: 0, Time elapsed: 38.608 sec - in org.apache.atlas.repository.graph.GraphHelperMockTest
Tests run: 3, Failures: 0, Errors: 0, Skipped: 0, Time elapsed: 36.962 sec - in org.apache.atlas.repository.impexp.ImportTransformsTest
Tests run: 5, Failures: 0, Errors: 0, Skipped: 0, Time elapsed: 58.294 sec - in org.apache.atlas.repository.graph.ReverseReferenceUpdateHardDeleteTest
Tests run: 5, Failures: 0, Errors: 0, Skipped: 0, Time elapsed: 58.147 sec - in org.apache.atlas.repository.graph.ReverseReferenceUpdateSoftDeleteTest
Tests run: 6, Failures: 0, Errors: 0, Skipped: 0, Time elapsed: 30.007 sec - in org.apache.atlas.repository.impexp.AtlasImportRequestTest
Tests run: 4, Failures: 0, Errors: 0, Skipped: 0, Time elapsed: 31.982 sec - in org.apache.atlas.repository.impexp.UniqueListTest
Tests run: 8, Failures: 0, Errors: 0, Skipped: 0, Time elapsed: 32.319 sec - in org.apache.atlas.repository.impexp.ZipSinkTest
Tests run: 6, Failures: 0, Errors: 0, Skipped: 0, Time elapsed: 31.839 sec - in org.apache.atlas.repository.impexp.ZipSourceTest
Tests run: 8, Failures: 0, Errors: 0, Skipped: 0, Time elapsed: 29.293 sec - in org.apache.atlas.repository.impexp.ImportTransformerTest
Tests run: 6, Failures: 0, Errors: 0, Skipped: 0, Time elapsed: 30.648 sec - in org.apache.atlas.repository.impexp.TypeAttributeDifferenceTest
Tests run: 14, Failures: 0, Errors: 0, Skipped: 0, Time elapsed: 102.177 sec - in org.apache.atlas.repository.store.graph.v1.AtlasEntityStoreV1Test
Tests run: 14, Failures: 0, Errors: 0, Skipped: 0, Time elapsed: 68.497 sec - in org.apache.atlas.repository.graph.GraphHelperTest
Tests run: 11, Failures: 0, Errors: 0, Skipped: 0, Time elapsed: 106.778 sec - in org.apache.atlas.repository.store.graph.v1.HardDeleteHandlerV1Test
Tests run: 3, Failures: 0, Errors: 0, Skipped: 0, Time elapsed: 27.864 sec - in org.apache.atlas.repository.audit.InMemoryAuditRepositoryTest
Tests run: 11, Failures: 0, Errors: 0, Skipped: 0, Time elapsed: 108.225 sec - in org.apache.atlas.repository.store.graph.v1.SoftDeleteHandlerV1Test
Tests run: 2, Failures: 0, Errors: 0, Skipped: 0, Time elapsed: 26.425 sec - in org.apache.atlas.repository.audit.HBaseBasedAuditRepositoryHATest
Tests run: 21, Failures: 0, Errors: 0, Skipped: 0, Time elapsed: 110.064 sec - in org.apache.atlas.query.GremlinTest
Tests run: 0, Failures: 0, Errors: 0, Skipped: 0, Time elapsed: 25.525 sec - in org.apache.atlas.repository.BaseTest
Tests run: 0, Failures: 0, Errors: 0, Skipped: 0, Time elapsed: 25.672 sec - in org.apache.atlas.TestUtils
Tests run: 23, Failures: 0, Errors: 0, Skipped: 0, Time elapsed: 110.529 sec - in org.apache.atlas.lineage.EntityLineageServiceTest
Tests run: 26, Failures: 0, Errors: 0, Skipped: 0, Time elapsed: 114.557 sec - in org.apache.atlas.service.DefaultMetadataServiceTest
Tests run: 21, Failures: 0, Errors: 0, Skipped: 0, Time elapsed: 78.76 sec - in org.apache.atlas.repository.graph.GraphBackedRepositoryHardDeleteTest
Tests run: 17, Failures: 0, Errors: 0, Skipped: 0, Time elapsed: 85.181 sec - in org.apache.atlas.repository.store.graph.AtlasTypeDefGraphStoreTest
Tests run: 30, Failures: 0, Errors: 0, Skipped: 0, Time elapsed: 70.073 sec - in org.apache.atlas.repository.graph.GraphBackedMetadataRepositoryTest
Tests run: 21, Failures: 0, Errors: 0, Skipped: 0, Time elapsed: 76.887 sec - in org.apache.atlas.repository.graph.GraphBackedRepositorySoftDeleteTest
Tests run: 10, Failures: 0, Errors: 0, Skipped: 0, Time elapsed: 62.053 sec - in org.apache.atlas.repository.impexp.ExportServiceTest
Tests run: 4, Failures: 0, Errors: 0, Skipped: 0, Time elapsed: 53.865 sec - in org.apache.atlas.repository.audit.HBaseBasedAuditRepositoryTest
Tests run: 8, Failures: 1, Errors: 0, Skipped: 0, Time elapsed: 60.121 sec <<< FAILURE!
- in org.apache.atlas.repository.impexp.ImportServiceTest
importCTAS(org.apache.atlas.repository.impexp.ImportServiceTest)  Time elapsed: 4.836 sec
 <<< FAILURE!
org.apache.atlas.exception.AtlasBaseException: Given instance is invalid/not found: Could
not find entities in the repository with guids: [73cb606c-6846-4718-a859-40c9c17e0b32]
	at org.apache.atlas.repository.converters.AtlasInstanceConverter.toAtlasBaseException(AtlasInstanceConverter.java:213)
	at org.apache.atlas.repository.converters.AtlasInstanceConverter.getITypedReferenceable(AtlasInstanceConverter.java:115)
	at org.apache.atlas.repository.store.graph.v1.AtlasEntityChangeNotifier.toITypedReferenceable(AtlasEntityChangeNotifier.java:184)
	at org.apache.atlas.repository.store.graph.v1.AtlasEntityChangeNotifier.notifyListeners(AtlasEntityChangeNotifier.java:158)
	at org.apache.atlas.repository.store.graph.v1.AtlasEntityChangeNotifier.onEntitiesMutated(AtlasEntityChangeNotifier.java:84)
	at org.apache.atlas.repository.store.graph.v1.AtlasEntityStoreV1.createOrUpdate(AtlasEntityStoreV1.java:165)
	at org.apache.atlas.repository.store.graph.v1.AtlasEntityStoreV1.createOrUpdateForImport(AtlasEntityStoreV1.java:179)
	at org.apache.atlas.GraphTransactionInterceptor.invoke(GraphTransactionInterceptor.java:60)
	at org.apache.atlas.repository.store.graph.v1.BulkImporterImpl.bulkImport(BulkImporterImpl.java:81)
	at org.apache.atlas.repository.impexp.ImportService.processEntities(ImportService.java:157)
	at org.apache.atlas.repository.impexp.ImportService.run(ImportService.java:81)
	at org.apache.atlas.repository.impexp.ImportService.run(ImportService.java:60)
	at org.apache.atlas.repository.impexp.ZipFileResourceTestUtils.runImportWithNoParameters(ZipFileResourceTestUtils.java:178)
	at org.apache.atlas.repository.impexp.ImportServiceTest.importCTAS(ImportServiceTest.java:160)

Tests run: 338, Failures: 0, Errors: 0, Skipped: 0, Time elapsed: 261.003 sec - in org.apache.atlas.discovery.GraphBackedDiscoveryServiceTest
Tests run: 2, Failures: 0, Errors: 0, Skipped: 0, Time elapsed: 256.479 sec - in org.apache.atlas.repository.graph.GraphRepoMapperScaleTest

Results :

Failed tests: 
  ImportServiceTest.importCTAS:160 » AtlasBase Given instance is invalid/not fou...
  AtlasEntityStoreV1BulkImportPercentTest.bulkImportPercentageTestLessThan100:86->runWithSize:151->invokeBulkImportProgress:156
» MethodNotFound
  AtlasEntityStoreV1BulkImportPercentTest.percentTest_Equal10:69->runWithSize:151->invokeBulkImportProgress:156
» MethodNotFound
  AtlasEntityStoreV1BulkImportPercentTest.percentTest_Equal1001:125->runWithSize:151->invokeBulkImportProgress:156
» MethodNotFound
  AtlasEntityStoreV1BulkImportPercentTest.percentTest_Equal101:96->runWithSize:151->invokeBulkImportProgress:156
» MethodNotFound
  AtlasEntityStoreV1BulkImportPercentTest.percentTest_Equal200:106->runWithSize:151->invokeBulkImportProgress:156
» MethodNotFound
  AtlasEntityStoreV1BulkImportPercentTest.percentTest_Equal202:116->runWithSize:151->invokeBulkImportProgress:156
» MethodNotFound
  AtlasEntityStoreV1BulkImportPercentTest.percentTest_Equal269:143->runWithSize:151->invokeBulkImportProgress:156
» MethodNotFound
  AtlasEntityStoreV1BulkImportPercentTest.percentTest_Equal4:63->runWithSize:151->invokeBulkImportProgress:156
» MethodNotFound
  AtlasEntityStoreV1BulkImportPercentTest.percentTest_Equal4323:134->runWithSize:151->invokeBulkImportProgress:156
» MethodNotFound

Tests run: 820, Failures: 10, Errors: 0, Skipped: 0

[INFO] ------------------------------------------------------------------------
[INFO] Reactor Summary:
[INFO] 
[INFO] Apache Atlas Server Build Tools .................... SUCCESS [  0.889 s]
[INFO] apache-atlas ....................................... SUCCESS [  4.520 s]
[INFO] Apache Atlas Integration ........................... SUCCESS [ 34.232 s]
[INFO] Apache Atlas Common ................................ SUCCESS [ 15.230 s]
[INFO] Apache Atlas Typesystem ............................ SUCCESS [01:09 min]
[INFO] Apache Atlas Client ................................ SUCCESS [ 18.598 s]
[INFO] Apache Atlas Server API ............................ SUCCESS [  9.422 s]
[INFO] Apache Atlas Notification .......................... SUCCESS [ 23.930 s]
[INFO] Apache Atlas Graph Database Projects ............... SUCCESS [  0.574 s]
[INFO] Apache Atlas Graph Database API .................... SUCCESS [  7.286 s]
[INFO] Graph Database Common Code ......................... SUCCESS [  7.737 s]
[INFO] Apache Atlas Titan 1.0.0 GraphDB Impl .............. SUCCESS [ 31.221 s]
[INFO] Shaded version of Apache hbase client .............. SUCCESS [  8.525 s]
[INFO] Apache Atlas Titan 0.5.4 Graph DB Impl ............. SUCCESS [01:24 min]
[INFO] Apache Atlas Graph Database Implementation Dependencies SUCCESS [  0.707 s]
[INFO] Shaded version of Apache hbase server .............. SUCCESS [ 23.330 s]
[INFO] Apache Atlas Repository ............................ FAILURE [05:51 min]
[INFO] Apache Atlas Authorization ......................... SKIPPED
[INFO] Apache Atlas Business Catalog ...................... SKIPPED
[INFO] Apache Atlas UI .................................... SKIPPED
[INFO] Apache Atlas Web Application ....................... SKIPPED
[INFO] Apache Atlas Documentation ......................... SKIPPED
[INFO] Apache Atlas FileSystem Model ...................... SKIPPED
[INFO] Apache Atlas Plugin Classloader .................... SKIPPED
[INFO] Apache Atlas Hive Bridge Shim ...................... SKIPPED
[INFO] Apache Atlas Hive Bridge ........................... SKIPPED
[INFO] Apache Atlas Falcon Bridge Shim .................... SKIPPED
[INFO] Apache Atlas Falcon Bridge ......................... SKIPPED
[INFO] Apache Atlas Sqoop Bridge Shim ..................... SKIPPED
[INFO] Apache Atlas Sqoop Bridge .......................... SKIPPED
[INFO] Apache Atlas Storm Bridge Shim ..................... SKIPPED
[INFO] Apache Atlas Storm Bridge .......................... SKIPPED
[INFO] Apache Atlas Distribution .......................... SKIPPED
[INFO] ------------------------------------------------------------------------
[INFO] BUILD FAILURE
[INFO] ------------------------------------------------------------------------
[INFO] Total time: 11:34 min
[INFO] Finished at: 2017-09-15T16:37:52Z
[INFO] Final Memory: 154M/1771M
[INFO] ------------------------------------------------------------------------
[ERROR] Failed to execute goal org.apache.maven.plugins:maven-surefire-plugin:2.18.1:test
(default-test) on project atlas-repository: There are test failures.
[ERROR] 
[ERROR] Please refer to <https://builds.apache.org/job/Atlas-master-UnitTests/ws/repository/target/surefire-reports>
for the individual test results.
[ERROR] -> [Help 1]
[ERROR] 
[ERROR] To see the full stack trace of the errors, re-run Maven with the -e switch.
[ERROR] Re-run Maven using the -X switch to enable full debug logging.
[ERROR] 
[ERROR] For more information about the errors and possible solutions, please read the following
articles:
[ERROR] [Help 1] http://cwiki.apache.org/confluence/display/MAVEN/MojoFailureException
[ERROR] 
[ERROR] After correcting the problems, you can resume the build with the command
[ERROR]   mvn <goals> -rf :atlas-repository
Build step 'Execute shell' marked build as failure
[CHECKSTYLE] Collecting checkstyle analysis files...
[CHECKSTYLE] Searching for all files in <https://builds.apache.org/job/Atlas-master-UnitTests/ws/>
that match the pattern **/target/checkstyle-result.xml
[CHECKSTYLE] Parsing 15 files in <https://builds.apache.org/job/Atlas-master-UnitTests/ws/>
[CHECKSTYLE] Successfully parsed file <https://builds.apache.org/job/Atlas-master-UnitTests/ws/client/target/checkstyle-result.xml>
with 1637 unique warnings and 0 duplicates.
[CHECKSTYLE] Successfully parsed file <https://builds.apache.org/job/Atlas-master-UnitTests/ws/common/target/checkstyle-result.xml>
with 2849 unique warnings and 0 duplicates.
[CHECKSTYLE] Successfully parsed file <https://builds.apache.org/job/Atlas-master-UnitTests/ws/graphdb/api/target/checkstyle-result.xml>
with 3118 unique warnings and 0 duplicates.
[CHECKSTYLE] Successfully parsed file <https://builds.apache.org/job/Atlas-master-UnitTests/ws/graphdb/common/target/checkstyle-result.xml>
with 3305 unique warnings and 0 duplicates.
[CHECKSTYLE] Successfully parsed file <https://builds.apache.org/job/Atlas-master-UnitTests/ws/graphdb/graphdb-impls/target/checkstyle-result.xml>
with 3305 unique warnings and 0 duplicates.
[CHECKSTYLE] Successfully parsed file <https://builds.apache.org/job/Atlas-master-UnitTests/ws/graphdb/target/checkstyle-result.xml>
with 3305 unique warnings and 0 duplicates.
[CHECKSTYLE] Successfully parsed file <https://builds.apache.org/job/Atlas-master-UnitTests/ws/graphdb/titan0/target/checkstyle-result.xml>
with 5690 unique warnings and 0 duplicates.
[CHECKSTYLE] Successfully parsed file <https://builds.apache.org/job/Atlas-master-UnitTests/ws/graphdb/titan1/target/checkstyle-result.xml>
with 6638 unique warnings and 0 duplicates.
[CHECKSTYLE] Successfully parsed file <https://builds.apache.org/job/Atlas-master-UnitTests/ws/intg/target/checkstyle-result.xml>
with 14445 unique warnings and 0 duplicates.
[CHECKSTYLE] Successfully parsed file <https://builds.apache.org/job/Atlas-master-UnitTests/ws/notification/target/checkstyle-result.xml>
with 15655 unique warnings and 0 duplicates.
[CHECKSTYLE] Successfully parsed file <https://builds.apache.org/job/Atlas-master-UnitTests/ws/server-api/target/checkstyle-result.xml>
with 16034 unique warnings and 0 duplicates.
[CHECKSTYLE] Successfully parsed file <https://builds.apache.org/job/Atlas-master-UnitTests/ws/shaded/hbase-client-shaded/target/checkstyle-result.xml>
with 16034 unique warnings and 0 duplicates.
[CHECKSTYLE] Successfully parsed file <https://builds.apache.org/job/Atlas-master-UnitTests/ws/shaded/hbase-server-shaded/target/checkstyle-result.xml>
with 16034 unique warnings and 0 duplicates.
[CHECKSTYLE] Successfully parsed file <https://builds.apache.org/job/Atlas-master-UnitTests/ws/target/checkstyle-result.xml>
with 16034 unique warnings and 0 duplicates.
[CHECKSTYLE] Successfully parsed file <https://builds.apache.org/job/Atlas-master-UnitTests/ws/typesystem/target/checkstyle-result.xml>
with 20252 unique warnings and 0 duplicates.
<Git Blamer> Using GitBlamer to create author and commit information for all warnings.
<Git Blamer> GIT_COMMIT=c623835f5376bdb04797ba9cb886da70fbef0f8c, workspace=<https://builds.apache.org/job/Atlas-master-UnitTests/ws/>
 > git rev-parse c623835f5376bdb04797ba9cb886da70fbef0f8c^{commit} # timeout=10
<Git Blamer> Skipping file <https://builds.apache.org/job/Atlas-master-UnitTests/ws/graphdb/titan1/src/main/java/org/apache/atlas/repository/graphdb/titan1/graphson/AtlasGraphSONMode.java,>
no result found.
[CHECKSTYLE] Computing warning deltas based on reference build #59
[FINDBUGS] Collecting findbugs analysis files...
[FINDBUGS] Searching for all files in <https://builds.apache.org/job/Atlas-master-UnitTests/ws/>
that match the pattern **/target/findbugs.xml
[FINDBUGS] Parsing 9 files in <https://builds.apache.org/job/Atlas-master-UnitTests/ws/>
[FINDBUGS] Successfully parsed file <https://builds.apache.org/job/Atlas-master-UnitTests/ws/client/target/findbugs.xml>
with 0 unique warnings and 0 duplicates.
[FINDBUGS] Successfully parsed file <https://builds.apache.org/job/Atlas-master-UnitTests/ws/common/target/findbugs.xml>
with 0 unique warnings and 0 duplicates.
[FINDBUGS] Successfully parsed file <https://builds.apache.org/job/Atlas-master-UnitTests/ws/graphdb/api/target/findbugs.xml>
with 0 unique warnings and 0 duplicates.
[FINDBUGS] Successfully parsed file <https://builds.apache.org/job/Atlas-master-UnitTests/ws/graphdb/common/target/findbugs.xml>
with 0 unique warnings and 0 duplicates.
[FINDBUGS] Successfully parsed file <https://builds.apache.org/job/Atlas-master-UnitTests/ws/graphdb/titan0/target/findbugs.xml>
with 0 unique warnings and 0 duplicates.
[FINDBUGS] Successfully parsed file <https://builds.apache.org/job/Atlas-master-UnitTests/ws/intg/target/findbugs.xml>
with 0 unique warnings and 0 duplicates.
[FINDBUGS] Successfully parsed file <https://builds.apache.org/job/Atlas-master-UnitTests/ws/notification/target/findbugs.xml>
with 0 unique warnings and 0 duplicates.
[FINDBUGS] Successfully parsed file <https://builds.apache.org/job/Atlas-master-UnitTests/ws/server-api/target/findbugs.xml>
with 0 unique warnings and 0 duplicates.
[FINDBUGS] Successfully parsed file <https://builds.apache.org/job/Atlas-master-UnitTests/ws/typesystem/target/findbugs.xml>
with 0 unique warnings and 0 duplicates.
<Git Blamer> Using GitBlamer to create author and commit information for all warnings.
<Git Blamer> GIT_COMMIT=c623835f5376bdb04797ba9cb886da70fbef0f8c, workspace=<https://builds.apache.org/job/Atlas-master-UnitTests/ws/>
[FINDBUGS] Computing warning deltas based on reference build #59
Archiving artifacts
TestNG Reports Processing: START
Looking for TestNG results report in workspace using pattern: **/target/surefire-reports/testng-results.xml,**/target/failsafe-reports/testng-results.xml
Saving reports...
Processing '/x1/jenkins/jenkins-home/jobs/Atlas-master-UnitTests/builds/78/testng/testng-results-1.xml'
Processing '/x1/jenkins/jenkins-home/jobs/Atlas-master-UnitTests/builds/78/testng/testng-results-2.xml'
Processing '/x1/jenkins/jenkins-home/jobs/Atlas-master-UnitTests/builds/78/testng/testng-results-3.xml'
Processing '/x1/jenkins/jenkins-home/jobs/Atlas-master-UnitTests/builds/78/testng/testng-results-4.xml'
Processing '/x1/jenkins/jenkins-home/jobs/Atlas-master-UnitTests/builds/78/testng/testng-results-5.xml'
Processing '/x1/jenkins/jenkins-home/jobs/Atlas-master-UnitTests/builds/78/testng/testng-results-6.xml'
Processing '/x1/jenkins/jenkins-home/jobs/Atlas-master-UnitTests/builds/78/testng/testng-results.xml'
TestNG Reports Processing: FINISH

Mime
View raw message