atlas-dev mailing list archives

Site index · List index
Message view « Date » · « Thread »
Top « Date » · « Thread »
From Apache Jenkins Server <jenk...@builds.apache.org>
Subject Build failed in Jenkins: Atlas-master-UnitTests #108
Date Sat, 30 Sep 2017 02:48:22 GMT
See <https://builds.apache.org/job/Atlas-master-UnitTests/108/display/redirect?page=changes>

Changes:

[apoorvnaik] ATLAS-2184: IS_NULL, NOT_NULL operator support (#2)

------------------------------------------
[...truncated 288.76 KB...]
Running org.apache.atlas.utils.ObjectUpdateSynchronizerTest
Running org.apache.atlas.repository.store.graph.v1.InverseReferenceUpdateSoftDeleteV1Test
Running org.apache.atlas.repository.store.graph.v1.InverseReferenceUpdateV1Test
Running org.apache.atlas.repository.store.graph.v1.AtlasRelationshipStoreHardDeleteV1Test
Running org.apache.atlas.repository.store.graph.v1.AtlasRelationshipDefStoreV1Test
Running org.apache.atlas.discovery.GraphBackedDiscoveryServiceTest
Running org.apache.atlas.repository.store.graph.v1.HardDeleteHandlerV1Test
Running org.apache.atlas.repository.store.graph.v1.AtlasRelationshipStoreSoftDeleteV1Test
Running org.apache.atlas.repository.store.graph.v1.InverseReferenceUpdateHardDeleteV1Test
Running org.apache.atlas.repository.store.graph.v1.SoftDeleteHandlerV1Test
Running org.apache.atlas.repository.store.graph.v1.AtlasEntityStoreV1Test
Tests run: 0, Failures: 0, Errors: 0, Skipped: 0, Time elapsed: 38.645 sec - in org.apache.atlas.repository.store.graph.v1.AtlasDeleteHandlerV1Test
Tests run: 0, Failures: 0, Errors: 0, Skipped: 0, Time elapsed: 39.148 sec - in org.apache.atlas.BaseRepositoryTest
Running org.apache.atlas.repository.store.graph.AtlasTypeDefGraphStoreTest
Running org.apache.atlas.repository.typestore.GraphBackedTypeStoreTest
Tests run: 1, Failures: 0, Errors: 0, Skipped: 0, Time elapsed: 42.61 sec - in org.apache.atlas.query.LexerTest
Tests run: 0, Failures: 0, Errors: 0, Skipped: 0, Time elapsed: 42.828 sec - in org.apache.atlas.repository.store.graph.v1.AtlasRelationshipStoreV1Test
Tests run: 0, Failures: 0, Errors: 0, Skipped: 0, Time elapsed: 42.964 sec - in org.apache.atlas.repository.store.graph.v1.InverseReferenceUpdateV1Test
Running org.apache.atlas.repository.typestore.StoreBackedTypeCacheTest
Running org.apache.atlas.repository.graph.AbstractGremlinQueryOptimizerTest
Tests run: 19, Failures: 0, Errors: 0, Skipped: 0, Time elapsed: 44.828 sec - in org.apache.atlas.query.ExpressionTest
Tests run: 0, Failures: 0, Errors: 0, Skipped: 0, Time elapsed: 45.207 sec - in org.apache.atlas.TestModules
Running org.apache.atlas.repository.graph.Gremlin2QueryOptimizerTest
Tests run: 9, Failures: 0, Errors: 0, Skipped: 0, Time elapsed: 45.738 sec - in org.apache.atlas.repository.store.graph.v1.AtlasEntityStoreV1BulkImportPercentTest
Tests run: 14, Failures: 0, Errors: 0, Skipped: 0, Time elapsed: 47.257 sec - in org.apache.atlas.query.ParserTest
Tests run: 1, Failures: 0, Errors: 0, Skipped: 0, Time elapsed: 46.905 sec - in org.apache.atlas.services.MetricsServiceTest
Running org.apache.atlas.repository.graph.TestIntSequence
Running org.apache.atlas.repository.graph.GraphBackedSearchIndexerTest
Running org.apache.atlas.repository.graph.ReverseReferenceUpdateHardDeleteTest
Running org.apache.atlas.repository.graph.GraphRepoMapperScaleTest
Tests run: 5, Failures: 0, Errors: 0, Skipped: 0, Time elapsed: 48.316 sec - in org.apache.atlas.util.CompiledQueryCacheKeyTest
Tests run: 5, Failures: 0, Errors: 0, Skipped: 0, Time elapsed: 50.081 sec - in org.apache.atlas.query.QueryProcessorTest
Tests run: 9, Failures: 0, Errors: 0, Skipped: 0, Time elapsed: 48.532 sec - in org.apache.atlas.utils.ObjectUpdateSynchronizerTest
Tests run: 0, Failures: 0, Errors: 0, Skipped: 0, Time elapsed: 49.52 sec - in org.apache.atlas.query.BaseGremlinTest
Running org.apache.atlas.repository.graph.GraphHelperTest
Running org.apache.atlas.repository.graph.Gremlin3QueryOptimizerTest
Running org.apache.atlas.repository.graph.ReverseReferenceUpdateSoftDeleteTest
Running org.apache.atlas.repository.graph.GraphBackedRepositoryHardDeleteTest
Running org.apache.atlas.repository.graph.GraphBackedRepositorySoftDeleteTest
Tests run: 0, Failures: 0, Errors: 0, Skipped: 0, Time elapsed: 54.919 sec - in org.apache.atlas.discovery.DataSetLineageServiceTest
Tests run: 1, Failures: 0, Errors: 0, Skipped: 0, Time elapsed: 56.383 sec - in org.apache.atlas.RepositoryServiceLoadingTest
Running org.apache.atlas.repository.graph.GraphBackedSearchIndexerMockTest
Running org.apache.atlas.repository.graph.GraphHelperMockTest
Tests run: 6, Failures: 0, Errors: 0, Skipped: 0, Time elapsed: 60.938 sec - in org.apache.atlas.discovery.EntityDiscoveryServiceTest
Running org.apache.atlas.repository.graph.GraphBackedMetadataRepositoryTest
Tests run: 10, Failures: 0, Errors: 0, Skipped: 0, Time elapsed: 64.518 sec - in org.apache.atlas.repository.store.graph.v1.AtlasRelationshipDefStoreV1Test
Running org.apache.atlas.repository.userprofile.UserProfileServiceTest
Tests run: 1, Failures: 0, Errors: 0, Skipped: 0, Time elapsed: 70.476 sec - in org.apache.atlas.repository.store.graph.v1.AtlasEntityDefStoreV1Test
Running org.apache.atlas.repository.impexp.ImportTransformerJSONTest
Tests run: 0, Failures: 0, Errors: 0, Skipped: 0, Time elapsed: 40.061 sec - in org.apache.atlas.repository.graph.AbstractGremlinQueryOptimizerTest
Running org.apache.atlas.repository.impexp.ImportTransformsTest
Tests run: 0, Failures: 0, Errors: 0, Skipped: 0, Time elapsed: 39.955 sec - in org.apache.atlas.repository.graph.TestIntSequence
Running org.apache.atlas.repository.impexp.ExportServiceTest
Tests run: 33, Failures: 0, Errors: 0, Skipped: 0, Time elapsed: 46.566 sec - in org.apache.atlas.repository.graph.Gremlin2QueryOptimizerTest
Tests run: 3, Failures: 0, Errors: 0, Skipped: 0, Time elapsed: 93.631 sec - in org.apache.atlas.service.StoreBackedTypeCacheMetadataServiceTest
Running org.apache.atlas.repository.impexp.UniqueListTest
Tests run: 5, Failures: 0, Errors: 0, Skipped: 0, Time elapsed: 94.487 sec - in org.apache.atlas.repository.store.graph.v1.InverseReferenceUpdateSoftDeleteV1Test
Running org.apache.atlas.repository.impexp.AtlasImportRequestTest
Running org.apache.atlas.repository.impexp.ZipSinkTest
Tests run: 3, Failures: 0, Errors: 0, Skipped: 0, Time elapsed: 45.726 sec - in org.apache.atlas.repository.graph.GraphBackedSearchIndexerMockTest
Tests run: 33, Failures: 0, Errors: 0, Skipped: 0, Time elapsed: 51.631 sec - in org.apache.atlas.repository.graph.Gremlin3QueryOptimizerTest
Running org.apache.atlas.repository.impexp.ZipSourceTest
Running org.apache.atlas.repository.impexp.TypeAttributeDifferenceTest
Tests run: 5, Failures: 0, Errors: 0, Skipped: 0, Time elapsed: 105.192 sec - in org.apache.atlas.query.LineageQueryTest
Tests run: 5, Failures: 0, Errors: 0, Skipped: 0, Time elapsed: 104.541 sec - in org.apache.atlas.repository.store.graph.v1.InverseReferenceUpdateHardDeleteV1Test
Tests run: 2, Failures: 0, Errors: 0, Skipped: 0, Time elapsed: 48.304 sec - in org.apache.atlas.repository.graph.GraphHelperMockTest
Tests run: 5, Failures: 0, Errors: 0, Skipped: 0, Time elapsed: 104.945 sec - in org.apache.atlas.repository.store.graph.v1.AtlasRelationshipStoreHardDeleteV1Test
Tests run: 5, Failures: 0, Errors: 0, Skipped: 0, Time elapsed: 58.923 sec - in org.apache.atlas.repository.graph.GraphBackedSearchIndexerTest
Running org.apache.atlas.repository.impexp.ImportTransformerTest
Running org.apache.atlas.repository.impexp.ImportServiceTest
Running org.apache.atlas.repository.audit.HBaseBasedAuditRepositoryTest
Tests run: 5, Failures: 0, Errors: 0, Skipped: 0, Time elapsed: 106.964 sec - in org.apache.atlas.repository.store.graph.v1.AtlasRelationshipStoreSoftDeleteV1Test
Running org.apache.atlas.repository.audit.InMemoryAuditRepositoryTest
Running org.apache.atlas.repository.audit.HBaseBasedAuditRepositoryHATest
Running org.apache.atlas.repository.BaseTest
Tests run: 5, Failures: 0, Errors: 0, Skipped: 0, Time elapsed: 70.558 sec - in org.apache.atlas.repository.typestore.GraphBackedTypeStoreTest
Running org.apache.atlas.TestUtils
Tests run: 2, Failures: 0, Errors: 0, Skipped: 0, Time elapsed: 71.884 sec - in org.apache.atlas.repository.typestore.StoreBackedTypeCacheTest
Tests run: 1, Failures: 0, Errors: 0, Skipped: 0, Time elapsed: 44.042 sec - in org.apache.atlas.repository.impexp.ImportTransformerJSONTest
Tests run: 5, Failures: 0, Errors: 0, Skipped: 0, Time elapsed: 74.528 sec - in org.apache.atlas.repository.graph.ReverseReferenceUpdateHardDeleteTest
Tests run: 3, Failures: 0, Errors: 0, Skipped: 0, Time elapsed: 40.312 sec - in org.apache.atlas.repository.impexp.ImportTransformsTest
Tests run: 5, Failures: 0, Errors: 0, Skipped: 0, Time elapsed: 76.541 sec - in org.apache.atlas.repository.graph.ReverseReferenceUpdateSoftDeleteTest
Tests run: 4, Failures: 0, Errors: 0, Skipped: 0, Time elapsed: 43.946 sec - in org.apache.atlas.repository.impexp.UniqueListTest
Tests run: 8, Failures: 0, Errors: 0, Skipped: 0, Time elapsed: 42.748 sec - in org.apache.atlas.repository.impexp.ZipSinkTest
Tests run: 14, Failures: 0, Errors: 0, Skipped: 0, Time elapsed: 141.321 sec - in org.apache.atlas.repository.store.graph.v1.AtlasEntityStoreV1Test
Tests run: 6, Failures: 0, Errors: 0, Skipped: 0, Time elapsed: 39.205 sec - in org.apache.atlas.repository.impexp.TypeAttributeDifferenceTest
Tests run: 6, Failures: 0, Errors: 0, Skipped: 0, Time elapsed: 48.001 sec - in org.apache.atlas.repository.impexp.AtlasImportRequestTest
Tests run: 6, Failures: 0, Errors: 0, Skipped: 0, Time elapsed: 41.821 sec - in org.apache.atlas.repository.impexp.ZipSourceTest
Tests run: 3, Failures: 0, Errors: 0, Skipped: 0, Time elapsed: 38.183 sec - in org.apache.atlas.repository.audit.InMemoryAuditRepositoryTest
Tests run: 2, Failures: 0, Errors: 0, Skipped: 0, Time elapsed: 38.286 sec - in org.apache.atlas.repository.audit.HBaseBasedAuditRepositoryHATest
Tests run: 0, Failures: 0, Errors: 0, Skipped: 0, Time elapsed: 39.361 sec - in org.apache.atlas.repository.BaseTest
Tests run: 0, Failures: 0, Errors: 0, Skipped: 0, Time elapsed: 36.415 sec - in org.apache.atlas.TestUtils
Tests run: 8, Failures: 0, Errors: 0, Skipped: 0, Time elapsed: 44.001 sec - in org.apache.atlas.repository.impexp.ImportTransformerTest
Tests run: 14, Failures: 0, Errors: 0, Skipped: 0, Time elapsed: 101.864 sec - in org.apache.atlas.repository.graph.GraphHelperTest
Tests run: 11, Failures: 0, Errors: 0, Skipped: 0, Time elapsed: 151.972 sec - in org.apache.atlas.repository.store.graph.v1.HardDeleteHandlerV1Test
Tests run: 23, Failures: 0, Errors: 0, Skipped: 0, Time elapsed: 154.675 sec - in org.apache.atlas.lineage.EntityLineageServiceTest
Tests run: 21, Failures: 0, Errors: 0, Skipped: 0, Time elapsed: 157.325 sec - in org.apache.atlas.query.GremlinTest
Tests run: 27, Failures: 0, Errors: 0, Skipped: 0, Time elapsed: 158.568 sec - in org.apache.atlas.service.DefaultMetadataServiceTest
Tests run: 11, Failures: 0, Errors: 0, Skipped: 0, Time elapsed: 156.832 sec - in org.apache.atlas.repository.store.graph.v1.SoftDeleteHandlerV1Test
Tests run: 11, Failures: 0, Errors: 0, Skipped: 0, Time elapsed: 93.854 sec - in org.apache.atlas.repository.userprofile.UserProfileServiceTest
Tests run: 21, Failures: 0, Errors: 0, Skipped: 0, Time elapsed: 112.258 sec - in org.apache.atlas.repository.graph.GraphBackedRepositoryHardDeleteTest
Tests run: 17, Failures: 0, Errors: 0, Skipped: 0, Time elapsed: 123.441 sec - in org.apache.atlas.repository.store.graph.AtlasTypeDefGraphStoreTest
Tests run: 30, Failures: 0, Errors: 0, Skipped: 0, Time elapsed: 100.331 sec - in org.apache.atlas.repository.graph.GraphBackedMetadataRepositoryTest
Tests run: 21, Failures: 0, Errors: 0, Skipped: 0, Time elapsed: 115.075 sec - in org.apache.atlas.repository.graph.GraphBackedRepositorySoftDeleteTest
Tests run: 10, Failures: 0, Errors: 0, Skipped: 0, Time elapsed: 85.044 sec - in org.apache.atlas.repository.impexp.ExportServiceTest
Tests run: 4, Failures: 0, Errors: 0, Skipped: 0, Time elapsed: 70.638 sec - in org.apache.atlas.repository.audit.HBaseBasedAuditRepositoryTest
Tests run: 9, Failures: 1, Errors: 0, Skipped: 0, Time elapsed: 79.068 sec <<< FAILURE!
- in org.apache.atlas.repository.impexp.ImportServiceTest
importCTAS(org.apache.atlas.repository.impexp.ImportServiceTest)  Time elapsed: 6.556 sec
 <<< FAILURE!
org.apache.atlas.exception.AtlasBaseException: Given instance is invalid/not found: Could
not find entities in the repository with guids: [73cb606c-6846-4718-a859-40c9c17e0b32]
	at org.apache.atlas.repository.converters.AtlasInstanceConverter.toAtlasBaseException(AtlasInstanceConverter.java:213)
	at org.apache.atlas.repository.converters.AtlasInstanceConverter.getITypedReferenceable(AtlasInstanceConverter.java:115)
	at org.apache.atlas.repository.store.graph.v1.AtlasEntityChangeNotifier.toITypedReferenceable(AtlasEntityChangeNotifier.java:184)
	at org.apache.atlas.repository.store.graph.v1.AtlasEntityChangeNotifier.notifyListeners(AtlasEntityChangeNotifier.java:158)
	at org.apache.atlas.repository.store.graph.v1.AtlasEntityChangeNotifier.onEntitiesMutated(AtlasEntityChangeNotifier.java:84)
	at org.apache.atlas.repository.store.graph.v1.AtlasEntityStoreV1.createOrUpdate(AtlasEntityStoreV1.java:165)
	at org.apache.atlas.repository.store.graph.v1.AtlasEntityStoreV1.createOrUpdateForImport(AtlasEntityStoreV1.java:179)
	at org.apache.atlas.GraphTransactionInterceptor.invoke(GraphTransactionInterceptor.java:60)
	at org.apache.atlas.repository.store.graph.v1.BulkImporterImpl.bulkImport(BulkImporterImpl.java:82)
	at org.apache.atlas.repository.impexp.ImportService.processEntities(ImportService.java:161)
	at org.apache.atlas.repository.impexp.ImportService.run(ImportService.java:82)
	at org.apache.atlas.repository.impexp.ImportService.run(ImportService.java:61)
	at org.apache.atlas.repository.impexp.ZipFileResourceTestUtils.runImportWithNoParameters(ZipFileResourceTestUtils.java:215)
	at org.apache.atlas.repository.impexp.ImportServiceTest.importCTAS(ImportServiceTest.java:168)

Tests run: 338, Failures: 0, Errors: 0, Skipped: 0, Time elapsed: 320.5 sec - in org.apache.atlas.discovery.GraphBackedDiscoveryServiceTest
Tests run: 2, Failures: 0, Errors: 0, Skipped: 0, Time elapsed: 318.914 sec - in org.apache.atlas.repository.graph.GraphRepoMapperScaleTest

Results :

Failed tests: 
  ImportServiceTest.importCTAS:168 » AtlasBase Given instance is invalid/not fou...

Tests run: 833, Failures: 1, Errors: 0, Skipped: 0

[INFO] ------------------------------------------------------------------------
[INFO] Reactor Summary:
[INFO] 
[INFO] Apache Atlas Server Build Tools .................... SUCCESS [  1.289 s]
[INFO] apache-atlas ....................................... SUCCESS [ 10.827 s]
[INFO] Apache Atlas Integration ........................... SUCCESS [ 50.407 s]
[INFO] Apache Atlas Common ................................ SUCCESS [ 16.567 s]
[INFO] Apache Atlas Typesystem ............................ SUCCESS [01:31 min]
[INFO] Apache Atlas Client ................................ SUCCESS [  0.732 s]
[INFO] atlas-client-common ................................ SUCCESS [ 13.715 s]
[INFO] atlas-client-v1 .................................... SUCCESS [ 16.996 s]
[INFO] Apache Atlas Server API ............................ SUCCESS [ 11.926 s]
[INFO] Apache Atlas Notification .......................... SUCCESS [ 35.216 s]
[INFO] atlas-client-v2 .................................... SUCCESS [ 11.562 s]
[INFO] Apache Atlas Graph Database Projects ............... SUCCESS [  0.710 s]
[INFO] Apache Atlas Graph Database API .................... SUCCESS [  8.169 s]
[INFO] Graph Database Common Code ......................... SUCCESS [  9.402 s]
[INFO] Apache Atlas Titan 1.0.0 GraphDB Impl .............. SUCCESS [ 54.054 s]
[INFO] Shaded version of Apache hbase client .............. SUCCESS [ 13.313 s]
[INFO] Apache Atlas Titan 0.5.4 Graph DB Impl ............. SUCCESS [01:48 min]
[INFO] Apache Atlas Graph Database Implementation Dependencies SUCCESS [  0.919 s]
[INFO] Shaded version of Apache hbase server .............. SUCCESS [ 36.050 s]
[INFO] Apache Atlas Repository ............................ FAILURE [07:16 min]
[INFO] Apache Atlas Authorization ......................... SKIPPED
[INFO] Apache Atlas Business Catalog ...................... SKIPPED
[INFO] Apache Atlas UI .................................... SKIPPED
[INFO] Apache Atlas Web Application ....................... SKIPPED
[INFO] Apache Atlas Documentation ......................... SKIPPED
[INFO] Apache Atlas FileSystem Model ...................... SKIPPED
[INFO] Apache Atlas Plugin Classloader .................... SKIPPED
[INFO] Apache Atlas Hive Bridge Shim ...................... SKIPPED
[INFO] Apache Atlas Hive Bridge ........................... SKIPPED
[INFO] Apache Atlas Falcon Bridge Shim .................... SKIPPED
[INFO] Apache Atlas Falcon Bridge ......................... SKIPPED
[INFO] Apache Atlas Sqoop Bridge Shim ..................... SKIPPED
[INFO] Apache Atlas Sqoop Bridge .......................... SKIPPED
[INFO] Apache Atlas Storm Bridge Shim ..................... SKIPPED
[INFO] Apache Atlas Storm Bridge .......................... SKIPPED
[INFO] Apache Atlas Distribution .......................... SKIPPED
[INFO] ------------------------------------------------------------------------
[INFO] BUILD FAILURE
[INFO] ------------------------------------------------------------------------
[INFO] Total time: 15:32 min
[INFO] Finished at: 2017-09-30T02:41:55Z
[INFO] Final Memory: 155M/1409M
[INFO] ------------------------------------------------------------------------
[ERROR] Failed to execute goal org.apache.maven.plugins:maven-surefire-plugin:2.18.1:test
(default-test) on project atlas-repository: There are test failures.
[ERROR] 
[ERROR] Please refer to <https://builds.apache.org/job/Atlas-master-UnitTests/ws/repository/target/surefire-reports>
for the individual test results.
[ERROR] -> [Help 1]
[ERROR] 
[ERROR] To see the full stack trace of the errors, re-run Maven with the -e switch.
[ERROR] Re-run Maven using the -X switch to enable full debug logging.
[ERROR] 
[ERROR] For more information about the errors and possible solutions, please read the following
articles:
[ERROR] [Help 1] http://cwiki.apache.org/confluence/display/MAVEN/MojoFailureException
[ERROR] 
[ERROR] After correcting the problems, you can resume the build with the command
[ERROR]   mvn <goals> -rf :atlas-repository
Build step 'Execute shell' marked build as failure
[CHECKSTYLE] Collecting checkstyle analysis files...
[CHECKSTYLE] Searching for all files in <https://builds.apache.org/job/Atlas-master-UnitTests/ws/>
that match the pattern **/target/checkstyle-result.xml
[CHECKSTYLE] Parsing 18 files in <https://builds.apache.org/job/Atlas-master-UnitTests/ws/>
[CHECKSTYLE] Successfully parsed file <https://builds.apache.org/job/Atlas-master-UnitTests/ws/client/client-v1/target/checkstyle-result.xml>
with 873 unique warnings and 0 duplicates.
[CHECKSTYLE] Successfully parsed file <https://builds.apache.org/job/Atlas-master-UnitTests/ws/client/client-v2/target/checkstyle-result.xml>
with 1198 unique warnings and 0 duplicates.
[CHECKSTYLE] Successfully parsed file <https://builds.apache.org/job/Atlas-master-UnitTests/ws/client/common/target/checkstyle-result.xml>
with 1655 unique warnings and 0 duplicates.
[CHECKSTYLE] Successfully parsed file <https://builds.apache.org/job/Atlas-master-UnitTests/ws/client/target/checkstyle-result.xml>
with 1655 unique warnings and 0 duplicates.
[CHECKSTYLE] Successfully parsed file <https://builds.apache.org/job/Atlas-master-UnitTests/ws/common/target/checkstyle-result.xml>
with 2606 unique warnings and 0 duplicates.
[CHECKSTYLE] Successfully parsed file <https://builds.apache.org/job/Atlas-master-UnitTests/ws/graphdb/api/target/checkstyle-result.xml>
with 2879 unique warnings and 0 duplicates.
[CHECKSTYLE] Successfully parsed file <https://builds.apache.org/job/Atlas-master-UnitTests/ws/graphdb/common/target/checkstyle-result.xml>
with 3066 unique warnings and 0 duplicates.
[CHECKSTYLE] Successfully parsed file <https://builds.apache.org/job/Atlas-master-UnitTests/ws/graphdb/graphdb-impls/target/checkstyle-result.xml>
with 3066 unique warnings and 0 duplicates.
[CHECKSTYLE] Successfully parsed file <https://builds.apache.org/job/Atlas-master-UnitTests/ws/graphdb/target/checkstyle-result.xml>
with 3066 unique warnings and 0 duplicates.
[CHECKSTYLE] Successfully parsed file <https://builds.apache.org/job/Atlas-master-UnitTests/ws/graphdb/titan0/target/checkstyle-result.xml>
with 5468 unique warnings and 0 duplicates.
[CHECKSTYLE] Successfully parsed file <https://builds.apache.org/job/Atlas-master-UnitTests/ws/graphdb/titan1/target/checkstyle-result.xml>
with 6435 unique warnings and 0 duplicates.
[CHECKSTYLE] Successfully parsed file <https://builds.apache.org/job/Atlas-master-UnitTests/ws/intg/target/checkstyle-result.xml>
with 14646 unique warnings and 0 duplicates.
[CHECKSTYLE] Successfully parsed file <https://builds.apache.org/job/Atlas-master-UnitTests/ws/notification/target/checkstyle-result.xml>
with 15856 unique warnings and 0 duplicates.
[CHECKSTYLE] Successfully parsed file <https://builds.apache.org/job/Atlas-master-UnitTests/ws/server-api/target/checkstyle-result.xml>
with 16235 unique warnings and 0 duplicates.
[CHECKSTYLE] Successfully parsed file <https://builds.apache.org/job/Atlas-master-UnitTests/ws/shaded/hbase-client-shaded/target/checkstyle-result.xml>
with 16235 unique warnings and 0 duplicates.
[CHECKSTYLE] Successfully parsed file <https://builds.apache.org/job/Atlas-master-UnitTests/ws/shaded/hbase-server-shaded/target/checkstyle-result.xml>
with 16235 unique warnings and 0 duplicates.
[CHECKSTYLE] Successfully parsed file <https://builds.apache.org/job/Atlas-master-UnitTests/ws/target/checkstyle-result.xml>
with 16235 unique warnings and 0 duplicates.
[CHECKSTYLE] Successfully parsed file <https://builds.apache.org/job/Atlas-master-UnitTests/ws/typesystem/target/checkstyle-result.xml>
with 20453 unique warnings and 0 duplicates.
<Git Blamer> Using GitBlamer to create author and commit information for all warnings.
<Git Blamer> GIT_COMMIT=3af543640c944dc98cdc3334588a2ffc5a12e34c, workspace=<https://builds.apache.org/job/Atlas-master-UnitTests/ws/>
 > git rev-parse 3af543640c944dc98cdc3334588a2ffc5a12e34c^{commit} # timeout=10
<Git Blamer> Skipping file <https://builds.apache.org/job/Atlas-master-UnitTests/ws/graphdb/titan1/src/main/java/org/apache/atlas/repository/graphdb/titan1/graphson/AtlasGraphSONMode.java,>
no result found.
[CHECKSTYLE] Computing warning deltas based on reference build #59
[FINDBUGS] Collecting findbugs analysis files...
[FINDBUGS] Searching for all files in <https://builds.apache.org/job/Atlas-master-UnitTests/ws/>
that match the pattern **/target/findbugs.xml
[FINDBUGS] Parsing 11 files in <https://builds.apache.org/job/Atlas-master-UnitTests/ws/>
[FINDBUGS] Successfully parsed file <https://builds.apache.org/job/Atlas-master-UnitTests/ws/client/client-v1/target/findbugs.xml>
with 0 unique warnings and 0 duplicates.
[FINDBUGS] Successfully parsed file <https://builds.apache.org/job/Atlas-master-UnitTests/ws/client/client-v2/target/findbugs.xml>
with 0 unique warnings and 0 duplicates.
[FINDBUGS] Successfully parsed file <https://builds.apache.org/job/Atlas-master-UnitTests/ws/client/common/target/findbugs.xml>
with 0 unique warnings and 0 duplicates.
[FINDBUGS] Successfully parsed file <https://builds.apache.org/job/Atlas-master-UnitTests/ws/common/target/findbugs.xml>
with 0 unique warnings and 0 duplicates.
[FINDBUGS] Successfully parsed file <https://builds.apache.org/job/Atlas-master-UnitTests/ws/graphdb/api/target/findbugs.xml>
with 0 unique warnings and 0 duplicates.
[FINDBUGS] Successfully parsed file <https://builds.apache.org/job/Atlas-master-UnitTests/ws/graphdb/common/target/findbugs.xml>
with 0 unique warnings and 0 duplicates.
[FINDBUGS] Successfully parsed file <https://builds.apache.org/job/Atlas-master-UnitTests/ws/graphdb/titan0/target/findbugs.xml>
with 0 unique warnings and 0 duplicates.
[FINDBUGS] Successfully parsed file <https://builds.apache.org/job/Atlas-master-UnitTests/ws/intg/target/findbugs.xml>
with 0 unique warnings and 0 duplicates.
[FINDBUGS] Successfully parsed file <https://builds.apache.org/job/Atlas-master-UnitTests/ws/notification/target/findbugs.xml>
with 0 unique warnings and 0 duplicates.
[FINDBUGS] Successfully parsed file <https://builds.apache.org/job/Atlas-master-UnitTests/ws/server-api/target/findbugs.xml>
with 0 unique warnings and 0 duplicates.
[FINDBUGS] Successfully parsed file <https://builds.apache.org/job/Atlas-master-UnitTests/ws/typesystem/target/findbugs.xml>
with 0 unique warnings and 0 duplicates.
<Git Blamer> Using GitBlamer to create author and commit information for all warnings.
<Git Blamer> GIT_COMMIT=3af543640c944dc98cdc3334588a2ffc5a12e34c, workspace=<https://builds.apache.org/job/Atlas-master-UnitTests/ws/>
[FINDBUGS] Computing warning deltas based on reference build #59
Archiving artifacts
TestNG Reports Processing: START
Looking for TestNG results report in workspace using pattern: **/target/surefire-reports/testng-results.xml,**/target/failsafe-reports/testng-results.xml
Saving reports...
Processing '/x1/jenkins/jenkins-home/jobs/Atlas-master-UnitTests/builds/108/testng/testng-results-1.xml'
Processing '/x1/jenkins/jenkins-home/jobs/Atlas-master-UnitTests/builds/108/testng/testng-results-2.xml'
Processing '/x1/jenkins/jenkins-home/jobs/Atlas-master-UnitTests/builds/108/testng/testng-results-3.xml'
Processing '/x1/jenkins/jenkins-home/jobs/Atlas-master-UnitTests/builds/108/testng/testng-results-4.xml'
Processing '/x1/jenkins/jenkins-home/jobs/Atlas-master-UnitTests/builds/108/testng/testng-results-5.xml'
Processing '/x1/jenkins/jenkins-home/jobs/Atlas-master-UnitTests/builds/108/testng/testng-results-6.xml'
Processing '/x1/jenkins/jenkins-home/jobs/Atlas-master-UnitTests/builds/108/testng/testng-results.xml'
TestNG Reports Processing: FINISH

Mime
View raw message