atlas-dev mailing list archives

Site index · List index
Message view « Date » · « Thread »
Top « Date » · « Thread »
From Apache Jenkins Server <jenk...@builds.apache.org>
Subject Build failed in Jenkins: Atlas-0.8-IntegrationTests #89
Date Sat, 30 Sep 2017 01:19:51 GMT
See <https://builds.apache.org/job/Atlas-0.8-IntegrationTests/89/display/redirect?page=changes>

Changes:

[ssubramanian] ATLAS-2184: IS_NULL and NOT_NULL operator support

------------------------------------------
[...truncated 489.27 KB...]
Progress (3): 159 kB | 34 kB | 36/42 kB                                       Downloaded: https://repo.maven.apache.org/maven2/org/eclipse/jetty/websocket/websocket-server/9.4.0.v20161208/websocket-server-9.4.0.v20161208.jar (34 kB at 206 kB/s)
Progress (2): 159 kB | 40/42 kB                               Downloading: https://repo.maven.apache.org/maven2/org/eclipse/jetty/websocket/websocket-servlet/9.4.0.v20161208/websocket-servlet-9.4.0.v20161208.jar
Progress (2): 159 kB | 42 kB                            Downloaded: https://repo.maven.apache.org/maven2/org/eclipse/jetty/websocket/javax-websocket-client-impl/9.4.0.v20161208/javax-websocket-client-impl-9.4.0.v20161208.jar (159 kB at 965 kB/s)
Downloading: https://repo.maven.apache.org/maven2/org/eclipse/jetty/apache-jsp/9.4.0.v20161208/apache-jsp-9.4.0.v20161208.jar
Progress (2): 42 kB | 2.1/31 kBProgress (2): 42 kB | 4.9/31 kBProgress (2): 42 kB | 7.7/31 kB                               Downloaded: https://repo.maven.apache.org/maven2/org/eclipse/jetty/websocket/websocket-api/9.4.0.v20161208/websocket-api-9.4.0.v20161208.jar (42 kB at 247 kB/s)
Progress (1): 10/31 kB                      Downloading: https://repo.maven.apache.org/maven2/org/eclipse/jetty/toolchain/jetty-schemas/3.1/jetty-schemas-3.1.jar
Progress (1): 13/31 kBProgress (1): 16/31 kBProgress (2): 16/31 kB | 4.1/11 kBProgress (2): 19/31 kB | 4.1/11 kBProgress (2): 19/31 kB | 7.6/11 kBProgress (2): 21/31 kB | 7.6/11 kBProgress (2): 21/31 kB | 11 kB    Progress (2): 24/31 kB | 11 kBProgress (2): 27/31 kB | 11 kBProgress (2): 30/31 kB | 11 kBProgress (2): 31 kB | 11 kB   Progress (3): 31 kB | 11 kB | 4.1/22 kBProgress (3): 31 kB | 11 kB | 7.6/22 kBProgress (3): 31 kB | 11 kB | 12/22 kB Progress (3): 31 kB | 11 kB | 16/22 kBProgress (4): 31 kB | 11 kB | 16/22 kB | 4.1/265 kBProgress (4): 31 kB | 11 kB | 20/22 kB | 4.1/265 kBProgress (4): 31 kB | 11 kB | 20/22 kB | 7.6/265 kBProgress (4): 31 kB | 11 kB | 22 kB | 7.6/265 kB   Progress (4): 31 kB | 11 kB | 22 kB | 12/265 kB Progress (4): 31 kB | 11 kB | 22 kB | 16/265 kBProgress (5): 31 kB | 11 kB | 22 kB | 16/265 kB | 2.1/189 kBProgress (5): 31 kB | 11 kB | 22 kB | 20/265 kB | 2.1/189 kBProgress (5): 31 kB | 11 kB | 22 kB | 24/265 kB | 2.1/189 kBProgress (5): 31 kB | 11 kB | 22 kB | 28/265 kB | 2.1/189 kBProgress (5): 31 kB | 11 kB | 22 kB | 32/265 kB | 2.1/189 kBProgress (5): 31 kB | 11 kB | 22 kB | 36/265 kB | 2.1/189 kBProgress (5): 31 kB | 11 kB | 22 kB | 40/265 kB | 2.1/189 kBProgress (5): 31 kB | 11 kB | 22 kB | 44/265 kB | 2.1/189 kBProgress (5): 31 kB | 11 kB | 22 kB | 49/265 kB | 2.1/189 kBProgress (5): 31 kB | 11 kB | 22 kB | 53/265 kB | 2.1/189 kBProgress (5): 31 kB | 11 kB | 22 kB | 57/265 kB | 2.1/189 kBProgress (5): 31 kB | 11 kB | 22 kB | 61/265 kB | 2.1/189 kBProgress (5): 31 kB | 11 kB | 22 kB | 65/265 kB | 2.1/189 kBProgress (5): 31 kB | 11 kB | 22 kB | 69/265 kB | 2.1/189 kBProgress (5): 31 kB | 11 kB | 22 kB | 73/265 kB | 2.1/189 kBProgress (5): 31 kB | 11 kB | 22 kB | 77/265 kB | 2.1/189 kBProgress (5): 31 kB | 11 kB | 22 kB | 81/265 kB | 2.1/189 kBProgress (5): 31 kB | 11 kB | 22 kB | 85/265 kB | 2.1/189 kBProgress (5): 31 kB | 11 kB | 22 kB | 89/265 kB | 2.1/189 kBProgress (5): 31 kB | 11 kB | 22 kB | 94/265 kB | 2.1/189 kBProgress (5): 31 kB | 11 kB | 22 kB | 98/265 kB | 2.1/189 kBProgress (5): 31 kB | 11 kB | 22 kB | 102/265 kB | 2.1/189 kBProgress (5): 31 kB | 11 kB | 22 kB | 106/265 kB | 2.1/189 kBProgress (5): 31 kB | 11 kB | 22 kB | 110/265 kB | 2.1/189 kBProgress (5): 31 kB | 11 kB | 22 kB | 114/265 kB | 2.1/189 kBProgress (5): 31 kB | 11 kB | 22 kB | 118/265 kB | 2.1/189 kBProgress (5): 31 kB | 11 kB | 22 kB | 122/265 kB | 2.1/189 kBProgress (5): 31 kB | 11 kB | 22 kB | 126/265 kB | 2.1/189 kBProgress (5): 31 kB | 11 kB | 22 kB | 130/265 kB | 2.1/189 kBProgress (5): 31 kB | 11 kB | 22 kB | 135/265 kB | 2.1/189 kBProgress (5): 31 kB | 11 kB | 22 kB | 139/265 kB | 2.1/189 kBProgress (5): 31 kB | 11 kB | 22 kB | 143/265 kB | 2.1/189 kBProgress (5): 31 kB | 11 kB | 22 kB | 147/265 kB | 2.1/189 kBProgress (5): 31 kB | 11 kB | 22 kB | 151/265 kB | 2.1/189 kBProgress (5): 31 kB | 11 kB | 22 kB | 155/265 kB | 2.1/189 kBProgress (5): 31 kB | 11 kB | 22 kB | 159/265 kB | 2.1/189 kBProgress (5): 31 kB | 11 kB | 22 kB | 163/265 kB | 2.1/189 kBProgress (5): 31 kB | 11 kB | 22 kB | 167/265 kB | 2.1/189 kBProgress (5): 31 kB | 11 kB | 22 kB | 171/265 kB | 2.1/189 kBProgress (5): 31 kB | 11 kB | 22 kB | 176/265 kB | 2.1/189 kBProgress (5): 31 kB | 11 kB | 22 kB | 180/265 kB | 2.1/189 kBProgress (5): 31 kB | 11 kB | 22 kB | 184/265 kB | 2.1/189 kBProgress (5): 31 kB | 11 kB | 22 kB | 188/265 kB | 2.1/189 kBProgress (5): 31 kB | 11 kB | 22 kB | 192/265 kB | 2.1/189 kBProgress (5): 31 kB | 11 kB | 22 kB | 196/265 kB | 2.1/189 kBProgress (5): 31 kB | 11 kB | 22 kB | 200/265 kB | 2.1/189 kBProgress (5): 31 kB | 11 kB | 22 kB | 204/265 kB | 2.1/189 kBProgress (5): 31 kB | 11 kB | 22 kB | 208/265 kB | 2.1/189 kBProgress (5): 31 kB | 11 kB | 22 kB | 212/265 kB | 2.1/189 kBProgress (5): 31 kB | 11 kB | 22 kB | 216/265 kB | 2.1/189 kBProgress (5): 31 kB | 11 kB | 22 kB | 221/265 kB | 2.1/189 kBProgress (5): 31 kB | 11 kB | 22 kB | 225/265 kB | 2.1/189 kBProgress (5): 31 kB | 11 kB | 22 kB | 229/265 kB | 2.1/189 kBProgress (5): 31 kB | 11 kB | 22 kB | 233/265 kB | 2.1/189 kBProgress (5): 31 kB | 11 kB | 22 kB | 237/265 kB | 2.1/189 kBProgress (5): 31 kB | 11 kB | 22 kB | 241/265 kB | 2.1/189 kBProgress (5): 31 kB | 11 kB | 22 kB | 245/265 kB | 2.1/189 kBProgress (5): 31 kB | 11 kB | 22 kB | 249/265 kB | 2.1/189 kBProgress (5): 31 kB | 11 kB | 22 kB | 253/265 kB | 2.1/189 kBProgress (5): 31 kB | 11 kB | 22 kB | 257/265 kB | 2.1/189 kBProgress (5): 31 kB | 11 kB | 22 kB | 262/265 kB | 2.1/189 kBProgress (5): 31 kB | 11 kB | 22 kB | 265 kB | 2.1/189 kB    Progress (5): 31 kB | 11 kB | 22 kB | 265 kB | 4.9/189 kB                                                         Downloaded: https://repo.maven.apache.org/maven2/org/eclipse/jetty/websocket/websocket-client/9.4.0.v20161208/websocket-client-9.4.0.v20161208.jar (31 kB at 144 kB/s)
Progress (4): 11 kB | 22 kB | 265 kB | 7.7/189 kB                                                 Downloaded: https://repo.maven.apache.org/maven2/org/eclipse/jetty/apache-jsp/9.4.0.v20161208/apache-jsp-9.4.0.v20161208.jar (11 kB at 51 kB/s)
Downloading: https://repo.maven.apache.org/maven2/org/mortbay/jasper/apache-el/8.5.5/apache-el-8.5.5.jar
Downloading: https://repo.maven.apache.org/maven2/org/mortbay/jasper/apache-jsp/8.5.5/apache-jsp-8.5.5.jar
Progress (3): 22 kB | 265 kB | 10/189 kBProgress (3): 22 kB | 265 kB | 13/189 kBProgress (3): 22 kB | 265 kB | 16/189 kBProgress (3): 22 kB | 265 kB | 19/189 kBProgress (3): 22 kB | 265 kB | 21/189 kBProgress (3): 22 kB | 265 kB | 24/189 kBProgress (3): 22 kB | 265 kB | 27/189 kBProgress (3): 22 kB | 265 kB | 30/189 kBProgress (3): 22 kB | 265 kB | 32/189 kBProgress (3): 22 kB | 265 kB | 36/189 kBProgress (3): 22 kB | 265 kB | 40/189 kBProgress (3): 22 kB | 265 kB | 44/189 kBProgress (3): 22 kB | 265 kB | 49/189 kBProgress (3): 22 kB | 265 kB | 53/189 kBProgress (3): 22 kB | 265 kB | 57/189 kBProgress (3): 22 kB | 265 kB | 61/189 kBProgress (3): 22 kB | 265 kB | 65/189 kBProgress (3): 22 kB | 265 kB | 69/189 kBProgress (3): 22 kB | 265 kB | 73/189 kBProgress (3): 22 kB | 265 kB | 77/189 kBProgress (3): 22 kB | 265 kB | 81/189 kBProgress (3): 22 kB | 265 kB | 85/189 kB                                        Downloaded: https://repo.maven.apache.org/maven2/org/eclipse/jetty/websocket/websocket-servlet/9.4.0.v20161208/websocket-servlet-9.4.0.v20161208.jar (22 kB at 96 kB/s)
Downloading: https://repo.maven.apache.org/maven2/org/eclipse/jetty/apache-jstl/9.4.0.v20161208/apache-jstl-9.4.0.v20161208.jar
Progress (2): 265 kB | 89/189 kBProgress (2): 265 kB | 94/189 kBProgress (2): 265 kB | 98/189 kBProgress (2): 265 kB | 102/189 kBProgress (2): 265 kB | 106/189 kBProgress (3): 265 kB | 106/189 kB | 4.1/243 kBProgress (3): 265 kB | 110/189 kB | 4.1/243 kBProgress (3): 265 kB | 110/189 kB | 7.6/243 kB                                              Downloaded: https://repo.maven.apache.org/maven2/org/eclipse/jetty/jetty-client/9.4.0.v20161208/jetty-client-9.4.0.v20161208.jar (265 kB at 1.2 MB/s)
Progress (2): 110/189 kB | 12/243 kBProgress (2): 114/189 kB | 12/243 kBProgress (2): 114/189 kB | 16/243 kB                                    Downloading: https://repo.maven.apache.org/maven2/org/apache/taglibs/taglibs-standard-spec/1.2.5/taglibs-standard-spec-1.2.5.jar
Progress (3): 114/189 kB | 16/243 kB | 4.1/973 kBProgress (3): 118/189 kB | 16/243 kB | 4.1/973 kBProgress (3): 118/189 kB | 20/243 kB | 4.1/973 kBProgress (3): 118/189 kB | 20/243 kB | 7.6/973 kBProgress (3): 118/189 kB | 24/243 kB | 7.6/973 kBProgress (3): 122/189 kB | 24/243 kB | 7.6/973 kBProgress (3): 122/189 kB | 28/243 kB | 7.6/973 kBProgress (3): 122/189 kB | 28/243 kB | 12/973 kB Progress (3): 122/189 kB | 32/243 kB | 12/973 kBProgress (3): 126/189 kB | 32/243 kB | 12/973 kBProgress (3): 126/189 kB | 32/243 kB | 16/973 kBProgress (3): 126/189 kB | 36/243 kB | 16/973 kBProgress (3): 130/189 kB | 36/243 kB | 16/973 kBProgress (3): 130/189 kB | 36/243 kB | 20/973 kBProgress (3): 130/189 kB | 40/243 kB | 20/973 kBProgress (3): 135/189 kB | 40/243 kB | 20/973 kBProgress (3): 135/189 kB | 40/243 kB | 24/973 kBProgress (3): 139/189 kB | 40/243 kB | 24/973 kBProgress (3): 139/189 kB | 44/243 kB | 24/973 kBProgress (3): 143/189 kB | 44/243 kB | 24/973 kBProgress (4): 143/189 kB | 44/243 kB | 24/973 kB | 2.1/3.7 kBProgress (4): 143/189 kB | 44/243 kB | 28/973 kB | 2.1/3.7 kBProgress (4): 143/189 kB | 44/243 kB | 28/973 kB | 3.7 kB    Progress (4): 147/189 kB | 44/243 kB | 28/973 kB | 3.7 kBProgress (4): 147/189 kB | 49/243 kB | 28/973 kB | 3.7 kBProgress (4): 147/189 kB | 49/243 kB | 32/973 kB | 3.7 kBProgress (4): 151/189 kB | 49/243 kB | 32/973 kB | 3.7 kBProgress (4): 151/189 kB | 53/243 kB | 32/973 kB | 3.7 kBProgress (4): 151/189 kB | 53/243 kB | 36/973 kB | 3.7 kBProgress (4): 155/189 kB | 53/243 kB | 36/973 kB | 3.7 kBProgress (4): 155/189 kB | 53/243 kB | 40/973 kB | 3.7 kBProgress (4): 155/189 kB | 57/243 kB | 40/973 kB | 3.7 kBProgress (5): 155/189 kB | 57/243 kB | 40/973 kB | 3.7 kB | 4.1/40 kBProgress (5): 155/189 kB | 57/243 kB | 44/973 kB | 3.7 kB | 4.1/40 kBProgress (5): 159/189 kB | 57/243 kB | 44/973 kB | 3.7 kB | 4.1/40 kBProgress (5): 159/189 kB | 57/243 kB | 49/973 kB | 3.7 kB | 4.1/40 kBProgress (5): 159/189 kB | 57/243 kB | 49/973 kB | 3.7 kB | 7.6/40 kBProgress (5): 159/189 kB | 61/243 kB | 49/973 kB | 3.7 kB | 7.6/40 kBProgress (5): 159/189 kB | 61/243 kB | 53/973 kB | 3.7 kB | 7.6/40 kBProgress (5): 159/189 kB | 61/243 kB | 53/973 kB | 3.7 kB | 12/40 kB Progress (5): 163/189 kB | 61/243 kB | 53/973 kB | 3.7 kB | 12/40 kBProgress (5): 163/189 kB | 61/243 kB | 53/973 kB | 3.7 kB | 16/40 kBProgress (5): 167/189 kB | 61/243 kB | 53/973 kB | 3.7 kB | 16/40 kBProgress (5): 167/189 kB | 61/243 kB | 57/973 kB | 3.7 kB | 16/40 kBProgress (5): 167/189 kB | 61/243 kB | 57/973 kB | 3.7 kB | 20/40 kBProgress (5): 167/189 kB | 65/243 kB | 57/973 kB | 3.7 kB | 20/40 kBProgress (5): 167/189 kB | 65/243 kB | 57/973 kB | 3.7 kB | 24/40 kB                                                                    Downloaded: https://repo.maven.apache.org/maven2/org/eclipse/jetty/apache-jstl/9.4.0.v20161208/apache-jstl-9.4.0.v20161208.jar (3.7 kB at 16 kB/s)
Downloading: https://repo.maven.apache.org/maven2/org/apache/taglibs/taglibs-standard-impl/1.2.5/taglibs-standard-impl-1.2.5.jar
Progress (4): 167/189 kB | 65/243 kB | 61/973 kB | 24/40 kBProgress (4): 171/189 kB | 65/243 kB | 61/973 kB | 24/40 kBProgress (4): 171/189 kB | 65/243 kB | 65/973 kB | 24/40 kBProgress (4): 171/189 kB | 65/243 kB | 65/973 kB | 28/40 kBProgress (4): 171/189 kB | 69/243 kB | 65/973 kB | 28/40 kBProgress (4): 171/189 kB | 69/243 kB | 69/973 kB | 28/40 kBProgress (4): 171/189 kB | 69/243 kB | 69/973 kB | 32/40 kBProgress (4): 176/189 kB | 69/243 kB | 69/973 kB | 32/40 kBProgress (4): 176/189 kB | 69/243 kB | 69/973 kB | 36/40 kBProgress (4): 176/189 kB | 69/243 kB | 73/973 kB | 36/40 kBProgress (4): 176/189 kB | 73/243 kB | 73/973 kB | 36/40 kBProgress (4): 176/189 kB | 73/243 kB | 77/973 kB | 36/40 kBProgress (4): 176/189 kB | 73/243 kB | 77/973 kB | 40 kB   Progress (4): 180/189 kB | 73/243 kB | 77/973 kB | 40 kBProgress (4): 180/189 kB | 73/243 kB | 81/973 kB | 40 kBProgress (4): 180/189 kB | 77/243 kB | 81/973 kB | 40 kBProgress (4): 184/189 kB | 77/243 kB | 81/973 kB | 40 kBProgress (4): 184/189 kB | 77/243 kB | 85/973 kB | 40 kBProgress (4): 184/189 kB | 81/243 kB | 85/973 kB | 40 kBProgress (4): 184/189 kB | 81/243 kB | 89/973 kB | 40 kBProgress (4): 188/189 kB | 81/243 kB | 89/973 kB | 40 kBProgress (4): 188/189 kB | 85/243 kB | 89/973 kB | 40 kBProgress (4): 188/189 kB | 85/243 kB | 94/973 kB | 40 kBProgress (4): 188/189 kB | 89/243 kB | 94/973 kB | 40 kBProgress (4): 189 kB | 89/243 kB | 94/973 kB | 40 kB    Progress (4): 189 kB | 94/243 kB | 94/973 kB | 40 kBProgress (4): 189 kB | 94/243 kB | 98/973 kB | 40 kBProgress (4): 189 kB | 98/243 kB | 98/973 kB | 40 kBProgress (4): 189 kB | 98/243 kB | 102/973 kB | 40 kBProgress (4): 189 kB | 102/243 kB | 102/973 kB | 40 kBProgress (4): 189 kB | 102/243 kB | 106/973 kB | 40 kBProgress (5): 189 kB | 102/243 kB | 106/973 kB | 40 kB | 2.1/206 kBProgress (5): 189 kB | 106/243 kB | 106/973 kB | 40 kB | 2.1/206 kBProgress (5): 189 kB | 106/243 kB | 110/973 kB | 40 kB | 2.1/206 kBProgress (5): 189 kB | 110/243 kB | 110/973 kB | 40 kB | 2.1/206 kBProgress (5): 189 kB | 110/243 kB | 110/973 kB | 40 kB | 4.9/206 kBProgress (5): 189 kB | 114/243 kB | 110/973 kB | 40 kB | 4.9/206 kB                                                                   Downloaded: https://repo.maven.apache.org/maven2/org/apache/taglibs/taglibs-standard-spec/1.2.5/taglibs-standard-spec-1.2.5.jar (40 kB at 158 kB/s)
Progress (4): 189 kB | 114/243 kB | 114/973 kB | 4.9/206 kBProgress (4): 189 kB | 118/243 kB | 114/973 kB | 4.9/206 kBProgress (4): 189 kB | 118/243 kB | 114/973 kB | 7.7/206 kBProgress (4): 189 kB | 118/243 kB | 118/973 kB | 7.7/206 kBProgress (4): 189 kB | 118/243 kB | 118/973 kB | 10/206 kB Progress (4): 189 kB | 122/243 kB | 118/973 kB | 10/206 kBProgress (4): 189 kB | 122/243 kB | 118/973 kB | 13/206 kBProgress (4): 189 kB | 122/243 kB | 122/973 kB | 13/206 kBProgress (4): 189 kB | 126/243 kB | 122/973 kB | 13/206 kBProgress (4): 189 kB | 126/243 kB | 126/973 kB | 13/206 kBProgress (4): 189 kB | 126/243 kB | 126/973 kB | 16/206 kBProgress (4): 189 kB | 126/243 kB | 130/973 kB | 16/206 kBProgress (4): 189 kB | 126/243 kB | 130/973 kB | 19/206 kBProgress (4): 189 kB | 130/243 kB | 130/973 kB | 19/206 kB                                                          Downloaded: https://repo.maven.apache.org/maven2/org/eclipse/jetty/toolchain/jetty-schemas/3.1/jetty-schemas-3.1.jar (189 kB at 734 kB/s)
Progress (3): 130/243 kB | 130/973 kB | 21/206 kBProgress (3): 130/243 kB | 135/973 kB | 21/206 kBProgress (3): 130/243 kB | 135/973 kB | 24/206 kBProgress (3): 135/243 kB | 135/973 kB | 24/206 kBProgress (3): 135/243 kB | 135/973 kB | 27/206 kBProgress (3): 135/243 kB | 139/973 kB | 27/206 kBProgress (3): 135/243 kB | 139/973 kB | 30/206 kBProgress (3): 139/243 kB | 139/973 kB | 30/206 kBProgress (3): 139/243 kB | 139/973 kB | 32/206 kBProgress (3): 139/243 kB | 143/973 kB | 32/206 kBProgress (3): 143/243 kB | 143/973 kB | 32/206 kBProgress (3): 143/243 kB | 143/973 kB | 36/206 kBProgress (3): 143/243 kB | 147/973 kB | 36/206 kBProgress (3): 143/243 kB | 147/973 kB | 40/206 kBProgress (3): 147/243 kB | 147/973 kB | 40/206 kBProgress (3): 147/243 kB | 151/973 kB | 40/206 kBProgress (3): 147/243 kB | 151/973 kB | 44/206 kBProgress (3): 147/243 kB | 155/973 kB | 44/206 kBProgress (3): 151/243 kB | 155/973 kB | 44/206 kBProgress (3): 151/243 kB | 159/973 kB | 44/206 kBProgress (3): 151/243 kB | 159/973 kB | 49/206 kBProgress (3): 151/243 kB | 163/973 kB | 49/206 kBProgress (3): 155/243 kB | 163/973 kB | 49/206 kBProgress (3): 155/243 kB | 163/973 kB | 53/206 kBProgress (3): 155/243 kB | 167/973 kB | 53/206 kBProgress (3): 159/243 kB | 167/973 kB | 53/206 kBProgress (3): 159/243 kB | 171/973 kB | 53/206 kBProgress (3): 159/243 kB | 171/973 kB | 57/206 kBProgress (3): 159/243 kB | 176/973 kB | 57/206 kBProgress (3): 163/243 kB | 176/973 kB | 57/206 kBProgress (3): 163/243 kB | 180/973 kB | 57/206 kBProgress (3): 163/243 kB | 180/973 kB | 61/206 kBProgress (3): 167/243 kB | 180/973 kB | 61/206 kBProgress (3): 167/243 kB | 184/973 kB | 61/206 kBProgress (3): 167/243 kB | 184/973 kB | 65/206 kBProgress (3): 167/243 kB | 188/973 kB | 65/206 kBProgress (3): 171/243 kB | 188/973 kB | 65/206 kBProgress (3): 171/243 kB | 192/973 kB | 65/206 kBProgress (3): 171/243 kB | 192/973 kB | 69/206 kBProgress (3): 171/243 kB | 196/973 kB | 69/206 kBProgress (3): 176/243 kB | 196/973 kB | 69/206 kBProgress (3): 176/243 kB | 196/973 kB | 73/206 kBProgress (3): 176/243 kB | 200/973 kB | 73/206 kBProgress (3): 180/243 kB | 200/973 kB | 73/206 kBProgress (3): 180/243 kB | 204/973 kB | 73/206 kBProgress (3): 184/243 kB | 204/973 kB | 73/206 kBProgress (3): 184/243 kB | 204/973 kB | 77/206 kBProgress (3): 188/243 kB | 204/973 kB | 77/206 kBProgress (3): 188/243 kB | 208/973 kB | 77/206 kBProgress (3): 192/243 kB | 208/973 kB | 77/206 kBProgress (3): 192/243 kB | 208/973 kB | 81/206 kBProgress (3): 196/243 kB | 208/973 kB | 81/206 kBProgress (3): 196/243 kB | 212/973 kB | 81/206 kBProgress (3): 196/243 kB | 212/973 kB | 85/206 kBProgress (3): 200/243 kB | 212/973 kB | 85/206 kBProgress (3): 200/243 kB | 216/973 kB | 85/206 kBProgress (3): 200/243 kB | 216/973 kB | 89/206 kBProgress (3): 200/243 kB | 221/973 kB | 89/206 kBProgress (3): 204/243 kB | 221/973 kB | 89/206 kBProgress (3): 204/243 kB | 225/973 kB | 89/206 kBProgress (3): 204/243 kB | 225/973 kB | 94/206 kBProgress (3): 204/243 kB | 229/973 kB | 94/206 kBProgress (3): 208/243 kB | 229/973 kB | 94/206 kBProgress (3): 208/243 kB | 229/973 kB | 98/206 kBProgress (3): 208/243 kB | 233/973 kB | 98/206 kBProgress (3): 212/243 kB | 233/973 kB | 98/206 kBProgress (3): 212/243 kB | 233/973 kB | 102/206 kBProgress (3): 212/243 kB | 237/973 kB | 102/206 kBProgress (3): 216/243 kB | 237/973 kB | 102/206 kBProgress (3): 216/243 kB | 237/973 kB | 106/206 kBProgress (3): 221/243 kB | 237/973 kB | 106/206 kBProgress (3): 221/243 kB | 241/973 kB | 106/206 kBProgress (3): 225/243 kB | 241/973 kB | 106/206 kBProgress (3): 225/243 kB | 241/973 kB | 110/206 kBProgress (3): 229/243 kB | 241/973 kB | 110/206 kBProgress (3): 229/243 kB | 245/973 kB | 110/206 kBProgress (3): 229/243 kB | 245/973 kB | 114/206 kBProgress (3): 233/243 kB | 245/973 kB | 114/206 kBProgress (3): 233/243 kB | 249/973 kB | 114/206 kBProgress (3): 233/243 kB | 249/973 kB | 118/206 kBProgress (3): 237/243 kB | 249/973 kB | 118/206 kBProgress (3): 237/243 kB | 249/973 kB | 122/206 kBProgress (3): 237/243 kB | 253/973 kB | 122/206 kBProgress (3): 237/243 kB | 253/973 kB | 126/206 kBProgress (3): 241/243 kB | 253/973 kB | 126/206 kBProgress (3): 241/243 kB | 253/973 kB | 130/206 kBProgress (3): 241/243 kB | 257/973 kB | 130/206 kBProgress (3): 243 kB | 257/973 kB | 130/206 kB    Progress (3): 243 kB | 257/973 kB | 135/206 kBProgress (3): 243 kB | 262/973 kB | 135/206 kBProgress (3): 243 kB | 262/973 kB | 139/206 kBProgress (3): 243 kB | 262/973 kB | 143/206 kBProgress (3): 243 kB | 266/973 kB | 143/206 kBProgress (3): 243 kB | 266/973 kB | 147/206 kBProgress (3): 243 kB | 270/973 kB | 147/206 kBProgress (3): 243 kB | 274/973 kB | 147/206 kBProgress (3): 243 kB | 274/973 kB | 151/206 kBProgress (3): 243 kB | 278/973 kB | 151/206 kBProgress (3): 243 kB | 278/973 kB | 155/206 kBProgress (3): 243 kB | 278/973 kB | 159/206 kBProgress (3): 243 kB | 282/973 kB | 159/206 kBProgress (3): 243 kB | 282/973 kB | 163/206 kBProgress (3): 243 kB | 286/973 kB | 163/206 kBProgress (3): 243 kB | 290/973 kB | 163/206 kBProgress (3): 243 kB | 290/973 kB | 167/206 kBProgress (3): 243 kB | 294/973 kB | 167/206 kBProgress (3): 243 kB | 294/973 kB | 171/206 kBProgress (3): 243 kB | 294/973 kB | 176/206 kBProgress (3): 243 kB | 298/973 kB | 176/206 kBProgress (3): 243 kB | 298/973 kB | 180/206 kBProgress (3): 243 kB | 302/973 kB | 180/206 kBProgress (3): 243 kB | 307/973 kB | 180/206 kBProgress (3): 243 kB | 307/973 kB | 184/206 kBProgress (3): 243 kB | 311/973 kB | 184/206 kBProgress (3): 243 kB | 311/973 kB | 188/206 kBProgress (3): 243 kB | 311/973 kB | 192/206 kBProgress (3): 243 kB | 315/973 kB | 192/206 kBProgress (3): 243 kB | 315/973 kB | 196/206 kBProgress (3): 243 kB | 319/973 kB | 196/206 kBProgress (3): 243 kB | 323/973 kB | 196/206 kBProgress (3): 243 kB | 323/973 kB | 200/206 kBProgress (3): 243 kB | 327/973 kB | 200/206 kBProgress (3): 243 kB | 327/973 kB | 204/206 kBProgress (3): 243 kB | 327/973 kB | 206 kB    Progress (3): 243 kB | 331/973 kB | 206 kBProgress (3): 243 kB | 335/973 kB | 206 kBProgress (3): 243 kB | 339/973 kB | 206 kBProgress (3): 243 kB | 343/973 kB | 206 kBProgress (3): 243 kB | 348/973 kB | 206 kB                                          Downloaded: https://repo.maven.apache.org/maven2/org/mortbay/jasper/apache-el/8.5.5/apache-el-8.5.5.jar (243 kB at 829 kB/s)
Progress (2): 352/973 kB | 206 kBProgress (2): 356/973 kB | 206 kBProgress (2): 360/973 kB | 206 kBProgress (2): 364/973 kB | 206 kBProgress (2): 368/973 kB | 206 kBProgress (2): 372/973 kB | 206 kBProgress (2): 376/973 kB | 206 kBProgress (2): 380/973 kB | 206 kBProgress (2): 384/973 kB | 206 kBProgress (2): 388/973 kB | 206 kBProgress (2): 393/973 kB | 206 kBProgress (2): 397/973 kB | 206 kBProgress (2): 401/973 kB | 206 kBProgress (2): 405/973 kB | 206 kBProgress (2): 409/973 kB | 206 kBProgress (2): 413/973 kB | 206 kBProgress (2): 417/973 kB | 206 kBProgress (2): 421/973 kB | 206 kBProgress (2): 425/973 kB | 206 kBProgress (2): 429/973 kB | 206 kB                                 Downloaded: https://repo.maven.apache.org/maven2/org/apache/taglibs/taglibs-standard-impl/1.2.5/taglibs-standard-impl-1.2.5.jar (206 kB at 695 kB/s)
Progress (1): 434/973 kBProgress (1): 438/973 kBProgress (1): 442/973 kBProgress (1): 446/973 kBProgress (1): 450/973 kBProgress (1): 454/973 kBProgress (1): 458/973 kBProgress (1): 462/973 kBProgress (1): 466/973 kBProgress (1): 470/973 kBProgress (1): 475/973 kBProgress (1): 479/973 kBProgress (1): 483/973 kBProgress (1): 487/973 kBProgress (1): 491/973 kBProgress (1): 495/973 kBProgress (1): 499/973 kBProgress (1): 503/973 kBProgress (1): 507/973 kBProgress (1): 511/973 kBProgress (1): 515/973 kBProgress (1): 520/973 kBProgress (1): 524/973 kBProgress (1): 528/973 kBProgress (1): 532/973 kBProgress (1): 536/973 kBProgress (1): 540/973 kBProgress (1): 544/973 kBProgress (1): 548/973 kBProgress (1): 552/973 kBProgress (1): 556/973 kBProgress (1): 561/973 kBProgress (1): 565/973 kBProgress (1): 569/973 kBProgress (1): 573/973 kBProgress (1): 577/973 kBProgress (1): 581/973 kBProgress (1): 585/973 kBProgress (1): 589/973 kBProgress (1): 593/973 kBProgress (1): 597/973 kBProgress (1): 601/973 kBProgress (1): 606/973 kBProgress (1): 610/973 kBProgress (1): 614/973 kBProgress (1): 618/973 kBProgress (1): 622/973 kBProgress (1): 626/973 kBProgress (1): 630/973 kBProgress (1): 634/973 kBProgress (1): 638/973 kBProgress (1): 642/973 kBProgress (1): 647/973 kBProgress (1): 651/973 kBProgress (1): 655/973 kBProgress (1): 659/973 kBProgress (1): 663/973 kBProgress (1): 667/973 kBProgress (1): 671/973 kBProgress (1): 675/973 kBProgress (1): 679/973 kBProgress (1): 683/973 kBProgress (1): 688/973 kBProgress (1): 692/973 kBProgress (1): 696/973 kBProgress (1): 700/973 kBProgress (1): 704/973 kBProgress (1): 708/973 kBProgress (1): 712/973 kBProgress (1): 716/973 kBProgress (1): 720/973 kBProgress (1): 724/973 kBProgress (1): 728/973 kBProgress (1): 733/973 kBProgress (1): 737/973 kBProgress (1): 741/973 kBProgress (1): 745/973 kBProgress (1): 749/973 kBProgress (1): 753/973 kBProgress (1): 757/973 kBProgress (1): 761/973 kBProgress (1): 765/973 kBProgress (1): 769/973 kBProgress (1): 774/973 kBProgress (1): 778/973 kBProgress (1): 782/973 kBProgress (1): 786/973 kBProgress (1): 790/973 kBProgress (1): 794/973 kBProgress (1): 798/973 kBProgress (1): 802/973 kBProgress (1): 806/973 kBProgress (1): 810/973 kBProgress (1): 814/973 kBProgress (1): 819/973 kBProgress (1): 823/973 kBProgress (1): 827/973 kBProgress (1): 831/973 kBProgress (1): 835/973 kBProgress (1): 839/973 kBProgress (1): 843/973 kBProgress (1): 847/973 kBProgress (1): 851/973 kBProgress (1): 855/973 kBProgress (1): 860/973 kBProgress (1): 864/973 kBProgress (1): 868/973 kBProgress (1): 872/973 kBProgress (1): 876/973 kBProgress (1): 880/973 kBProgress (1): 884/973 kBProgress (1): 888/973 kBProgress (1): 892/973 kBProgress (1): 896/973 kBProgress (1): 900/973 kBProgress (1): 905/973 kBProgress (1): 909/973 kBProgress (1): 913/973 kBProgress (1): 917/973 kBProgress (1): 921/973 kBProgress (1): 925/973 kBProgress (1): 929/973 kBProgress (1): 933/973 kBProgress (1): 937/973 kBProgress (1): 941/973 kBProgress (1): 946/973 kBProgress (1): 950/973 kBProgress (1): 954/973 kBProgress (1): 958/973 kBProgress (1): 962/973 kBProgress (1): 966/973 kBProgress (1): 970/973 kBProgress (1): 973 kB                        Downloaded: https://repo.maven.apache.org/maven2/org/mortbay/jasper/apache-jsp/8.5.5/apache-jsp-8.5.5.jar (973 kB at 2.7 MB/s)
[WARNING] Error injecting: org.eclipse.jetty.maven.plugin.JettyDeployWar
java.lang.TypeNotPresentException: Type org.eclipse.jetty.maven.plugin.JettyDeployWar not present
	at org.eclipse.sisu.space.URLClassSpace.loadClass(URLClassSpace.java:147)
	at org.eclipse.sisu.space.NamedClass.load(NamedClass.java:46)
	at org.eclipse.sisu.space.AbstractDeferredClass.get(AbstractDeferredClass.java:48)
	at com.google.inject.internal.ProviderInternalFactory.provision(ProviderInternalFactory.java:81)
	at com.google.inject.internal.InternalFactoryToInitializableAdapter.provision(InternalFactoryToInitializableAdapter.java:53)
	at com.google.inject.internal.ProviderInternalFactory$1.call(ProviderInternalFactory.java:65)
	at com.google.inject.internal.ProvisionListenerStackCallback$Provision.provision(ProvisionListenerStackCallback.java:115)
	at com.google.inject.internal.ProvisionListenerStackCallback$Provision.provision(ProvisionListenerStackCallback.java:133)
	at com.google.inject.internal.ProvisionListenerStackCallback.provision(ProvisionListenerStackCallback.java:68)
	at com.google.inject.internal.ProviderInternalFactory.circularGet(ProviderInternalFactory.java:63)
	at com.google.inject.internal.InternalFactoryToInitializableAdapter.get(InternalFactoryToInitializableAdapter.java:45)
	at com.google.inject.internal.InjectorImpl$2$1.call(InjectorImpl.java:1016)
	at com.google.inject.internal.InjectorImpl.callInContext(InjectorImpl.java:1092)
	at com.google.inject.internal.InjectorImpl$2.get(InjectorImpl.java:1012)
	at org.eclipse.sisu.inject.Guice4$1.get(Guice4.java:162)
	at org.eclipse.sisu.inject.LazyBeanEntry.getValue(LazyBeanEntry.java:81)
	at org.eclipse.sisu.plexus.LazyPlexusBean.getValue(LazyPlexusBean.java:51)
	at org.codehaus.plexus.DefaultPlexusContainer.lookup(DefaultPlexusContainer.java:263)
	at org.codehaus.plexus.DefaultPlexusContainer.lookup(DefaultPlexusContainer.java:255)
	at org.apache.maven.plugin.internal.DefaultMavenPluginManager.getConfiguredMojo(DefaultMavenPluginManager.java:519)
	at org.apache.maven.plugin.DefaultBuildPluginManager.executeMojo(DefaultBuildPluginManager.java:121)
	at org.apache.maven.lifecycle.internal.MojoExecutor.execute(MojoExecutor.java:208)
	at org.apache.maven.lifecycle.internal.MojoExecutor.execute(MojoExecutor.java:154)
	at org.apache.maven.lifecycle.internal.MojoExecutor.execute(MojoExecutor.java:146)
	at org.apache.maven.lifecycle.internal.LifecycleModuleBuilder.buildProject(LifecycleModuleBuilder.java:117)
	at org.apache.maven.lifecycle.internal.LifecycleModuleBuilder.buildProject(LifecycleModuleBuilder.java:81)
	at org.apache.maven.lifecycle.internal.builder.singlethreaded.SingleThreadedBuilder.build(SingleThreadedBuilder.java:51)
	at org.apache.maven.lifecycle.internal.LifecycleStarter.execute(LifecycleStarter.java:128)
	at org.apache.maven.DefaultMaven.doExecute(DefaultMaven.java:309)
	at org.apache.maven.DefaultMaven.doExecute(DefaultMaven.java:194)
	at org.apache.maven.DefaultMaven.execute(DefaultMaven.java:107)
	at org.apache.maven.cli.MavenCli.execute(MavenCli.java:993)
	at org.apache.maven.cli.MavenCli.doMain(MavenCli.java:345)
	at org.apache.maven.cli.MavenCli.main(MavenCli.java:191)
	at sun.reflect.NativeMethodAccessorImpl.invoke0(Native Method)
	at sun.reflect.NativeMethodAccessorImpl.invoke(NativeMethodAccessorImpl.java:57)
	at sun.reflect.DelegatingMethodAccessorImpl.invoke(DelegatingMethodAccessorImpl.java:43)
	at java.lang.reflect.Method.invoke(Method.java:606)
	at org.codehaus.plexus.classworlds.launcher.Launcher.launchEnhanced(Launcher.java:289)
	at org.codehaus.plexus.classworlds.launcher.Launcher.launch(Launcher.java:229)
	at org.codehaus.plexus.classworlds.launcher.Launcher.mainWithExitCode(Launcher.java:415)
	at org.codehaus.plexus.classworlds.launcher.Launcher.main(Launcher.java:356)
Caused by: java.lang.UnsupportedClassVersionError: org/eclipse/jetty/maven/plugin/JettyDeployWar : Unsupported major.minor version 52.0
	at java.lang.ClassLoader.defineClass1(Native Method)
	at java.lang.ClassLoader.defineClass(ClassLoader.java:800)
	at java.security.SecureClassLoader.defineClass(SecureClassLoader.java:142)
	at java.net.URLClassLoader.defineClass(URLClassLoader.java:449)
	at java.net.URLClassLoader.access$100(URLClassLoader.java:71)
	at java.net.URLClassLoader$1.run(URLClassLoader.java:361)
	at java.net.URLClassLoader$1.run(URLClassLoader.java:355)
	at java.security.AccessController.doPrivileged(Native Method)
	at java.net.URLClassLoader.findClass(URLClassLoader.java:354)
	at org.codehaus.plexus.classworlds.realm.ClassRealm.loadClassFromSelf(ClassRealm.java:401)
	at org.codehaus.plexus.classworlds.strategy.SelfFirstStrategy.loadClass(SelfFirstStrategy.java:42)
	at org.codehaus.plexus.classworlds.realm.ClassRealm.unsynchronizedLoadClass(ClassRealm.java:271)
	at org.codehaus.plexus.classworlds.realm.ClassRealm.loadClass(ClassRealm.java:247)
	at org.codehaus.plexus.classworlds.realm.ClassRealm.loadClass(ClassRealm.java:239)
	at org.eclipse.sisu.space.URLClassSpace.loadClass(URLClassSpace.java:139)
	... 41 more
[INFO] ------------------------------------------------------------------------
[INFO] Reactor Summary:
[INFO] 
[INFO] Apache Atlas Server Build Tools .................... SUCCESS [  1.080 s]
[INFO] apache-atlas ....................................... SUCCESS [ 12.816 s]
[INFO] Apache Atlas Integration ........................... SUCCESS [ 34.361 s]
[INFO] Apache Atlas Common ................................ SUCCESS [ 14.232 s]
[INFO] Apache Atlas Typesystem ............................ SUCCESS [01:23 min]
[INFO] Apache Atlas Client ................................ SUCCESS [  0.754 s]
[INFO] atlas-client-common ................................ SUCCESS [ 12.032 s]
[INFO] atlas-client-v1 .................................... SUCCESS [ 13.273 s]
[INFO] Apache Atlas Server API ............................ SUCCESS [ 11.961 s]
[INFO] Apache Atlas Notification .......................... SUCCESS [ 18.258 s]
[INFO] atlas-client-v2 .................................... SUCCESS [ 10.705 s]
[INFO] Apache Atlas Graph Database Projects ............... SUCCESS [  0.720 s]
[INFO] Apache Atlas Graph Database API .................... SUCCESS [  8.575 s]
[INFO] Graph Database Common Code ......................... SUCCESS [  9.986 s]
[INFO] Apache Atlas Titan 1.0.0 GraphDB Impl .............. SUCCESS [ 52.369 s]
[INFO] Shaded version of Apache hbase client .............. SUCCESS [ 12.043 s]
[INFO] Apache Atlas Titan 0.5.4 Graph DB Impl ............. SUCCESS [01:00 min]
[INFO] Apache Atlas Graph Database Implementation Dependencies SUCCESS [  0.964 s]
[INFO] Shaded version of Apache hbase server .............. SUCCESS [ 32.885 s]
[INFO] Apache Atlas Repository ............................ SUCCESS [02:09 min]
[INFO] Apache Atlas Authorization ......................... SUCCESS [ 12.493 s]
[INFO] Apache Atlas Business Catalog ...................... SUCCESS [ 19.398 s]
[INFO] Apache Atlas UI .................................... SUCCESS [02:17 min]
[INFO] Apache Atlas Web Application ....................... FAILURE [ 36.781 s]
[INFO] Apache Atlas Documentation ......................... SKIPPED
[INFO] Apache Atlas FileSystem Model ...................... SKIPPED
[INFO] Apache Atlas Plugin Classloader .................... SKIPPED
[INFO] Apache Atlas Hive Bridge Shim ...................... SKIPPED
[INFO] Apache Atlas Hive Bridge ........................... SKIPPED
[INFO] Apache Atlas Falcon Bridge Shim .................... SKIPPED
[INFO] Apache Atlas Falcon Bridge ......................... SKIPPED
[INFO] Apache Atlas Sqoop Bridge Shim ..................... SKIPPED
[INFO] Apache Atlas Sqoop Bridge .......................... SKIPPED
[INFO] Apache Atlas Storm Bridge Shim ..................... SKIPPED
[INFO] Apache Atlas Storm Bridge .......................... SKIPPED
[INFO] Apache Atlas Distribution .......................... SKIPPED
[INFO] ------------------------------------------------------------------------
[INFO] BUILD FAILURE
[INFO] ------------------------------------------------------------------------
[INFO] Total time: 12:08 min
[INFO] Finished at: 2017-09-30T01:04:23Z
[INFO] Final Memory: 188M/1501M
[INFO] ------------------------------------------------------------------------
[ERROR] Failed to execute goal org.eclipse.jetty:jetty-maven-plugin:9.4.0.v20161208:deploy-war (start-jetty) on project atlas-webapp: Execution start-jetty of goal org.eclipse.jetty:jetty-maven-plugin:9.4.0.v20161208:deploy-war failed: Unable to load the mojo 'deploy-war' in the plugin 'org.eclipse.jetty:jetty-maven-plugin:9.4.0.v20161208' due to an API incompatibility: org.codehaus.plexus.component.repository.exception.ComponentLookupException: org/eclipse/jetty/maven/plugin/JettyDeployWar : Unsupported major.minor version 52.0
[ERROR] -----------------------------------------------------
[ERROR] realm =    plugin>org.eclipse.jetty:jetty-maven-plugin:9.4.0.v20161208
[ERROR] strategy = org.codehaus.plexus.classworlds.strategy.SelfFirstStrategy
[ERROR] urls[0] = file:/home/jenkins/.m2/repository/org/eclipse/jetty/jetty-maven-plugin/9.4.0.v20161208/jetty-maven-plugin-9.4.0.v20161208.jar
[ERROR] urls[1] = file:/home/jenkins/.m2/repository/org/sonatype/sisu/sisu-inject-bean/2.1.1/sisu-inject-bean-2.1.1.jar
[ERROR] urls[2] = file:/home/jenkins/.m2/repository/org/sonatype/sisu/sisu-guice/2.9.4/sisu-guice-2.9.4-no_aop.jar
[ERROR] urls[3] = file:/home/jenkins/.m2/repository/org/codehaus/plexus/plexus-utils/2.0.6/plexus-utils-2.0.6.jar
[ERROR] urls[4] = file:/home/jenkins/.m2/repository/org/apache/maven/maven-aether-provider/3.0.3/maven-aether-provider-3.0.3.jar
[ERROR] urls[5] = file:/home/jenkins/.m2/repository/org/sonatype/aether/aether-util/1.11/aether-util-1.11.jar
[ERROR] urls[6] = file:/home/jenkins/.m2/repository/org/codehaus/plexus/plexus-interpolation/1.14/plexus-interpolation-1.14.jar
[ERROR] urls[7] = file:/home/jenkins/.m2/repository/org/codehaus/plexus/plexus-component-annotations/1.5.5/plexus-component-annotations-1.5.5.jar
[ERROR] urls[8] = file:/home/jenkins/.m2/repository/org/sonatype/plexus/plexus-sec-dispatcher/1.3/plexus-sec-dispatcher-1.3.jar
[ERROR] urls[9] = file:/home/jenkins/.m2/repository/org/sonatype/plexus/plexus-cipher/1.4/plexus-cipher-1.4.jar
[ERROR] urls[10] = file:/home/jenkins/.m2/repository/org/apache/maven/plugin-tools/maven-plugin-tools-api/3.4/maven-plugin-tools-api-3.4.jar
[ERROR] urls[11] = file:/home/jenkins/.m2/repository/backport-util-concurrent/backport-util-concurrent/3.1/backport-util-concurrent-3.1.jar
[ERROR] urls[12] = file:/home/jenkins/.m2/repository/org/eclipse/jetty/jetty-util/9.4.0.v20161208/jetty-util-9.4.0.v20161208.jar
[ERROR] urls[13] = file:/home/jenkins/.m2/repository/org/eclipse/jetty/jetty-webapp/9.4.0.v20161208/jetty-webapp-9.4.0.v20161208.jar
[ERROR] urls[14] = file:/home/jenkins/.m2/repository/org/eclipse/jetty/jetty-xml/9.4.0.v20161208/jetty-xml-9.4.0.v20161208.jar
[ERROR] urls[15] = file:/home/jenkins/.m2/repository/org/eclipse/jetty/jetty-servlet/9.4.0.v20161208/jetty-servlet-9.4.0.v20161208.jar
[ERROR] urls[16] = file:/home/jenkins/.m2/repository/org/eclipse/jetty/jetty-quickstart/9.4.0.v20161208/jetty-quickstart-9.4.0.v20161208.jar
[ERROR] urls[17] = file:/home/jenkins/.m2/repository/org/eclipse/jetty/jetty-jaas/9.4.0.v20161208/jetty-jaas-9.4.0.v20161208.jar
[ERROR] urls[18] = file:/home/jenkins/.m2/repository/org/eclipse/jetty/jetty-security/9.4.0.v20161208/jetty-security-9.4.0.v20161208.jar
[ERROR] urls[19] = file:/home/jenkins/.m2/repository/org/eclipse/jetty/jetty-plus/9.4.0.v20161208/jetty-plus-9.4.0.v20161208.jar
[ERROR] urls[20] = file:/home/jenkins/.m2/repository/org/eclipse/jetty/jetty-jndi/9.4.0.v20161208/jetty-jndi-9.4.0.v20161208.jar
[ERROR] urls[21] = file:/home/jenkins/.m2/repository/org/eclipse/jetty/jetty-server/9.4.0.v20161208/jetty-server-9.4.0.v20161208.jar
[ERROR] urls[22] = file:/home/jenkins/.m2/repository/javax/servlet/javax.servlet-api/3.1.0/javax.servlet-api-3.1.0.jar
[ERROR] urls[23] = file:/home/jenkins/.m2/repository/org/eclipse/jetty/jetty-http/9.4.0.v20161208/jetty-http-9.4.0.v20161208.jar
[ERROR] urls[24] = file:/home/jenkins/.m2/repository/org/eclipse/jetty/jetty-io/9.4.0.v20161208/jetty-io-9.4.0.v20161208.jar
[ERROR] urls[25] = file:/home/jenkins/.m2/repository/org/eclipse/jetty/jetty-jmx/9.4.0.v20161208/jetty-jmx-9.4.0.v20161208.jar
[ERROR] urls[26] = file:/home/jenkins/.m2/repository/org/eclipse/jetty/jetty-annotations/9.4.0.v20161208/jetty-annotations-9.4.0.v20161208.jar
[ERROR] urls[27] = file:/home/jenkins/.m2/repository/javax/annotation/javax.annotation-api/1.2/javax.annotation-api-1.2.jar
[ERROR] urls[28] = file:/home/jenkins/.m2/repository/org/ow2/asm/asm/5.1/asm-5.1.jar
[ERROR] urls[29] = file:/home/jenkins/.m2/repository/org/ow2/asm/asm-commons/5.1/asm-commons-5.1.jar
[ERROR] urls[30] = file:/home/jenkins/.m2/repository/org/ow2/asm/asm-tree/5.1/asm-tree-5.1.jar
[ERROR] urls[31] = file:/home/jenkins/.m2/repository/org/eclipse/jetty/websocket/javax-websocket-server-impl/9.4.0.v20161208/javax-websocket-server-impl-9.4.0.v20161208.jar
[ERROR] urls[32] = file:/home/jenkins/.m2/repository/org/eclipse/jetty/websocket/javax-websocket-client-impl/9.4.0.v20161208/javax-websocket-client-impl-9.4.0.v20161208.jar
[ERROR] urls[33] = file:/home/jenkins/.m2/repository/javax/websocket/javax.websocket-api/1.0/javax.websocket-api-1.0.jar
[ERROR] urls[34] = file:/home/jenkins/.m2/repository/org/eclipse/jetty/websocket/websocket-server/9.4.0.v20161208/websocket-server-9.4.0.v20161208.jar
[ERROR] urls[35] = file:/home/jenkins/.m2/repository/org/eclipse/jetty/websocket/websocket-common/9.4.0.v20161208/websocket-common-9.4.0.v20161208.jar
[ERROR] urls[36] = file:/home/jenkins/.m2/repository/org/eclipse/jetty/websocket/websocket-api/9.4.0.v20161208/websocket-api-9.4.0.v20161208.jar
[ERROR] urls[37] = file:/home/jenkins/.m2/repository/org/eclipse/jetty/websocket/websocket-client/9.4.0.v20161208/websocket-client-9.4.0.v20161208.jar
[ERROR] urls[38] = file:/home/jenkins/.m2/repository/org/eclipse/jetty/jetty-client/9.4.0.v20161208/jetty-client-9.4.0.v20161208.jar
[ERROR] urls[39] = file:/home/jenkins/.m2/repository/org/eclipse/jetty/websocket/websocket-servlet/9.4.0.v20161208/websocket-servlet-9.4.0.v20161208.jar
[ERROR] urls[40] = file:/home/jenkins/.m2/repository/org/eclipse/jetty/apache-jsp/9.4.0.v20161208/apache-jsp-9.4.0.v20161208.jar
[ERROR] urls[41] = file:/home/jenkins/.m2/repository/org/eclipse/jetty/toolchain/jetty-schemas/3.1/jetty-schemas-3.1.jar
[ERROR] urls[42] = file:/home/jenkins/.m2/repository/org/mortbay/jasper/apache-jsp/8.5.5/apache-jsp-8.5.5.jar
[ERROR] urls[43] = file:/home/jenkins/.m2/repository/org/mortbay/jasper/apache-el/8.5.5/apache-el-8.5.5.jar
[ERROR] urls[44] = file:/home/jenkins/.m2/repository/org/eclipse/jdt/core/compiler/ecj/4.4.2/ecj-4.4.2.jar
[ERROR] urls[45] = file:/home/jenkins/.m2/repository/org/eclipse/jetty/apache-jstl/9.4.0.v20161208/apache-jstl-9.4.0.v20161208.jar
[ERROR] urls[46] = file:/home/jenkins/.m2/repository/org/apache/taglibs/taglibs-standard-spec/1.2.5/taglibs-standard-spec-1.2.5.jar
[ERROR] urls[47] = file:/home/jenkins/.m2/repository/org/apache/taglibs/taglibs-standard-impl/1.2.5/taglibs-standard-impl-1.2.5.jar
[ERROR] urls[48] = file:/home/jenkins/.m2/repository/javax/transaction/javax.transaction-api/1.2/javax.transaction-api-1.2.jar
[ERROR] Number of foreign imports: 1
[ERROR] import: Entry[import  from realm ClassRealm[project>org.apache.atlas:apache-atlas:0.8.2-SNAPSHOT, parent: ClassRealm[maven.api, parent: null]]]
[ERROR] 
[ERROR] -----------------------------------------------------
[ERROR] 
[ERROR] -> [Help 1]
[ERROR] 
[ERROR] To see the full stack trace of the errors, re-run Maven with the -e switch.
[ERROR] Re-run Maven using the -X switch to enable full debug logging.
[ERROR] 
[ERROR] For more information about the errors and possible solutions, please read the following articles:
[ERROR] [Help 1] http://cwiki.apache.org/confluence/display/MAVEN/PluginContainerException
[ERROR] 
[ERROR] After correcting the problems, you can resume the build with the command
[ERROR]   mvn <goals> -rf :atlas-webapp
Build step 'Execute shell' marked build as failure
[CHECKSTYLE] Collecting checkstyle analysis files...
[CHECKSTYLE] Searching for all files in <https://builds.apache.org/job/Atlas-0.8-IntegrationTests/ws/> that match the pattern **/target/checkstyle-result.xml
[CHECKSTYLE] Parsing 22 files in <https://builds.apache.org/job/Atlas-0.8-IntegrationTests/ws/>
[CHECKSTYLE] Successfully parsed file <https://builds.apache.org/job/Atlas-0.8-IntegrationTests/ws/authorization/target/checkstyle-result.xml> with 467 unique warnings and 0 duplicates.
[CHECKSTYLE] Successfully parsed file <https://builds.apache.org/job/Atlas-0.8-IntegrationTests/ws/catalog/target/checkstyle-result.xml> with 2604 unique warnings and 0 duplicates.
[CHECKSTYLE] Successfully parsed file <https://builds.apache.org/job/Atlas-0.8-IntegrationTests/ws/client/client-v1/target/checkstyle-result.xml> with 3478 unique warnings and 0 duplicates.
[CHECKSTYLE] Successfully parsed file <https://builds.apache.org/job/Atlas-0.8-IntegrationTests/ws/client/client-v2/target/checkstyle-result.xml> with 3803 unique warnings and 0 duplicates.
[CHECKSTYLE] Successfully parsed file <https://builds.apache.org/job/Atlas-0.8-IntegrationTests/ws/client/common/target/checkstyle-result.xml> with 4260 unique warnings and 0 duplicates.
[CHECKSTYLE] Successfully parsed file <https://builds.apache.org/job/Atlas-0.8-IntegrationTests/ws/client/target/checkstyle-result.xml> with 4260 unique warnings and 0 duplicates.
[CHECKSTYLE] Successfully parsed file <https://builds.apache.org/job/Atlas-0.8-IntegrationTests/ws/common/target/checkstyle-result.xml> with 5205 unique warnings and 0 duplicates.
[CHECKSTYLE] Successfully parsed file <https://builds.apache.org/job/Atlas-0.8-IntegrationTests/ws/dashboardv2/target/checkstyle-result.xml> with 5205 unique warnings and 0 duplicates.
[CHECKSTYLE] Successfully parsed file <https://builds.apache.org/job/Atlas-0.8-IntegrationTests/ws/graphdb/api/target/checkstyle-result.xml> with 5478 unique warnings and 0 duplicates.
[CHECKSTYLE] Successfully parsed file <https://builds.apache.org/job/Atlas-0.8-IntegrationTests/ws/graphdb/common/target/checkstyle-result.xml> with 5665 unique warnings and 0 duplicates.
[CHECKSTYLE] Successfully parsed file <https://builds.apache.org/job/Atlas-0.8-IntegrationTests/ws/graphdb/graphdb-impls/target/checkstyle-result.xml> with 5665 unique warnings and 0 duplicates.
[CHECKSTYLE] Successfully parsed file <https://builds.apache.org/job/Atlas-0.8-IntegrationTests/ws/graphdb/target/checkstyle-result.xml> with 5665 unique warnings and 0 duplicates.
[CHECKSTYLE] Successfully parsed file <https://builds.apache.org/job/Atlas-0.8-IntegrationTests/ws/graphdb/titan0/target/checkstyle-result.xml> with 8067 unique warnings and 0 duplicates.
[CHECKSTYLE] Successfully parsed file <https://builds.apache.org/job/Atlas-0.8-IntegrationTests/ws/graphdb/titan1/target/checkstyle-result.xml> with 9034 unique warnings and 0 duplicates.
[CHECKSTYLE] Successfully parsed file <https://builds.apache.org/job/Atlas-0.8-IntegrationTests/ws/intg/target/checkstyle-result.xml> with 15753 unique warnings and 0 duplicates.
[CHECKSTYLE] Successfully parsed file <https://builds.apache.org/job/Atlas-0.8-IntegrationTests/ws/notification/target/checkstyle-result.xml> with 16963 unique warnings and 0 duplicates.
[CHECKSTYLE] Successfully parsed file <https://builds.apache.org/job/Atlas-0.8-IntegrationTests/ws/repository/target/checkstyle-result.xml> with 35816 unique warnings and 0 duplicates.
[CHECKSTYLE] Successfully parsed file <https://builds.apache.org/job/Atlas-0.8-IntegrationTests/ws/server-api/target/checkstyle-result.xml> with 36195 unique warnings and 0 duplicates.
[CHECKSTYLE] Successfully parsed file <https://builds.apache.org/job/Atlas-0.8-IntegrationTests/ws/shaded/hbase-client-shaded/target/checkstyle-result.xml> with 36195 unique warnings and 0 duplicates.
[CHECKSTYLE] Successfully parsed file <https://builds.apache.org/job/Atlas-0.8-IntegrationTests/ws/shaded/hbase-server-shaded/target/checkstyle-result.xml> with 36195 unique warnings and 0 duplicates.
[CHECKSTYLE] Successfully parsed file <https://builds.apache.org/job/Atlas-0.8-IntegrationTests/ws/target/checkstyle-result.xml> with 36195 unique warnings and 0 duplicates.
[CHECKSTYLE] Successfully parsed file <https://builds.apache.org/job/Atlas-0.8-IntegrationTests/ws/typesystem/target/checkstyle-result.xml> with 40413 unique warnings and 0 duplicates.
<Git Blamer> Using GitBlamer to create author and commit information for all warnings.
<Git Blamer> GIT_COMMIT=1a3a2a532efb33d71b95c93ba863bb9595073d1f, workspace=<https://builds.apache.org/job/Atlas-0.8-IntegrationTests/ws/>
 > git rev-parse 1a3a2a532efb33d71b95c93ba863bb9595073d1f^{commit} # timeout=10
[FINDBUGS] Collecting findbugs analysis files...
[FINDBUGS] Searching for all files in <https://builds.apache.org/job/Atlas-0.8-IntegrationTests/ws/> that match the pattern **/target/findbugs.xml
[FINDBUGS] Parsing 14 files in <https://builds.apache.org/job/Atlas-0.8-IntegrationTests/ws/>
[FINDBUGS] Successfully parsed file <https://builds.apache.org/job/Atlas-0.8-IntegrationTests/ws/authorization/target/findbugs.xml> with 0 unique warnings and 0 duplicates.
[FINDBUGS] Successfully parsed file <https://builds.apache.org/job/Atlas-0.8-IntegrationTests/ws/catalog/target/findbugs.xml> with 0 unique warnings and 0 duplicates.
[FINDBUGS] Successfully parsed file <https://builds.apache.org/job/Atlas-0.8-IntegrationTests/ws/client/client-v1/target/findbugs.xml> with 0 unique warnings and 0 duplicates.
[FINDBUGS] Successfully parsed file <https://builds.apache.org/job/Atlas-0.8-IntegrationTests/ws/client/client-v2/target/findbugs.xml> with 0 unique warnings and 0 duplicates.
[FINDBUGS] Successfully parsed file <https://builds.apache.org/job/Atlas-0.8-IntegrationTests/ws/client/common/target/findbugs.xml> with 0 unique warnings and 0 duplicates.
[FINDBUGS] Successfully parsed file <https://builds.apache.org/job/Atlas-0.8-IntegrationTests/ws/common/target/findbugs.xml> with 0 unique warnings and 0 duplicates.
[FINDBUGS] Successfully parsed file <https://builds.apache.org/job/Atlas-0.8-IntegrationTests/ws/graphdb/api/target/findbugs.xml> with 0 unique warnings and 0 duplicates.
[FINDBUGS] Successfully parsed file <https://builds.apache.org/job/Atlas-0.8-IntegrationTests/ws/graphdb/common/target/findbugs.xml> with 0 unique warnings and 0 duplicates.
[FINDBUGS] Successfully parsed file <https://builds.apache.org/job/Atlas-0.8-IntegrationTests/ws/graphdb/titan0/target/findbugs.xml> with 0 unique warnings and 0 duplicates.
[FINDBUGS] Successfully parsed file <https://builds.apache.org/job/Atlas-0.8-IntegrationTests/ws/intg/target/findbugs.xml> with 0 unique warnings and 0 duplicates.
[FINDBUGS] Successfully parsed file <https://builds.apache.org/job/Atlas-0.8-IntegrationTests/ws/notification/target/findbugs.xml> with 0 unique warnings and 0 duplicates.
[FINDBUGS] Successfully parsed file <https://builds.apache.org/job/Atlas-0.8-IntegrationTests/ws/repository/target/findbugs.xml> with 0 unique warnings and 0 duplicates.
[FINDBUGS] Successfully parsed file <https://builds.apache.org/job/Atlas-0.8-IntegrationTests/ws/server-api/target/findbugs.xml> with 0 unique warnings and 0 duplicates.
[FINDBUGS] Successfully parsed file <https://builds.apache.org/job/Atlas-0.8-IntegrationTests/ws/typesystem/target/findbugs.xml> with 0 unique warnings and 0 duplicates.
<Git Blamer> Using GitBlamer to create author and commit information for all warnings.
<Git Blamer> GIT_COMMIT=1a3a2a532efb33d71b95c93ba863bb9595073d1f, workspace=<https://builds.apache.org/job/Atlas-0.8-IntegrationTests/ws/>
Archiving artifacts
[Fast Archiver] No prior successful build to compare, so performing full copy of artifacts
TestNG Reports Processing: START
Looking for TestNG results report in workspace using pattern: **/target/surefire-reports/testng-results.xml,**/target/failsafe-reports/testng-results.xml
Did not find any matching files.

Mime
View raw message