atlas-dev mailing list archives

Site index · List index
Message view « Date » · « Thread »
Top « Date » · « Thread »
From Apache Jenkins Server <jenk...@builds.apache.org>
Subject Build failed in Jenkins: Atlas-master-IntegrationTests #101
Date Fri, 15 Sep 2017 16:47:48 GMT
See <https://builds.apache.org/job/Atlas-master-IntegrationTests/101/display/redirect?page=changes>

Changes:

[madhan] ATLAS-2102 : Atlas UI Improvements: Search results page. patch has

[madhan] ATLAS-2129: import fix to handle shutdown while in the middle of import

------------------------------------------
[...truncated 441.79 KB...]
127.0.0.1 - - [15/Sep/2017:16:43:25 +0000] "GET /api/atlas/v2/types/typedef/name/secure_trait
HTTP/1.1" 404 - "-" "Java/1.7.0_80"
127.0.0.1 - - [15/Sep/2017:16:43:25 +0000] "POST /api/atlas/types HTTP/1.1" 201 - "-" "Java/1.7.0_80"
127.0.0.1 - - [15/Sep/2017:16:43:25 +0000] "GET /api/atlas/v2/types/typedef/name/pii_trait
HTTP/1.1" 404 - "-" "Java/1.7.0_80"
127.0.0.1 - - [15/Sep/2017:16:43:25 +0000] "POST /api/atlas/types HTTP/1.1" 201 - "-" "Java/1.7.0_80"
127.0.0.1 - - [15/Sep/2017:16:43:25 +0000] "GET /api/atlas/v2/types/typedef/name/ssn_trait
HTTP/1.1" 404 - "-" "Java/1.7.0_80"
127.0.0.1 - - [15/Sep/2017:16:43:25 +0000] "POST /api/atlas/types HTTP/1.1" 201 - "-" "Java/1.7.0_80"
127.0.0.1 - - [15/Sep/2017:16:43:25 +0000] "GET /api/atlas/v2/types/typedef/name/salary_trait
HTTP/1.1" 404 - "-" "Java/1.7.0_80"
127.0.0.1 - - [15/Sep/2017:16:43:25 +0000] "POST /api/atlas/types HTTP/1.1" 201 - "-" "Java/1.7.0_80"
127.0.0.1 - - [15/Sep/2017:16:43:26 +0000] "GET /api/atlas/v2/types/typedef/name/sox_trait
HTTP/1.1" 404 - "-" "Java/1.7.0_80"
127.0.0.1 - - [15/Sep/2017:16:43:26 +0000] "POST /api/atlas/types HTTP/1.1" 201 - "-" "Java/1.7.0_80"
127.0.0.1 - - [15/Sep/2017:16:43:26 +0000] "GET /api/atlas/types?type=TRAIT HTTP/1.1" 200
- "-" "Java/1.7.0_80"
127.0.0.1 - - [15/Sep/2017:16:43:26 +0000] "GET /api/atlas/v2/types/typedef/name/AQD6wvP6Df3
HTTP/1.1" 404 - "-" "Java/1.7.0_80"
127.0.0.1 - - [15/Sep/2017:16:43:26 +0000] "POST /api/atlas/types HTTP/1.1" 201 - "-" "Java/1.7.0_80"
127.0.0.1 - - [15/Sep/2017:16:43:26 +0000] "GET /api/atlas/v2/types/typedef/name/A1kB6ebNZcqb
HTTP/1.1" 404 - "-" "Java/1.7.0_80"
127.0.0.1 - - [15/Sep/2017:16:43:26 +0000] "POST /api/atlas/types HTTP/1.1" 201 - "-" "Java/1.7.0_80"
127.0.0.1 - - [15/Sep/2017:16:43:27 +0000] "GET /api/atlas/v2/types/typedef/name/BrVwrfQtjCZ
HTTP/1.1" 404 - "-" "Java/1.7.0_80"
127.0.0.1 - - [15/Sep/2017:16:43:27 +0000] "POST /api/atlas/types HTTP/1.1" 201 - "-" "Java/1.7.0_80"
127.0.0.1 - - [15/Sep/2017:16:43:27 +0000] "GET /api/atlas/v2/types/typedef/name/CCh1bsDTQ3p
HTTP/1.1" 404 - "-" "Java/1.7.0_80"
127.0.0.1 - - [15/Sep/2017:16:43:27 +0000] "POST /api/atlas/types HTTP/1.1" 201 - "-" "Java/1.7.0_80"
127.0.0.1 - - [15/Sep/2017:16:43:27 +0000] "GET /api/atlas/types?type=CLASS&supertype=AQD6wvP6Df3&notsupertype=BrVwrfQtjCZ
HTTP/1.1" 200 - "-" "Java/1.7.0_80"
127.0.0.1 - - [15/Sep/2017:16:43:27 +0000] "POST /api/atlas/types HTTP/1.1" 201 - "-" "Java/1.7.0_80"
127.0.0.1 - - [15/Sep/2017:16:43:28 +0000] "PUT /api/atlas/types HTTP/1.1" 200 - "-" "Java/1.7.0_80"
127.0.0.1 - - [15/Sep/2017:16:43:28 +0000] "GET /api/atlas/types/Ql0AxNg4ga HTTP/1.1" 200
- "-" "Java/1.7.0_80"
127.0.0.1 - - [15/Sep/2017:16:43:46 +0000] "GET /api/atlas/v2/types/typedef/name/tableType
HTTP/1.1" 404 - "-" "Java/1.7.0_80"
127.0.0.1 - - [15/Sep/2017:16:43:46 +0000] "GET /api/atlas/v2/types/typedef/name/serdeType
HTTP/1.1" 404 - "-" "Java/1.7.0_80"
127.0.0.1 - - [15/Sep/2017:16:43:46 +0000] "GET /api/atlas/v2/types/typedef/name/classification
HTTP/1.1" 404 - "-" "Java/1.7.0_80"
127.0.0.1 - - [15/Sep/2017:16:43:46 +0000] "GET /api/atlas/v2/types/typedef/name/pii HTTP/1.1"
404 - "-" "Java/1.7.0_80"
127.0.0.1 - - [15/Sep/2017:16:43:46 +0000] "GET /api/atlas/v2/types/typedef/name/phi HTTP/1.1"
404 - "-" "Java/1.7.0_80"
127.0.0.1 - - [15/Sep/2017:16:43:46 +0000] "GET /api/atlas/v2/types/typedef/name/pci HTTP/1.1"
404 - "-" "Java/1.7.0_80"
127.0.0.1 - - [15/Sep/2017:16:43:46 +0000] "GET /api/atlas/v2/types/typedef/name/sox HTTP/1.1"
404 - "-" "Java/1.7.0_80"
127.0.0.1 - - [15/Sep/2017:16:43:46 +0000] "GET /api/atlas/v2/types/typedef/name/sec HTTP/1.1"
404 - "-" "Java/1.7.0_80"
127.0.0.1 - - [15/Sep/2017:16:43:46 +0000] "GET /api/atlas/v2/types/typedef/name/finance HTTP/1.1"
404 - "-" "Java/1.7.0_80"
127.0.0.1 - - [15/Sep/2017:16:43:46 +0000] "GET /api/atlas/v2/types/typedef/name/FactFQZakzMhv0
HTTP/1.1" 404 - "-" "Java/1.7.0_80"
127.0.0.1 - - [15/Sep/2017:16:43:46 +0000] "GET /api/atlas/v2/types/typedef/name/ETLApJ4WzkHVd
HTTP/1.1" 404 - "-" "Java/1.7.0_80"
127.0.0.1 - - [15/Sep/2017:16:43:46 +0000] "GET /api/atlas/v2/types/typedef/name/DimensionCAI9OtkfGS
HTTP/1.1" 404 - "-" "Java/1.7.0_80"
127.0.0.1 - - [15/Sep/2017:16:43:46 +0000] "GET /api/atlas/v2/types/typedef/name/Metricdnli3JTGi9
HTTP/1.1" 404 - "-" "Java/1.7.0_80"
127.0.0.1 - - [15/Sep/2017:16:43:46 +0000] "GET /api/atlas/v2/types/typedef/name/hive_db_v1
HTTP/1.1" 404 - "-" "Java/1.7.0_80"
127.0.0.1 - - [15/Sep/2017:16:43:46 +0000] "GET /api/atlas/v2/types/typedef/name/hive_column_v1
HTTP/1.1" 404 - "-" "Java/1.7.0_80"
127.0.0.1 - - [15/Sep/2017:16:43:46 +0000] "GET /api/atlas/v2/types/typedef/name/hive_table_v1
HTTP/1.1" 404 - "-" "Java/1.7.0_80"
127.0.0.1 - - [15/Sep/2017:16:43:46 +0000] "GET /api/atlas/v2/types/typedef/name/hive_process_v1
HTTP/1.1" 404 - "-" "Java/1.7.0_80"
127.0.0.1 - - [15/Sep/2017:16:43:46 +0000] "POST /api/atlas/types HTTP/1.1" 400 - "-" "Java/1.7.0_80"
127.0.0.1 - - [15/Sep/2017:16:43:46 +0000] "GET /api/atlas/v2/types/typedef/name/tableType
HTTP/1.1" 404 - "-" "Java/1.7.0_80"
127.0.0.1 - - [15/Sep/2017:16:43:46 +0000] "GET /api/atlas/v2/types/typedef/name/serdeType
HTTP/1.1" 404 - "-" "Java/1.7.0_80"
127.0.0.1 - - [15/Sep/2017:16:43:46 +0000] "GET /api/atlas/v2/types/typedef/name/classification
HTTP/1.1" 404 - "-" "Java/1.7.0_80"
127.0.0.1 - - [15/Sep/2017:16:43:46 +0000] "GET /api/atlas/v2/types/typedef/name/pii HTTP/1.1"
404 - "-" "Java/1.7.0_80"
127.0.0.1 - - [15/Sep/2017:16:43:46 +0000] "GET /api/atlas/v2/types/typedef/name/phi HTTP/1.1"
404 - "-" "Java/1.7.0_80"
127.0.0.1 - - [15/Sep/2017:16:43:46 +0000] "GET /api/atlas/v2/types/typedef/name/pci HTTP/1.1"
404 - "-" "Java/1.7.0_80"
127.0.0.1 - - [15/Sep/2017:16:43:46 +0000] "GET /api/atlas/v2/types/typedef/name/sox HTTP/1.1"
404 - "-" "Java/1.7.0_80"
127.0.0.1 - - [15/Sep/2017:16:43:46 +0000] "GET /api/atlas/v2/types/typedef/name/sec HTTP/1.1"
404 - "-" "Java/1.7.0_80"
127.0.0.1 - - [15/Sep/2017:16:43:46 +0000] "GET /api/atlas/v2/types/typedef/name/finance HTTP/1.1"
404 - "-" "Java/1.7.0_80"
127.0.0.1 - - [15/Sep/2017:16:43:46 +0000] "GET /api/atlas/v2/types/typedef/name/FactMVrlHbSNqn
HTTP/1.1" 404 - "-" "Java/1.7.0_80"
127.0.0.1 - - [15/Sep/2017:16:43:46 +0000] "GET /api/atlas/v2/types/typedef/name/ETLdB75tNwJjY
HTTP/1.1" 404 - "-" "Java/1.7.0_80"
127.0.0.1 - - [15/Sep/2017:16:43:46 +0000] "GET /api/atlas/v2/types/typedef/name/DimensiontcENhhzFOx
HTTP/1.1" 404 - "-" "Java/1.7.0_80"
127.0.0.1 - - [15/Sep/2017:16:43:46 +0000] "GET /api/atlas/v2/types/typedef/name/MetriczL4qXDMWxn
HTTP/1.1" 404 - "-" "Java/1.7.0_80"
127.0.0.1 - - [15/Sep/2017:16:43:46 +0000] "GET /api/atlas/v2/types/typedef/name/hive_db_v1
HTTP/1.1" 404 - "-" "Java/1.7.0_80"
127.0.0.1 - - [15/Sep/2017:16:43:46 +0000] "GET /api/atlas/v2/types/typedef/name/hive_column_v1
HTTP/1.1" 404 - "-" "Java/1.7.0_80"
127.0.0.1 - - [15/Sep/2017:16:43:46 +0000] "GET /api/atlas/v2/types/typedef/name/hive_table_v1
HTTP/1.1" 404 - "-" "Java/1.7.0_80"
127.0.0.1 - - [15/Sep/2017:16:43:46 +0000] "GET /api/atlas/v2/types/typedef/name/hive_process_v1
HTTP/1.1" 404 - "-" "Java/1.7.0_80"
127.0.0.1 - - [15/Sep/2017:16:43:46 +0000] "POST /api/atlas/types HTTP/1.1" 400 - "-" "Java/1.7.0_80"
127.0.0.1 - - [15/Sep/2017:16:43:46 +0000] "POST /api/atlas/v2/types/typedefs/ HTTP/1.1" 200
- "-" "Java/1.7.0_80"
127.0.0.1 - - [15/Sep/2017:16:43:47 +0000] "PUT /api/atlas/v2/types/typedefs/ HTTP/1.1" 200
- "-" "Java/1.7.0_80"
127.0.0.1 - - [15/Sep/2017:16:43:47 +0000] "GET /api/atlas/v2/types/typedefs/?type=ENTITY
HTTP/1.1" 200 - "-" "Java/1.7.0_80"
127.0.0.1 - - [15/Sep/2017:16:43:47 +0000] "POST /api/atlas/v2/types/typedefs/ HTTP/1.1" 200
- "-" "Java/1.7.0_80"
127.0.0.1 - - [15/Sep/2017:16:43:47 +0000] "POST /api/atlas/v2/types/typedefs/ HTTP/1.1" 409
- "-" "Java/1.7.0_80"
127.0.0.1 - - [15/Sep/2017:16:43:47 +0000] "POST /api/atlas/v2/types/typedefs/ HTTP/1.1" 200
- "-" "Java/1.7.0_80"
127.0.0.1 - - [15/Sep/2017:16:43:48 +0000] "GET /api/atlas/v2/types/typedefs/?supertype=AjBFQdpO2WA&type=CLASS
HTTP/1.1" 200 - "-" "Java/1.7.0_80"
127.0.0.1 - - [15/Sep/2017:16:43:48 +0000] "GET /api/atlas/v2/types/typedefs/?notsupertype=BbmdTRYo6WF&supertype=AjBFQdpO2WA&type=CLASS
HTTP/1.1" 200 - "-" "Java/1.7.0_80"
127.0.0.1 - - [15/Sep/2017:16:43:48 +0000] "GET /api/atlas/v2/types/enumdef/name/blah HTTP/1.1"
404 - "-" "Java/1.7.0_80"
127.0.0.1 - - [15/Sep/2017:16:43:48 +0000] "GET /api/atlas/v2/types/enumdef/guid/blah HTTP/1.1"
404 - "-" "Java/1.7.0_80"
127.0.0.1 - - [15/Sep/2017:16:43:48 +0000] "GET /api/atlas/v2/types/structdef/name/blah HTTP/1.1"
404 - "-" "Java/1.7.0_80"
127.0.0.1 - - [15/Sep/2017:16:43:48 +0000] "GET /api/atlas/v2/types/structdef/guid/blah HTTP/1.1"
404 - "-" "Java/1.7.0_80"
127.0.0.1 - - [15/Sep/2017:16:43:48 +0000] "GET /api/atlas/v2/types/classificationdef/name/blah
HTTP/1.1" 404 - "-" "Java/1.7.0_80"
127.0.0.1 - - [15/Sep/2017:16:43:48 +0000] "GET /api/atlas/v2/types/classificationdef/guid/blah
HTTP/1.1" 404 - "-" "Java/1.7.0_80"
127.0.0.1 - - [15/Sep/2017:16:43:48 +0000] "GET /api/atlas/v2/types/entitydef/name/blah HTTP/1.1"
404 - "-" "Java/1.7.0_80"
127.0.0.1 - - [15/Sep/2017:16:43:48 +0000] "GET /api/atlas/v2/types/entitydef/guid/blah HTTP/1.1"
404 - "-" "Java/1.7.0_80"
Tests run: 143, Failures: 8, Errors: 0, Skipped: 109, Time elapsed: 35.925 sec <<<
FAILURE! - in TestSuite
setUp(org.apache.atlas.web.integration.EntityDiscoveryJerseyResourceIT)  Time elapsed: 3.906
sec  <<< FAILURE!
org.apache.atlas.AtlasServiceException: Metadata service API org.apache.atlas.AtlasBaseClient$APIInfo@15562a27
failed with status 400 (Bad Request) Response Body ({"error":"Unknown datatype: hive_db"})
	at org.apache.atlas.web.integration.EntityDiscoveryJerseyResourceIT.setUp(EntityDiscoveryJerseyResourceIT.java:59)

setUp(org.apache.atlas.web.integration.EntityV2JerseyResourceIT)  Time elapsed: 0.547 sec
 <<< FAILURE!
org.apache.atlas.AtlasServiceException: Metadata service API org.apache.atlas.AtlasBaseClient$APIInfo@59a2355b
failed with status 400 (Bad Request) Response Body ({"errorCode":"ATLAS-400-00-029","errorMessage":"Given
typename Process was invalid"})
	at org.apache.atlas.web.integration.EntityV2JerseyResourceIT.setUp(EntityV2JerseyResourceIT.java:80)

setUp(org.apache.atlas.web.integration.MetadataDiscoveryJerseyResourceIT)  Time elapsed: 0.425
sec  <<< FAILURE!
org.apache.atlas.AtlasServiceException: Metadata service API org.apache.atlas.AtlasBaseClient$APIInfo@210766f8
failed with status 400 (Bad Request) Response Body ({"error":"Given typename DataSet was invalid"})
	at org.apache.atlas.web.integration.MetadataDiscoveryJerseyResourceIT.createTypes(MetadataDiscoveryJerseyResourceIT.java:237)
	at org.apache.atlas.web.integration.MetadataDiscoveryJerseyResourceIT.setUp(MetadataDiscoveryJerseyResourceIT.java:63)

runQuickStart(org.apache.atlas.examples.QuickStartIT)  Time elapsed: 2.733 sec  <<<
FAILURE!
org.apache.atlas.AtlasServiceException: Metadata service API org.apache.atlas.AtlasBaseClient$APIInfo@680792a3
failed with status 400 (Bad Request) Response Body ({"error":"Given typename DataSet was invalid"})
	at org.apache.atlas.examples.QuickStartIT.runQuickStart(QuickStartIT.java:44)

runQuickStart(org.apache.atlas.examples.QuickStartV2IT)  Time elapsed: 0.495 sec  <<<
FAILURE!
org.apache.atlas.AtlasServiceException: Metadata service API org.apache.atlas.AtlasBaseClient$APIInfo@59a2355b
failed with status 400 (Bad Request) Response Body ({"errorCode":"ATLAS-400-00-029","errorMessage":"Given
typename DataSet was invalid"})
	at org.apache.atlas.examples.QuickStartV2IT.runQuickStart(QuickStartV2IT.java:49)

setUp(org.apache.atlas.web.integration.DataSetLineageJerseyResourceIT)  Time elapsed: 0.321
sec  <<< FAILURE!
org.apache.atlas.AtlasServiceException: Metadata service API org.apache.atlas.AtlasBaseClient$APIInfo@6fda81a8
failed with status 400 (Bad Request) Response Body ({"error":"Given typename DataSet was invalid"})
	at org.apache.atlas.web.integration.DataSetLineageJerseyResourceIT.setUp(DataSetLineageJerseyResourceIT.java:56)

setUp(org.apache.atlas.notification.NotificationHookConsumerIT)  Time elapsed: 17.976 sec
 <<< FAILURE!
org.apache.atlas.AtlasServiceException: Metadata service API org.apache.atlas.AtlasBaseClient$APIInfo@27f044f8
failed with status 400 (Bad Request) Response Body ({"error":"Given typename DataSet was invalid"})
	at org.apache.atlas.notification.NotificationHookConsumerIT.setUp(NotificationHookConsumerIT.java:55)

setUp(org.apache.atlas.web.integration.EntityJerseyResourceIT)  Time elapsed: 0.298 sec  <<<
FAILURE!
org.apache.atlas.AtlasServiceException: Metadata service API org.apache.atlas.AtlasBaseClient$APIInfo@11b62503
failed with status 400 (Bad Request) Response Body ({"error":"Given typename DataSet was invalid"})
	at org.apache.atlas.web.integration.EntityJerseyResourceIT.setUp(EntityJerseyResourceIT.java:89)


Results :

Failed tests: 
  QuickStartIT.runQuickStart:44 » AtlasService Metadata service API org.apache.a...
  QuickStartV2IT.runQuickStart:49 » AtlasService Metadata service API org.apache...
  NotificationHookConsumerIT.setUp:55->BaseResourceIT.createTypeDefinitionsV1:357->BaseResourceIT.createType:204
» AtlasService
  DataSetLineageJerseyResourceIT.setUp:56->BaseResourceIT.createTypeDefinitionsV1:357->BaseResourceIT.createType:204
» AtlasService
  EntityDiscoveryJerseyResourceIT.setUp:59->BaseResourceIT.createInstance:215 » AtlasService
  EntityJerseyResourceIT.setUp:89->BaseResourceIT.createTypeDefinitionsV1:357->BaseResourceIT.createType:204
» AtlasService
  EntityV2JerseyResourceIT.setUp:80->BaseResourceIT.createTypeDefinitionsV2:454->BaseResourceIT.batchCreateTypes:157
» AtlasService
  MetadataDiscoveryJerseyResourceIT.setUp:63->createTypes:237->BaseResourceIT.createTypeDefinitionsV1:357->BaseResourceIT.createType:204
» AtlasService

Tests run: 142, Failures: 8, Errors: 0, Skipped: 108

[INFO] 
[INFO] --- jetty-maven-plugin:9.2.12.v20150709:stop (stop-jetty) @ atlas-webapp ---
[INFO] Waiting 10 seconds for jetty to stop
[INFO] Stopped ServerConnector@16693393{HTTP/1.1}{0.0.0.0:31000}
[INFO] Closing Spring root WebApplicationContext
[INFO] Shutting down log4j
[INFO] Stopped o.e.j.m.p.JettyWebAppContext@1d612b50{/,<https://builds.apache.org/job/Atlas-master-IntegrationTests/ws/webapp/target/atlas-webapp-0.9-SNAPSHOT/,UNAVAILABLE}{/home/jenkins/jenkins-slave/workspace/Atlas-master-IntegrationTests/webapp/target/atlas-webapp-0.9-SNAPSHOT.war}>
[INFO] Server reports itself as stopped
[INFO] 
[INFO] --- maven-source-plugin:2.4:jar-no-fork (attach-sources) @ atlas-webapp ---
[INFO] Building jar: <https://builds.apache.org/job/Atlas-master-IntegrationTests/ws/webapp/target/atlas-webapp-0.9-SNAPSHOT-sources.jar>
log4j:WARN No appenders could be found for logger (org.apache.zookeeper.ClientCnxn).
log4j:WARN Please initialize the log4j system properly.
log4j:WARN See http://logging.apache.org/log4j/1.2/faq.html#noconfig for more info.
[INFO] 
[INFO] --- maven-source-plugin:2.4:test-jar-no-fork (attach-sources) @ atlas-webapp ---
[INFO] Building jar: <https://builds.apache.org/job/Atlas-master-IntegrationTests/ws/webapp/target/atlas-webapp-0.9-SNAPSHOT-test-sources.jar>
[INFO] 
[INFO] --- maven-failsafe-plugin:2.19.1:verify (verify) @ atlas-webapp ---
[INFO] ------------------------------------------------------------------------
[INFO] Reactor Summary:
[INFO] 
[INFO] Apache Atlas Server Build Tools .................... SUCCESS [  0.832 s]
[INFO] apache-atlas ....................................... SUCCESS [  5.101 s]
[INFO] Apache Atlas Integration ........................... SUCCESS [ 28.127 s]
[INFO] Apache Atlas Common ................................ SUCCESS [ 14.134 s]
[INFO] Apache Atlas Typesystem ............................ SUCCESS [01:04 min]
[INFO] Apache Atlas Client ................................ SUCCESS [ 16.264 s]
[INFO] Apache Atlas Server API ............................ SUCCESS [  9.433 s]
[INFO] Apache Atlas Notification .......................... SUCCESS [ 14.939 s]
[INFO] Apache Atlas Graph Database Projects ............... SUCCESS [  0.571 s]
[INFO] Apache Atlas Graph Database API .................... SUCCESS [  7.320 s]
[INFO] Graph Database Common Code ......................... SUCCESS [  8.540 s]
[INFO] Apache Atlas Titan 1.0.0 GraphDB Impl .............. SUCCESS [ 31.586 s]
[INFO] Shaded version of Apache hbase client .............. SUCCESS [  8.540 s]
[INFO] Apache Atlas Titan 0.5.4 Graph DB Impl ............. SUCCESS [ 44.646 s]
[INFO] Apache Atlas Graph Database Implementation Dependencies SUCCESS [  0.659 s]
[INFO] Shaded version of Apache hbase server .............. SUCCESS [ 24.057 s]
[INFO] Apache Atlas Repository ............................ SUCCESS [01:45 min]
[INFO] Apache Atlas Authorization ......................... SUCCESS [ 10.757 s]
[INFO] Apache Atlas Business Catalog ...................... SUCCESS [ 16.165 s]
[INFO] Apache Atlas UI .................................... SUCCESS [01:33 min]
[INFO] Apache Atlas Web Application ....................... FAILURE [02:04 min]
[INFO] Apache Atlas Documentation ......................... SKIPPED
[INFO] Apache Atlas FileSystem Model ...................... SKIPPED
[INFO] Apache Atlas Plugin Classloader .................... SKIPPED
[INFO] Apache Atlas Hive Bridge Shim ...................... SKIPPED
[INFO] Apache Atlas Hive Bridge ........................... SKIPPED
[INFO] Apache Atlas Falcon Bridge Shim .................... SKIPPED
[INFO] Apache Atlas Falcon Bridge ......................... SKIPPED
[INFO] Apache Atlas Sqoop Bridge Shim ..................... SKIPPED
[INFO] Apache Atlas Sqoop Bridge .......................... SKIPPED
[INFO] Apache Atlas Storm Bridge Shim ..................... SKIPPED
[INFO] Apache Atlas Storm Bridge .......................... SKIPPED
[INFO] Apache Atlas Distribution .......................... SKIPPED
[INFO] ------------------------------------------------------------------------
[INFO] BUILD FAILURE
[INFO] ------------------------------------------------------------------------
[INFO] Total time: 10:31 min
[INFO] Finished at: 2017-09-15T16:43:52Z
[INFO] Final Memory: 330M/1842M
[INFO] ------------------------------------------------------------------------
[ERROR] Failed to execute goal org.apache.maven.plugins:maven-failsafe-plugin:2.19.1:verify
(verify) on project atlas-webapp: There are test failures.
[ERROR] 
[ERROR] Please refer to <https://builds.apache.org/job/Atlas-master-IntegrationTests/ws/webapp/target/failsafe-reports>
for the individual test results.
[ERROR] -> [Help 1]
[ERROR] 
[ERROR] To see the full stack trace of the errors, re-run Maven with the -e switch.
[ERROR] Re-run Maven using the -X switch to enable full debug logging.
[ERROR] 
[ERROR] For more information about the errors and possible solutions, please read the following
articles:
[ERROR] [Help 1] http://cwiki.apache.org/confluence/display/MAVEN/MojoFailureException
[ERROR] 
[ERROR] After correcting the problems, you can resume the build with the command
[ERROR]   mvn <goals> -rf :atlas-webapp
Build step 'Execute shell' marked build as failure
[CHECKSTYLE] Collecting checkstyle analysis files...
[CHECKSTYLE] Searching for all files in <https://builds.apache.org/job/Atlas-master-IntegrationTests/ws/>
that match the pattern **/target/checkstyle-result.xml
[CHECKSTYLE] Parsing 19 files in <https://builds.apache.org/job/Atlas-master-IntegrationTests/ws/>
[CHECKSTYLE] Successfully parsed file <https://builds.apache.org/job/Atlas-master-IntegrationTests/ws/authorization/target/checkstyle-result.xml>
with 467 unique warnings and 0 duplicates.
[CHECKSTYLE] Successfully parsed file <https://builds.apache.org/job/Atlas-master-IntegrationTests/ws/catalog/target/checkstyle-result.xml>
with 2604 unique warnings and 0 duplicates.
[CHECKSTYLE] Successfully parsed file <https://builds.apache.org/job/Atlas-master-IntegrationTests/ws/client/target/checkstyle-result.xml>
with 4241 unique warnings and 0 duplicates.
[CHECKSTYLE] Successfully parsed file <https://builds.apache.org/job/Atlas-master-IntegrationTests/ws/common/target/checkstyle-result.xml>
with 5453 unique warnings and 0 duplicates.
[CHECKSTYLE] Successfully parsed file <https://builds.apache.org/job/Atlas-master-IntegrationTests/ws/dashboardv2/target/checkstyle-result.xml>
with 5453 unique warnings and 0 duplicates.
[CHECKSTYLE] Successfully parsed file <https://builds.apache.org/job/Atlas-master-IntegrationTests/ws/graphdb/api/target/checkstyle-result.xml>
with 5722 unique warnings and 0 duplicates.
[CHECKSTYLE] Successfully parsed file <https://builds.apache.org/job/Atlas-master-IntegrationTests/ws/graphdb/common/target/checkstyle-result.xml>
with 5909 unique warnings and 0 duplicates.
[CHECKSTYLE] Successfully parsed file <https://builds.apache.org/job/Atlas-master-IntegrationTests/ws/graphdb/graphdb-impls/target/checkstyle-result.xml>
with 5909 unique warnings and 0 duplicates.
[CHECKSTYLE] Successfully parsed file <https://builds.apache.org/job/Atlas-master-IntegrationTests/ws/graphdb/target/checkstyle-result.xml>
with 5909 unique warnings and 0 duplicates.
[CHECKSTYLE] Successfully parsed file <https://builds.apache.org/job/Atlas-master-IntegrationTests/ws/graphdb/titan0/target/checkstyle-result.xml>
with 8294 unique warnings and 0 duplicates.
[CHECKSTYLE] Successfully parsed file <https://builds.apache.org/job/Atlas-master-IntegrationTests/ws/graphdb/titan1/target/checkstyle-result.xml>
with 9242 unique warnings and 0 duplicates.
[CHECKSTYLE] Successfully parsed file <https://builds.apache.org/job/Atlas-master-IntegrationTests/ws/intg/target/checkstyle-result.xml>
with 17049 unique warnings and 0 duplicates.
[CHECKSTYLE] Successfully parsed file <https://builds.apache.org/job/Atlas-master-IntegrationTests/ws/notification/target/checkstyle-result.xml>
with 18259 unique warnings and 0 duplicates.
[CHECKSTYLE] Successfully parsed file <https://builds.apache.org/job/Atlas-master-IntegrationTests/ws/repository/target/checkstyle-result.xml>
with 38084 unique warnings and 0 duplicates.
[CHECKSTYLE] Successfully parsed file <https://builds.apache.org/job/Atlas-master-IntegrationTests/ws/server-api/target/checkstyle-result.xml>
with 38463 unique warnings and 0 duplicates.
[CHECKSTYLE] Successfully parsed file <https://builds.apache.org/job/Atlas-master-IntegrationTests/ws/shaded/hbase-client-shaded/target/checkstyle-result.xml>
with 38463 unique warnings and 0 duplicates.
[CHECKSTYLE] Successfully parsed file <https://builds.apache.org/job/Atlas-master-IntegrationTests/ws/shaded/hbase-server-shaded/target/checkstyle-result.xml>
with 38463 unique warnings and 0 duplicates.
[CHECKSTYLE] Successfully parsed file <https://builds.apache.org/job/Atlas-master-IntegrationTests/ws/target/checkstyle-result.xml>
with 38463 unique warnings and 0 duplicates.
[CHECKSTYLE] Successfully parsed file <https://builds.apache.org/job/Atlas-master-IntegrationTests/ws/typesystem/target/checkstyle-result.xml>
with 42681 unique warnings and 0 duplicates.
<Git Blamer> Using GitBlamer to create author and commit information for all warnings.
<Git Blamer> GIT_COMMIT=c623835f5376bdb04797ba9cb886da70fbef0f8c, workspace=<https://builds.apache.org/job/Atlas-master-IntegrationTests/ws/>
 > git rev-parse c623835f5376bdb04797ba9cb886da70fbef0f8c^{commit} # timeout=10
[FINDBUGS] Collecting findbugs analysis files...
[FINDBUGS] Searching for all files in <https://builds.apache.org/job/Atlas-master-IntegrationTests/ws/>
that match the pattern **/target/findbugs.xml
[FINDBUGS] Parsing 12 files in <https://builds.apache.org/job/Atlas-master-IntegrationTests/ws/>
[FINDBUGS] Successfully parsed file <https://builds.apache.org/job/Atlas-master-IntegrationTests/ws/authorization/target/findbugs.xml>
with 0 unique warnings and 0 duplicates.
[FINDBUGS] Successfully parsed file <https://builds.apache.org/job/Atlas-master-IntegrationTests/ws/catalog/target/findbugs.xml>
with 0 unique warnings and 0 duplicates.
[FINDBUGS] Successfully parsed file <https://builds.apache.org/job/Atlas-master-IntegrationTests/ws/client/target/findbugs.xml>
with 0 unique warnings and 0 duplicates.
[FINDBUGS] Successfully parsed file <https://builds.apache.org/job/Atlas-master-IntegrationTests/ws/common/target/findbugs.xml>
with 0 unique warnings and 0 duplicates.
[FINDBUGS] Successfully parsed file <https://builds.apache.org/job/Atlas-master-IntegrationTests/ws/graphdb/api/target/findbugs.xml>
with 0 unique warnings and 0 duplicates.
[FINDBUGS] Successfully parsed file <https://builds.apache.org/job/Atlas-master-IntegrationTests/ws/graphdb/common/target/findbugs.xml>
with 0 unique warnings and 0 duplicates.
[FINDBUGS] Successfully parsed file <https://builds.apache.org/job/Atlas-master-IntegrationTests/ws/graphdb/titan0/target/findbugs.xml>
with 0 unique warnings and 0 duplicates.
[FINDBUGS] Successfully parsed file <https://builds.apache.org/job/Atlas-master-IntegrationTests/ws/intg/target/findbugs.xml>
with 0 unique warnings and 0 duplicates.
[FINDBUGS] Successfully parsed file <https://builds.apache.org/job/Atlas-master-IntegrationTests/ws/notification/target/findbugs.xml>
with 0 unique warnings and 0 duplicates.
[FINDBUGS] Successfully parsed file <https://builds.apache.org/job/Atlas-master-IntegrationTests/ws/repository/target/findbugs.xml>
with 0 unique warnings and 0 duplicates.
[FINDBUGS] Successfully parsed file <https://builds.apache.org/job/Atlas-master-IntegrationTests/ws/server-api/target/findbugs.xml>
with 0 unique warnings and 0 duplicates.
[FINDBUGS] Successfully parsed file <https://builds.apache.org/job/Atlas-master-IntegrationTests/ws/typesystem/target/findbugs.xml>
with 0 unique warnings and 0 duplicates.
<Git Blamer> Using GitBlamer to create author and commit information for all warnings.
<Git Blamer> GIT_COMMIT=c623835f5376bdb04797ba9cb886da70fbef0f8c, workspace=<https://builds.apache.org/job/Atlas-master-IntegrationTests/ws/>
Archiving artifacts
[Fast Archiver] No prior successful build to compare, so performing full copy of artifacts
TestNG Reports Processing: START
Looking for TestNG results report in workspace using pattern: **/target/surefire-reports/testng-results.xml,**/target/failsafe-reports/testng-results.xml
Saving reports...
Processing '/x1/jenkins/jenkins-home/jobs/Atlas-master-IntegrationTests/builds/101/testng/testng-results.xml'
TestNG Reports Processing: FINISH

Mime
View raw message