atlas-dev mailing list archives

Site index · List index
Message view « Date » · « Thread »
Top « Date » · « Thread »
From Apache Jenkins Server <jenk...@builds.apache.org>
Subject Build failed in Jenkins: Atlas-master-IntegrationTests #104
Date Sun, 17 Sep 2017 23:47:54 GMT
See <https://builds.apache.org/job/Atlas-master-IntegrationTests/104/display/redirect?page=changes>

Changes:

[madhan] ATLAS-2100: UserProfile & SavedSearch API implementation

[madhan] ATLAS-2141: edit/disassociate tag results in NPE

------------------------------------------
[...truncated 442.47 KB...]
127.0.0.1 - - [17/Sep/2017:23:43:14 +0000] "GET /api/atlas/v2/types/typedef/name/MetricfzOLxq8wxz
HTTP/1.1" 404 - "-" "Java/1.7.0_80"
127.0.0.1 - - [17/Sep/2017:23:43:14 +0000] "GET /api/atlas/v2/types/typedef/name/hive_db_v1
HTTP/1.1" 404 - "-" "Java/1.7.0_80"
127.0.0.1 - - [17/Sep/2017:23:43:14 +0000] "GET /api/atlas/v2/types/typedef/name/hive_column_v1
HTTP/1.1" 404 - "-" "Java/1.7.0_80"
127.0.0.1 - - [17/Sep/2017:23:43:14 +0000] "GET /api/atlas/v2/types/typedef/name/hive_table_v1
HTTP/1.1" 404 - "-" "Java/1.7.0_80"
127.0.0.1 - - [17/Sep/2017:23:43:14 +0000] "GET /api/atlas/v2/types/typedef/name/hive_process_v1
HTTP/1.1" 404 - "-" "Java/1.7.0_80"
127.0.0.1 - - [17/Sep/2017:23:43:14 +0000] "POST /api/atlas/types HTTP/1.1" 400 - "-" "Java/1.7.0_80"
127.0.0.1 - - [17/Sep/2017:23:43:14 +0000] "GET /api/atlas/v2/types/typedef/name/tableType
HTTP/1.1" 404 - "-" "Java/1.7.0_80"
127.0.0.1 - - [17/Sep/2017:23:43:14 +0000] "GET /api/atlas/v2/types/typedef/name/serdeType
HTTP/1.1" 404 - "-" "Java/1.7.0_80"
127.0.0.1 - - [17/Sep/2017:23:43:14 +0000] "GET /api/atlas/v2/types/typedef/name/classification
HTTP/1.1" 404 - "-" "Java/1.7.0_80"
127.0.0.1 - - [17/Sep/2017:23:43:14 +0000] "GET /api/atlas/v2/types/typedef/name/pii HTTP/1.1"
404 - "-" "Java/1.7.0_80"
127.0.0.1 - - [17/Sep/2017:23:43:14 +0000] "GET /api/atlas/v2/types/typedef/name/phi HTTP/1.1"
404 - "-" "Java/1.7.0_80"
127.0.0.1 - - [17/Sep/2017:23:43:14 +0000] "GET /api/atlas/v2/types/typedef/name/pci HTTP/1.1"
404 - "-" "Java/1.7.0_80"
127.0.0.1 - - [17/Sep/2017:23:43:14 +0000] "GET /api/atlas/v2/types/typedef/name/sox HTTP/1.1"
404 - "-" "Java/1.7.0_80"
127.0.0.1 - - [17/Sep/2017:23:43:14 +0000] "GET /api/atlas/v2/types/typedef/name/sec HTTP/1.1"
404 - "-" "Java/1.7.0_80"
127.0.0.1 - - [17/Sep/2017:23:43:14 +0000] "GET /api/atlas/v2/types/typedef/name/finance HTTP/1.1"
404 - "-" "Java/1.7.0_80"
127.0.0.1 - - [17/Sep/2017:23:43:14 +0000] "GET /api/atlas/v2/types/typedef/name/FacthrOgbEi6GU
HTTP/1.1" 404 - "-" "Java/1.7.0_80"
127.0.0.1 - - [17/Sep/2017:23:43:14 +0000] "GET /api/atlas/v2/types/typedef/name/ETLn9z8wthzcV
HTTP/1.1" 404 - "-" "Java/1.7.0_80"
127.0.0.1 - - [17/Sep/2017:23:43:14 +0000] "GET /api/atlas/v2/types/typedef/name/DimensionxuOH1I0p72
HTTP/1.1" 404 - "-" "Java/1.7.0_80"
127.0.0.1 - - [17/Sep/2017:23:43:14 +0000] "GET /api/atlas/v2/types/typedef/name/MetriciLPM7N4kI8
HTTP/1.1" 404 - "-" "Java/1.7.0_80"
127.0.0.1 - - [17/Sep/2017:23:43:14 +0000] "GET /api/atlas/v2/types/typedef/name/hive_db_v1
HTTP/1.1" 404 - "-" "Java/1.7.0_80"
127.0.0.1 - - [17/Sep/2017:23:43:14 +0000] "GET /api/atlas/v2/types/typedef/name/hive_column_v1
HTTP/1.1" 404 - "-" "Java/1.7.0_80"
127.0.0.1 - - [17/Sep/2017:23:43:14 +0000] "GET /api/atlas/v2/types/typedef/name/hive_table_v1
HTTP/1.1" 404 - "-" "Java/1.7.0_80"
127.0.0.1 - - [17/Sep/2017:23:43:14 +0000] "GET /api/atlas/v2/types/typedef/name/hive_process_v1
HTTP/1.1" 404 - "-" "Java/1.7.0_80"
127.0.0.1 - - [17/Sep/2017:23:43:14 +0000] "POST /api/atlas/types HTTP/1.1" 400 - "-" "Java/1.7.0_80"
127.0.0.1 - - [17/Sep/2017:23:43:14 +0000] "POST /api/atlas/v2/types/typedefs/ HTTP/1.1" 200
- "-" "Java/1.7.0_80"
127.0.0.1 - - [17/Sep/2017:23:43:15 +0000] "POST /api/atlas/v2/types/typedefs/ HTTP/1.1" 409
- "-" "Java/1.7.0_80"
127.0.0.1 - - [17/Sep/2017:23:43:15 +0000] "GET /api/atlas/v2/types/enumdef/name/blah HTTP/1.1"
404 - "-" "Java/1.7.0_80"
127.0.0.1 - - [17/Sep/2017:23:43:15 +0000] "GET /api/atlas/v2/types/enumdef/guid/blah HTTP/1.1"
404 - "-" "Java/1.7.0_80"
127.0.0.1 - - [17/Sep/2017:23:43:15 +0000] "GET /api/atlas/v2/types/structdef/name/blah HTTP/1.1"
404 - "-" "Java/1.7.0_80"
127.0.0.1 - - [17/Sep/2017:23:43:15 +0000] "GET /api/atlas/v2/types/structdef/guid/blah HTTP/1.1"
404 - "-" "Java/1.7.0_80"
127.0.0.1 - - [17/Sep/2017:23:43:15 +0000] "GET /api/atlas/v2/types/classificationdef/name/blah
HTTP/1.1" 404 - "-" "Java/1.7.0_80"
127.0.0.1 - - [17/Sep/2017:23:43:15 +0000] "GET /api/atlas/v2/types/classificationdef/guid/blah
HTTP/1.1" 404 - "-" "Java/1.7.0_80"
127.0.0.1 - - [17/Sep/2017:23:43:15 +0000] "GET /api/atlas/v2/types/entitydef/name/blah HTTP/1.1"
404 - "-" "Java/1.7.0_80"
127.0.0.1 - - [17/Sep/2017:23:43:15 +0000] "GET /api/atlas/v2/types/entitydef/guid/blah HTTP/1.1"
404 - "-" "Java/1.7.0_80"
127.0.0.1 - - [17/Sep/2017:23:43:15 +0000] "POST /api/atlas/v2/types/typedefs/ HTTP/1.1" 200
- "-" "Java/1.7.0_80"
127.0.0.1 - - [17/Sep/2017:23:43:15 +0000] "GET /api/atlas/v2/types/typedefs/?supertype=ANAhkYY8nCi&type=CLASS
HTTP/1.1" 200 - "-" "Java/1.7.0_80"
127.0.0.1 - - [17/Sep/2017:23:43:16 +0000] "GET /api/atlas/v2/types/typedefs/?notsupertype=BdCXNtv22Et&supertype=ANAhkYY8nCi&type=CLASS
HTTP/1.1" 200 - "-" "Java/1.7.0_80"
127.0.0.1 - - [17/Sep/2017:23:43:16 +0000] "POST /api/atlas/v2/types/typedefs/ HTTP/1.1" 200
- "-" "Java/1.7.0_80"
127.0.0.1 - - [17/Sep/2017:23:43:16 +0000] "PUT /api/atlas/v2/types/typedefs/ HTTP/1.1" 200
- "-" "Java/1.7.0_80"
127.0.0.1 - - [17/Sep/2017:23:43:16 +0000] "GET /api/atlas/v2/types/typedefs/?type=ENTITY
HTTP/1.1" 200 - "-" "Java/1.7.0_80"
127.0.0.1 - - [17/Sep/2017:23:43:16 +0000] "POST /api/atlas/types HTTP/1.1" 201 - "-" "Java/1.7.0_80"
127.0.0.1 - - [17/Sep/2017:23:43:16 +0000] "POST /api/atlas/types HTTP/1.1" 409 - "-" "Java/1.7.0_80"
127.0.0.1 - - [17/Sep/2017:23:43:16 +0000] "GET /api/atlas/v2/types/typedef/name/class_trait
HTTP/1.1" 404 - "-" "Java/1.7.0_80"
127.0.0.1 - - [17/Sep/2017:23:43:16 +0000] "POST /api/atlas/types HTTP/1.1" 201 - "-" "Java/1.7.0_80"
127.0.0.1 - - [17/Sep/2017:23:43:17 +0000] "GET /api/atlas/v2/types/typedef/name/secure_trait
HTTP/1.1" 404 - "-" "Java/1.7.0_80"
127.0.0.1 - - [17/Sep/2017:23:43:17 +0000] "POST /api/atlas/types HTTP/1.1" 201 - "-" "Java/1.7.0_80"
127.0.0.1 - - [17/Sep/2017:23:43:17 +0000] "GET /api/atlas/v2/types/typedef/name/pii_trait
HTTP/1.1" 404 - "-" "Java/1.7.0_80"
127.0.0.1 - - [17/Sep/2017:23:43:17 +0000] "POST /api/atlas/types HTTP/1.1" 201 - "-" "Java/1.7.0_80"
127.0.0.1 - - [17/Sep/2017:23:43:17 +0000] "GET /api/atlas/v2/types/typedef/name/ssn_trait
HTTP/1.1" 404 - "-" "Java/1.7.0_80"
127.0.0.1 - - [17/Sep/2017:23:43:17 +0000] "POST /api/atlas/types HTTP/1.1" 201 - "-" "Java/1.7.0_80"
127.0.0.1 - - [17/Sep/2017:23:43:17 +0000] "GET /api/atlas/v2/types/typedef/name/salary_trait
HTTP/1.1" 404 - "-" "Java/1.7.0_80"
127.0.0.1 - - [17/Sep/2017:23:43:17 +0000] "POST /api/atlas/types HTTP/1.1" 201 - "-" "Java/1.7.0_80"
127.0.0.1 - - [17/Sep/2017:23:43:17 +0000] "GET /api/atlas/v2/types/typedef/name/sox_trait
HTTP/1.1" 404 - "-" "Java/1.7.0_80"
127.0.0.1 - - [17/Sep/2017:23:43:17 +0000] "POST /api/atlas/types HTTP/1.1" 201 - "-" "Java/1.7.0_80"
127.0.0.1 - - [17/Sep/2017:23:43:17 +0000] "GET /api/atlas/types?type=TRAIT HTTP/1.1" 200
- "-" "Java/1.7.0_80"
127.0.0.1 - - [17/Sep/2017:23:43:17 +0000] "POST /api/atlas/types HTTP/1.1" 201 - "-" "Java/1.7.0_80"
127.0.0.1 - - [17/Sep/2017:23:43:18 +0000] "PUT /api/atlas/types HTTP/1.1" 200 - "-" "Java/1.7.0_80"
127.0.0.1 - - [17/Sep/2017:23:43:18 +0000] "GET /api/atlas/types/J58rFPFMAy HTTP/1.1" 200
- "-" "Java/1.7.0_80"
127.0.0.1 - - [17/Sep/2017:23:43:18 +0000] "GET /api/atlas/v2/types/typedef/name/AguBMf4I7Ay
HTTP/1.1" 404 - "-" "Java/1.7.0_80"
127.0.0.1 - - [17/Sep/2017:23:43:18 +0000] "POST /api/atlas/types HTTP/1.1" 201 - "-" "Java/1.7.0_80"
127.0.0.1 - - [17/Sep/2017:23:43:18 +0000] "GET /api/atlas/v2/types/typedef/name/A1JPGHBqOZ50
HTTP/1.1" 404 - "-" "Java/1.7.0_80"
127.0.0.1 - - [17/Sep/2017:23:43:18 +0000] "POST /api/atlas/types HTTP/1.1" 201 - "-" "Java/1.7.0_80"
127.0.0.1 - - [17/Sep/2017:23:43:18 +0000] "GET /api/atlas/v2/types/typedef/name/BZqnaC6pAvY
HTTP/1.1" 404 - "-" "Java/1.7.0_80"
127.0.0.1 - - [17/Sep/2017:23:43:18 +0000] "POST /api/atlas/types HTTP/1.1" 201 - "-" "Java/1.7.0_80"
127.0.0.1 - - [17/Sep/2017:23:43:19 +0000] "GET /api/atlas/v2/types/typedef/name/CsHd31TIUvT
HTTP/1.1" 404 - "-" "Java/1.7.0_80"
127.0.0.1 - - [17/Sep/2017:23:43:19 +0000] "POST /api/atlas/types HTTP/1.1" 201 - "-" "Java/1.7.0_80"
127.0.0.1 - - [17/Sep/2017:23:43:19 +0000] "GET /api/atlas/types?type=CLASS&supertype=AguBMf4I7Ay&notsupertype=BZqnaC6pAvY
HTTP/1.1" 200 - "-" "Java/1.7.0_80"
127.0.0.1 - - [17/Sep/2017:23:43:19 +0000] "GET /api/atlas/types/blah HTTP/1.1" 404 - "-"
"Java/1.7.0_80"
127.0.0.1 - - [17/Sep/2017:23:43:20 +0000] "POST /api/atlas/v2/types/typedefs/ HTTP/1.1" 400
- "-" "Java/1.7.0_80"
127.0.0.1 - - [17/Sep/2017:23:43:21 +0000] "POST /api/atlas/types HTTP/1.1" 400 - "-" "Java/1.7.0_80"
127.0.0.1 - - [17/Sep/2017:23:43:21 +0000] "GET /api/atlas/admin/status HTTP/1.1" 200 - "-"
"Java/1.7.0_80"
127.0.0.1 - - [17/Sep/2017:23:43:21 +0000] "GET /api/atlas/admin/session HTTP/1.1" 200 - "-"
"Java/1.7.0_80"
127.0.0.1 - - [17/Sep/2017:23:43:21 +0000] "GET /api/atlas/v1/taxonomies HTTP/1.1" 403 493
"-" "Java/1.7.0_80"
127.0.0.1 - - [17/Sep/2017:23:43:21 +0000] "GET /api/atlas/admin/session HTTP/1.1" 401 317
"-" "Java/1.7.0_80"
127.0.0.1 - - [17/Sep/2017:23:43:21 +0000] "GET /api/atlas/admin/version HTTP/1.1" 200 - "-"
"Java/1.7.0_80"
Tests run: 143, Failures: 8, Errors: 0, Skipped: 109, Time elapsed: 34.254 sec <<<
FAILURE! - in TestSuite
setUp(org.apache.atlas.web.integration.EntityDiscoveryJerseyResourceIT)  Time elapsed: 4.048
sec  <<< FAILURE!
org.apache.atlas.AtlasServiceException: Metadata service API org.apache.atlas.AtlasBaseClient$APIInfo@1f99cb3f
failed with status 400 (Bad Request) Response Body ({"error":"Unknown datatype: hive_db"})
	at org.apache.atlas.web.integration.EntityDiscoveryJerseyResourceIT.setUp(EntityDiscoveryJerseyResourceIT.java:59)

setUp(org.apache.atlas.web.integration.EntityV2JerseyResourceIT)  Time elapsed: 0.527 sec
 <<< FAILURE!
org.apache.atlas.AtlasServiceException: Metadata service API org.apache.atlas.AtlasBaseClient$APIInfo@324d03a1
failed with status 400 (Bad Request) Response Body ({"errorCode":"ATLAS-400-00-029","errorMessage":"Given
typename Process was invalid"})
	at org.apache.atlas.web.integration.EntityV2JerseyResourceIT.setUp(EntityV2JerseyResourceIT.java:80)

setUp(org.apache.atlas.web.integration.MetadataDiscoveryJerseyResourceIT)  Time elapsed: 0.461
sec  <<< FAILURE!
org.apache.atlas.AtlasServiceException: Metadata service API org.apache.atlas.AtlasBaseClient$APIInfo@79e5c63a
failed with status 400 (Bad Request) Response Body ({"error":"Given typename DataSet was invalid"})
	at org.apache.atlas.web.integration.MetadataDiscoveryJerseyResourceIT.createTypes(MetadataDiscoveryJerseyResourceIT.java:237)
	at org.apache.atlas.web.integration.MetadataDiscoveryJerseyResourceIT.setUp(MetadataDiscoveryJerseyResourceIT.java:63)

setUp(org.apache.atlas.notification.NotificationHookConsumerIT)  Time elapsed: 0.325 sec 
<<< FAILURE!
org.apache.atlas.AtlasServiceException: Metadata service API org.apache.atlas.AtlasBaseClient$APIInfo@2478dc7
failed with status 400 (Bad Request) Response Body ({"error":"Given typename DataSet was invalid"})
	at org.apache.atlas.notification.NotificationHookConsumerIT.setUp(NotificationHookConsumerIT.java:55)

setUp(org.apache.atlas.web.integration.DataSetLineageJerseyResourceIT)  Time elapsed: 0.296
sec  <<< FAILURE!
org.apache.atlas.AtlasServiceException: Metadata service API org.apache.atlas.AtlasBaseClient$APIInfo@6e5f733b
failed with status 400 (Bad Request) Response Body ({"error":"Given typename DataSet was invalid"})
	at org.apache.atlas.web.integration.DataSetLineageJerseyResourceIT.setUp(DataSetLineageJerseyResourceIT.java:56)

setUp(org.apache.atlas.web.integration.EntityJerseyResourceIT)  Time elapsed: 0.301 sec  <<<
FAILURE!
org.apache.atlas.AtlasServiceException: Metadata service API org.apache.atlas.AtlasBaseClient$APIInfo@3bf83b6a
failed with status 400 (Bad Request) Response Body ({"error":"Given typename DataSet was invalid"})
	at org.apache.atlas.web.integration.EntityJerseyResourceIT.setUp(EntityJerseyResourceIT.java:89)

runQuickStart(org.apache.atlas.examples.QuickStartV2IT)  Time elapsed: 0.503 sec  <<<
FAILURE!
org.apache.atlas.AtlasServiceException: Metadata service API org.apache.atlas.AtlasBaseClient$APIInfo@324d03a1
failed with status 400 (Bad Request) Response Body ({"errorCode":"ATLAS-400-00-029","errorMessage":"Given
typename DataSet was invalid"})
	at org.apache.atlas.examples.QuickStartV2IT.runQuickStart(QuickStartV2IT.java:49)

runQuickStart(org.apache.atlas.examples.QuickStartIT)  Time elapsed: 0.499 sec  <<<
FAILURE!
org.apache.atlas.AtlasServiceException: Metadata service API org.apache.atlas.AtlasBaseClient$APIInfo@3bee7a35
failed with status 400 (Bad Request) Response Body ({"error":"Given typename DataSet was invalid"})
	at org.apache.atlas.examples.QuickStartIT.runQuickStart(QuickStartIT.java:44)


Results :

Failed tests: 
  QuickStartIT.runQuickStart:44 » AtlasService Metadata service API org.apache.a...
  QuickStartV2IT.runQuickStart:49 » AtlasService Metadata service API org.apache...
  NotificationHookConsumerIT.setUp:55->BaseResourceIT.createTypeDefinitionsV1:357->BaseResourceIT.createType:204
» AtlasService
  DataSetLineageJerseyResourceIT.setUp:56->BaseResourceIT.createTypeDefinitionsV1:357->BaseResourceIT.createType:204
» AtlasService
  EntityDiscoveryJerseyResourceIT.setUp:59->BaseResourceIT.createInstance:215 » AtlasService
  EntityJerseyResourceIT.setUp:89->BaseResourceIT.createTypeDefinitionsV1:357->BaseResourceIT.createType:204
» AtlasService
  EntityV2JerseyResourceIT.setUp:80->BaseResourceIT.createTypeDefinitionsV2:454->BaseResourceIT.batchCreateTypes:157
» AtlasService
  MetadataDiscoveryJerseyResourceIT.setUp:63->createTypes:237->BaseResourceIT.createTypeDefinitionsV1:357->BaseResourceIT.createType:204
» AtlasService

Tests run: 142, Failures: 8, Errors: 0, Skipped: 108

[INFO] 
[INFO] --- jetty-maven-plugin:9.2.12.v20150709:stop (stop-jetty) @ atlas-webapp ---
[INFO] Waiting 10 seconds for jetty to stop
[INFO] Stopped ServerConnector@2a929e2{HTTP/1.1}{0.0.0.0:31000}
[INFO] Closing Spring root WebApplicationContext
[INFO] Shutting down log4j
[INFO] Stopped o.e.j.m.p.JettyWebAppContext@1849419a{/,<https://builds.apache.org/job/Atlas-master-IntegrationTests/ws/webapp/target/atlas-webapp-0.9-SNAPSHOT/,UNAVAILABLE}{/home/jenkins/jenkins-slave/workspace/Atlas-master-IntegrationTests/webapp/target/atlas-webapp-0.9-SNAPSHOT.war}>
[INFO] Server reports itself as stopped
[INFO] 
[INFO] --- maven-source-plugin:2.4:jar-no-fork (attach-sources) @ atlas-webapp ---
[INFO] Building jar: <https://builds.apache.org/job/Atlas-master-IntegrationTests/ws/webapp/target/atlas-webapp-0.9-SNAPSHOT-sources.jar>
[INFO] 
[INFO] --- maven-source-plugin:2.4:test-jar-no-fork (attach-sources) @ atlas-webapp ---
[INFO] Building jar: <https://builds.apache.org/job/Atlas-master-IntegrationTests/ws/webapp/target/atlas-webapp-0.9-SNAPSHOT-test-sources.jar>
[INFO] 
[INFO] --- maven-failsafe-plugin:2.19.1:verify (verify) @ atlas-webapp ---
[INFO] ------------------------------------------------------------------------
[INFO] Reactor Summary:
[INFO] 
[INFO] Apache Atlas Server Build Tools .................... SUCCESS [  0.811 s]
[INFO] apache-atlas ....................................... SUCCESS [  4.375 s]
[INFO] Apache Atlas Integration ........................... SUCCESS [ 28.987 s]
[INFO] Apache Atlas Common ................................ SUCCESS [ 14.036 s]
[INFO] Apache Atlas Typesystem ............................ SUCCESS [01:03 min]
[INFO] Apache Atlas Client ................................ SUCCESS [ 16.677 s]
[INFO] Apache Atlas Server API ............................ SUCCESS [  9.341 s]
[INFO] Apache Atlas Notification .......................... SUCCESS [ 15.304 s]
[INFO] Apache Atlas Graph Database Projects ............... SUCCESS [  0.627 s]
[INFO] Apache Atlas Graph Database API .................... SUCCESS [  7.182 s]
[INFO] Graph Database Common Code ......................... SUCCESS [  7.657 s]
[INFO] Apache Atlas Titan 1.0.0 GraphDB Impl .............. SUCCESS [ 30.821 s]
[INFO] Shaded version of Apache hbase client .............. SUCCESS [  8.346 s]
[INFO] Apache Atlas Titan 0.5.4 Graph DB Impl ............. SUCCESS [ 42.842 s]
[INFO] Apache Atlas Graph Database Implementation Dependencies SUCCESS [  0.720 s]
[INFO] Shaded version of Apache hbase server .............. SUCCESS [ 23.372 s]
[INFO] Apache Atlas Repository ............................ SUCCESS [01:45 min]
[INFO] Apache Atlas Authorization ......................... SUCCESS [ 10.665 s]
[INFO] Apache Atlas Business Catalog ...................... SUCCESS [ 15.784 s]
[INFO] Apache Atlas UI .................................... SUCCESS [01:35 min]
[INFO] Apache Atlas Web Application ....................... FAILURE [01:59 min]
[INFO] Apache Atlas Documentation ......................... SKIPPED
[INFO] Apache Atlas FileSystem Model ...................... SKIPPED
[INFO] Apache Atlas Plugin Classloader .................... SKIPPED
[INFO] Apache Atlas Hive Bridge Shim ...................... SKIPPED
[INFO] Apache Atlas Hive Bridge ........................... SKIPPED
[INFO] Apache Atlas Falcon Bridge Shim .................... SKIPPED
[INFO] Apache Atlas Falcon Bridge ......................... SKIPPED
[INFO] Apache Atlas Sqoop Bridge Shim ..................... SKIPPED
[INFO] Apache Atlas Sqoop Bridge .......................... SKIPPED
[INFO] Apache Atlas Storm Bridge Shim ..................... SKIPPED
[INFO] Apache Atlas Storm Bridge .......................... SKIPPED
[INFO] Apache Atlas Distribution .......................... SKIPPED
[INFO] ------------------------------------------------------------------------
[INFO] BUILD FAILURE
[INFO] ------------------------------------------------------------------------
[INFO] Total time: 10:24 min
[INFO] Finished at: 2017-09-17T23:43:44Z
[INFO] Final Memory: 336M/1979M
[INFO] ------------------------------------------------------------------------
log4j:WARN No appenders could be found for logger (org.apache.zookeeper.ClientCnxn).
log4j:WARN Please initialize the log4j system properly.
log4j:WARN See http://logging.apache.org/log4j/1.2/faq.html#noconfig for more info.
[ERROR] Failed to execute goal org.apache.maven.plugins:maven-failsafe-plugin:2.19.1:verify
(verify) on project atlas-webapp: There are test failures.
[ERROR] 
[ERROR] Please refer to <https://builds.apache.org/job/Atlas-master-IntegrationTests/ws/webapp/target/failsafe-reports>
for the individual test results.
[ERROR] -> [Help 1]
[ERROR] 
[ERROR] To see the full stack trace of the errors, re-run Maven with the -e switch.
[ERROR] Re-run Maven using the -X switch to enable full debug logging.
[ERROR] 
[ERROR] For more information about the errors and possible solutions, please read the following
articles:
[ERROR] [Help 1] http://cwiki.apache.org/confluence/display/MAVEN/MojoFailureException
[ERROR] 
[ERROR] After correcting the problems, you can resume the build with the command
[ERROR]   mvn <goals> -rf :atlas-webapp
Build step 'Execute shell' marked build as failure
[CHECKSTYLE] Collecting checkstyle analysis files...
[CHECKSTYLE] Searching for all files in <https://builds.apache.org/job/Atlas-master-IntegrationTests/ws/>
that match the pattern **/target/checkstyle-result.xml
[CHECKSTYLE] Parsing 19 files in <https://builds.apache.org/job/Atlas-master-IntegrationTests/ws/>
[CHECKSTYLE] Successfully parsed file <https://builds.apache.org/job/Atlas-master-IntegrationTests/ws/authorization/target/checkstyle-result.xml>
with 467 unique warnings and 0 duplicates.
[CHECKSTYLE] Successfully parsed file <https://builds.apache.org/job/Atlas-master-IntegrationTests/ws/catalog/target/checkstyle-result.xml>
with 2604 unique warnings and 0 duplicates.
[CHECKSTYLE] Successfully parsed file <https://builds.apache.org/job/Atlas-master-IntegrationTests/ws/client/target/checkstyle-result.xml>
with 4241 unique warnings and 0 duplicates.
[CHECKSTYLE] Successfully parsed file <https://builds.apache.org/job/Atlas-master-IntegrationTests/ws/common/target/checkstyle-result.xml>
with 5455 unique warnings and 0 duplicates.
[CHECKSTYLE] Successfully parsed file <https://builds.apache.org/job/Atlas-master-IntegrationTests/ws/dashboardv2/target/checkstyle-result.xml>
with 5455 unique warnings and 0 duplicates.
[CHECKSTYLE] Successfully parsed file <https://builds.apache.org/job/Atlas-master-IntegrationTests/ws/graphdb/api/target/checkstyle-result.xml>
with 5724 unique warnings and 0 duplicates.
[CHECKSTYLE] Successfully parsed file <https://builds.apache.org/job/Atlas-master-IntegrationTests/ws/graphdb/common/target/checkstyle-result.xml>
with 5911 unique warnings and 0 duplicates.
[CHECKSTYLE] Successfully parsed file <https://builds.apache.org/job/Atlas-master-IntegrationTests/ws/graphdb/graphdb-impls/target/checkstyle-result.xml>
with 5911 unique warnings and 0 duplicates.
[CHECKSTYLE] Successfully parsed file <https://builds.apache.org/job/Atlas-master-IntegrationTests/ws/graphdb/target/checkstyle-result.xml>
with 5911 unique warnings and 0 duplicates.
[CHECKSTYLE] Successfully parsed file <https://builds.apache.org/job/Atlas-master-IntegrationTests/ws/graphdb/titan0/target/checkstyle-result.xml>
with 8296 unique warnings and 0 duplicates.
[CHECKSTYLE] Successfully parsed file <https://builds.apache.org/job/Atlas-master-IntegrationTests/ws/graphdb/titan1/target/checkstyle-result.xml>
with 9244 unique warnings and 0 duplicates.
[CHECKSTYLE] Successfully parsed file <https://builds.apache.org/job/Atlas-master-IntegrationTests/ws/intg/target/checkstyle-result.xml>
with 17168 unique warnings and 0 duplicates.
[CHECKSTYLE] Successfully parsed file <https://builds.apache.org/job/Atlas-master-IntegrationTests/ws/notification/target/checkstyle-result.xml>
with 18378 unique warnings and 0 duplicates.
[CHECKSTYLE] Successfully parsed file <https://builds.apache.org/job/Atlas-master-IntegrationTests/ws/repository/target/checkstyle-result.xml>
with 38556 unique warnings and 0 duplicates.
[CHECKSTYLE] Successfully parsed file <https://builds.apache.org/job/Atlas-master-IntegrationTests/ws/server-api/target/checkstyle-result.xml>
with 38935 unique warnings and 0 duplicates.
[CHECKSTYLE] Successfully parsed file <https://builds.apache.org/job/Atlas-master-IntegrationTests/ws/shaded/hbase-client-shaded/target/checkstyle-result.xml>
with 38935 unique warnings and 0 duplicates.
[CHECKSTYLE] Successfully parsed file <https://builds.apache.org/job/Atlas-master-IntegrationTests/ws/shaded/hbase-server-shaded/target/checkstyle-result.xml>
with 38935 unique warnings and 0 duplicates.
[CHECKSTYLE] Successfully parsed file <https://builds.apache.org/job/Atlas-master-IntegrationTests/ws/target/checkstyle-result.xml>
with 38935 unique warnings and 0 duplicates.
[CHECKSTYLE] Successfully parsed file <https://builds.apache.org/job/Atlas-master-IntegrationTests/ws/typesystem/target/checkstyle-result.xml>
with 43153 unique warnings and 0 duplicates.
<Git Blamer> Using GitBlamer to create author and commit information for all warnings.
<Git Blamer> GIT_COMMIT=c1f4007a9d9f85f888a5c9164e11937025157edb, workspace=<https://builds.apache.org/job/Atlas-master-IntegrationTests/ws/>
 > git rev-parse c1f4007a9d9f85f888a5c9164e11937025157edb^{commit} # timeout=10
[FINDBUGS] Collecting findbugs analysis files...
[FINDBUGS] Searching for all files in <https://builds.apache.org/job/Atlas-master-IntegrationTests/ws/>
that match the pattern **/target/findbugs.xml
[FINDBUGS] Parsing 12 files in <https://builds.apache.org/job/Atlas-master-IntegrationTests/ws/>
[FINDBUGS] Successfully parsed file <https://builds.apache.org/job/Atlas-master-IntegrationTests/ws/authorization/target/findbugs.xml>
with 0 unique warnings and 0 duplicates.
[FINDBUGS] Successfully parsed file <https://builds.apache.org/job/Atlas-master-IntegrationTests/ws/catalog/target/findbugs.xml>
with 0 unique warnings and 0 duplicates.
[FINDBUGS] Successfully parsed file <https://builds.apache.org/job/Atlas-master-IntegrationTests/ws/client/target/findbugs.xml>
with 0 unique warnings and 0 duplicates.
[FINDBUGS] Successfully parsed file <https://builds.apache.org/job/Atlas-master-IntegrationTests/ws/common/target/findbugs.xml>
with 0 unique warnings and 0 duplicates.
[FINDBUGS] Successfully parsed file <https://builds.apache.org/job/Atlas-master-IntegrationTests/ws/graphdb/api/target/findbugs.xml>
with 0 unique warnings and 0 duplicates.
[FINDBUGS] Successfully parsed file <https://builds.apache.org/job/Atlas-master-IntegrationTests/ws/graphdb/common/target/findbugs.xml>
with 0 unique warnings and 0 duplicates.
[FINDBUGS] Successfully parsed file <https://builds.apache.org/job/Atlas-master-IntegrationTests/ws/graphdb/titan0/target/findbugs.xml>
with 0 unique warnings and 0 duplicates.
[FINDBUGS] Successfully parsed file <https://builds.apache.org/job/Atlas-master-IntegrationTests/ws/intg/target/findbugs.xml>
with 0 unique warnings and 0 duplicates.
[FINDBUGS] Successfully parsed file <https://builds.apache.org/job/Atlas-master-IntegrationTests/ws/notification/target/findbugs.xml>
with 0 unique warnings and 0 duplicates.
[FINDBUGS] Successfully parsed file <https://builds.apache.org/job/Atlas-master-IntegrationTests/ws/repository/target/findbugs.xml>
with 0 unique warnings and 0 duplicates.
[FINDBUGS] Successfully parsed file <https://builds.apache.org/job/Atlas-master-IntegrationTests/ws/server-api/target/findbugs.xml>
with 0 unique warnings and 0 duplicates.
[FINDBUGS] Successfully parsed file <https://builds.apache.org/job/Atlas-master-IntegrationTests/ws/typesystem/target/findbugs.xml>
with 0 unique warnings and 0 duplicates.
<Git Blamer> Using GitBlamer to create author and commit information for all warnings.
<Git Blamer> GIT_COMMIT=c1f4007a9d9f85f888a5c9164e11937025157edb, workspace=<https://builds.apache.org/job/Atlas-master-IntegrationTests/ws/>
Archiving artifacts
[Fast Archiver] No prior successful build to compare, so performing full copy of artifacts
TestNG Reports Processing: START
Looking for TestNG results report in workspace using pattern: **/target/surefire-reports/testng-results.xml,**/target/failsafe-reports/testng-results.xml
Saving reports...
Processing '/x1/jenkins/jenkins-home/jobs/Atlas-master-IntegrationTests/builds/104/testng/testng-results.xml'
TestNG Reports Processing: FINISH

Mime
View raw message