atlas-dev mailing list archives

Site index · List index
Message view « Date » · « Thread »
Top « Date » · « Thread »
From Apache Jenkins Server <jenk...@builds.apache.org>
Subject Build failed in Jenkins: Atlas-master-IntegrationTests #57
Date Sat, 02 Sep 2017 00:59:55 GMT
See <https://builds.apache.org/job/Atlas-master-IntegrationTests/57/display/redirect?page=changes>

Changes:

[amestry] ATLAS-2047: Update to fix IT failure in build environment.

------------------------------------------
[...truncated 41.15 MB...]
2017-09-02 00:54:42,417 DEBUG - [NotificationHookConsumer thread-0:] ~ Mapping attributeInfo
name (GraphToTypedInstanceMapper:144)
2017-09-02 00:54:42,417 DEBUG - [NotificationHookConsumer thread-0:] ~ Adding primitive {name=name,
dataType={name=string, description=null}, multiplicity={lower=1, upper=1, isUnique=false},
isComposite=false, isUnique=false, isIndexable=true, reverseAttributeName=null} from vertex
Titan0Vertex [id=2635264] (GraphToTypedInstanceMapper:387)
2017-09-02 00:54:42,418 DEBUG - [NotificationHookConsumer thread-0:] ~ Reading property Asset.name
from vertex[id=2635264 type=hive_table guid=636877ca-f7a3-4d80-ab5c-f00f54b6f2e7] (GraphHelper:505)
2017-09-02 00:54:42,421 DEBUG - [NotificationHookConsumer thread-0:] ~ Reading property Asset.name
from vertex[id=2635264 type=hive_table guid=636877ca-f7a3-4d80-ab5c-f00f54b6f2e7] (GraphHelper:505)
2017-09-02 00:54:42,422 DEBUG - [NotificationHookConsumer thread-0:] ~ Mapping attributeInfo
description (GraphToTypedInstanceMapper:144)
2017-09-02 00:54:42,422 DEBUG - [NotificationHookConsumer thread-0:] ~ Adding primitive {name=description,
dataType={name=string, description=null}, multiplicity={lower=0, upper=1, isUnique=false},
isComposite=false, isUnique=false, isIndexable=false, reverseAttributeName=null} from vertex
Titan0Vertex [id=2635264] (GraphToTypedInstanceMapper:387)
2017-09-02 00:54:42,423 DEBUG - [NotificationHookConsumer thread-0:] ~ Reading property Asset.description
from vertex[id=2635264 type=hive_table guid=636877ca-f7a3-4d80-ab5c-f00f54b6f2e7] (GraphHelper:505)
2017-09-02 00:54:42,424 DEBUG - [NotificationHookConsumer thread-0:] ~ Mapping attributeInfo
owner (GraphToTypedInstanceMapper:144)
2017-09-02 00:54:42,425 DEBUG - [NotificationHookConsumer thread-0:] ~ Adding primitive {name=owner,
dataType={name=string, description=null}, multiplicity={lower=0, upper=1, isUnique=false},
isComposite=false, isUnique=false, isIndexable=true, reverseAttributeName=null} from vertex
Titan0Vertex [id=2635264] (GraphToTypedInstanceMapper:387)
2017-09-02 00:54:42,426 DEBUG - [NotificationHookConsumer thread-0:] ~ Reading property Asset.owner
from vertex[id=2635264 type=hive_table guid=636877ca-f7a3-4d80-ab5c-f00f54b6f2e7] (GraphHelper:505)
2017-09-02 00:54:42,428 DEBUG - [NotificationHookConsumer thread-0:] ~ Reading property Asset.owner
from vertex[id=2635264 type=hive_table guid=636877ca-f7a3-4d80-ab5c-f00f54b6f2e7] (GraphHelper:505)
2017-09-02 00:54:42,429 DEBUG - [NotificationHookConsumer thread-0:] ~ Retrieving entities
with guids=[e8eb6109-df1e-4cf7-b949-e44474a22675] (GraphBackedMetadataRepository:179)
2017-09-02 00:54:42,429 DEBUG - [NotificationHookConsumer thread-0:] ~ Retrieving entities
with guids=[925f1d88-53c1-409c-9d02-d04b3e2cbcb8] (GraphBackedMetadataRepository:179)
2017-09-02 00:54:42,429 DEBUG - [NotificationHookConsumer thread-0:] ~ Retrieving entities
with guids=[3bca10e7-f01b-4c79-9624-27799357faf4] (GraphBackedMetadataRepository:179)
2017-09-02 00:54:42,429 DEBUG - [NotificationHookConsumer thread-0:] ~ Retrieving entities
with guids=[ec4a85ae-41a8-43e2-825e-96321bd80dd3] (GraphBackedMetadataRepository:179)
2017-09-02 00:54:42,463 DEBUG - [NotificationHookConsumer thread-0:] ~ Sending message for
topic ATLAS_ENTITIES: {"version":{"version":"1.0.0"},"message":{"entity":{"jsonClass":"org.apache.atlas.typesystem.json.InstanceSerialization$_Reference","id":{"jsonClass":"org.apache.atlas.typesystem.json.InstanceSerialization$_Id","id":"636877ca-f7a3-4d80-ab5c-f00f54b6f2e7","version":0,"typeName":"hive_table","state":"ACTIVE"},"typeName":"hive_table","values":{"tableType":"EXTERNAL_TABLE","name":"tablenzpoji7dap","createTime":"2017-09-02T00:52:54.000Z","temporary":false,"db":{"jsonClass":"org.apache.atlas.typesystem.json.InstanceSerialization$_Id","id":"687b45fe-fe13-4f10-a2e5-71d580efe4e9","version":0,"typeName":"hive_db","state":"ACTIVE"},"retention":0,"qualifiedName":"default.tablenzpoji7dap@primary","columns":[{"jsonClass":"org.apache.atlas.typesystem.json.InstanceSerialization$_Reference","id":{"jsonClass":"org.apache.atlas.typesystem.json.InstanceSerialization$_Id","id":"e8eb6109-df1e-4cf7-b949-e44474a22675","version":0,"typeName":"hive_column","state":"ACTIVE"},"typeName":"hive_column","values":{"name":"id","qualifiedName":"default.tablenzpoji7dap.id@primary","position":0,"owner":"jenkins","type":"int","table":{"jsonClass":"org.apache.atlas.typesystem.json.InstanceSerialization$_Id","id":"636877ca-f7a3-4d80-ab5c-f00f54b6f2e7","version":0,"typeName":"hive_table","state":"ACTIVE"}},"traitNames":[],"traits":{},"systemAttributes":{"createdBy":"jenkins","modifiedBy":"jenkins","createdTime":"2017-09-02T00:54:40.224Z","modifiedTime":"2017-09-02T00:54:40.224Z"}},{"jsonClass":"org.apache.atlas.typesystem.json.InstanceSerialization$_Reference","id":{"jsonClass":"org.apache.atlas.typesystem.json.InstanceSerialization$_Id","id":"925f1d88-53c1-409c-9d02-d04b3e2cbcb8","version":0,"typeName":"hive_column","state":"ACTIVE"},"typeName":"hive_column","values":{"name":"name","qualifiedName":"default.tablenzpoji7dap.name@primary","position":1,"owner":"jenkins","type":"string","table":{"jsonClass":"org.apache.atlas.typesystem.json.InstanceSerialization$_Id","id":"636877ca-f7a3-4d80-ab5c-f00f54b6f2e7","version":0,"typeName":"hive_table","state":"ACTIVE"}},"traitNames":[],"traits":{},"systemAttributes":{"createdBy":"jenkins","modifiedBy":"jenkins","createdTime":"2017-09-02T00:54:40.224Z","modifiedTime":"2017-09-02T00:54:40.224Z"}}],"comment":"table
comment","lastAccessTime":"2017-09-02T00:52:54.000Z","owner":"jenkins","sd":{"jsonClass":"org.apache.atlas.typesystem.json.InstanceSerialization$_Reference","id":{"jsonClass":"org.apache.atlas.typesystem.json.InstanceSerialization$_Id","id":"3bca10e7-f01b-4c79-9624-27799357faf4","version":0,"typeName":"hive_storagedesc","state":"ACTIVE"},"typeName":"hive_storagedesc","values":{"location":"p<https://builds.apache.org/job/Atlas-master-IntegrationTests/ws/addons/hive-bridge/target/someTestPath-data-XuNXeHq6a4","serdeInfo">:{"jsonClass":"org.apache.atlas.typesystem.json.InstanceSerialization$_Struct","typeName":"hive_serde","values":{"serializationLib":"org.apache.hadoop.hive.serde2.lazy.LazySimpleSerDe","parameters":{"serialization.format":"1"}}},"qualifiedName":"default.tablenzpoji7dap@primary_storage","outputFormat":"org.apache.hadoop.hive.ql.io.HiveIgnoreKeyTextOutputFormat","compressed":false,"numBuckets":-1,"inputFormat":"org.apache.hadoop.mapred.TextInputFormat","storedAsSubDirectories":false,"table":{"jsonClass":"org.apache.atlas.typesystem.json.InstanceSerialization$_Id","id":"636877ca-f7a3-4d80-ab5c-f00f54b6f2e7","version":0,"typeName":"hive_table","state":"ACTIVE"}},"traitNames":[],"traits":{},"systemAttributes":{"createdBy":"jenkins","modifiedBy":"jenkins","createdTime":"2017-09-02T00:54:40.224Z","modifiedTime":"2017-09-02T00:54:40.224Z"}},"parameters":{"comment":"table
comment","EXTERNAL":"TRUE","transient_lastDdlTime":"1504313574"},"partitionKeys":[{"jsonClass":"org.apache.atlas.typesystem.json.InstanceSerialization$_Reference","id":{"jsonClass":"org.apache.atlas.typesystem.json.InstanceSerialization$_Id","id":"ec4a85ae-41a8-43e2-825e-96321bd80dd3","version":0,"typeName":"hive_column","state":"ACTIVE"},"typeName":"hive_column","values":{"name":"dt","qualifiedName":"default.tablenzpoji7dap.dt@primary","position":0,"owner":"jenkins","type":"string","table":{"jsonClass":"org.apache.atlas.typesystem.json.InstanceSerialization$_Id","id":"636877ca-f7a3-4d80-ab5c-f00f54b6f2e7","version":0,"typeName":"hive_table","state":"ACTIVE"}},"traitNames":[],"traits":{},"systemAttributes":{"createdBy":"jenkins","modifiedBy":"jenkins","createdTime":"2017-09-02T00:54:40.224Z","modifiedTime":"2017-09-02T00:54:40.224Z"}}]},"traitNames":[],"traits":{},"systemAttributes":{}},"operationType":"ENTITY_CREATE","traits":[]}}
(KafkaNotification:218)
2017-09-02 00:54:42,465 DEBUG - [NotificationHookConsumer thread-0:] ~ Sending message for
topic ATLAS_ENTITIES: {"version":{"version":"1.0.0"},"message":{"entity":{"jsonClass":"org.apache.atlas.typesystem.json.InstanceSerialization$_Reference","id":{"jsonClass":"org.apache.atlas.typesystem.json.InstanceSerialization$_Id","id":"e8eb6109-df1e-4cf7-b949-e44474a22675","version":0,"typeName":"hive_column","state":"ACTIVE"},"typeName":"hive_column","values":{"name":"id","qualifiedName":"default.tablenzpoji7dap.id@primary","position":0,"owner":"jenkins","type":"int","table":{"jsonClass":"org.apache.atlas.typesystem.json.InstanceSerialization$_Id","id":"636877ca-f7a3-4d80-ab5c-f00f54b6f2e7","version":0,"typeName":"hive_table","state":"ACTIVE"}},"traitNames":[],"traits":{},"systemAttributes":{}},"operationType":"ENTITY_CREATE","traits":[]}}
(KafkaNotification:218)
2017-09-02 00:54:42,465 DEBUG - [NotificationHookConsumer thread-0:] ~ Sending message for
topic ATLAS_ENTITIES: {"version":{"version":"1.0.0"},"message":{"entity":{"jsonClass":"org.apache.atlas.typesystem.json.InstanceSerialization$_Reference","id":{"jsonClass":"org.apache.atlas.typesystem.json.InstanceSerialization$_Id","id":"925f1d88-53c1-409c-9d02-d04b3e2cbcb8","version":0,"typeName":"hive_column","state":"ACTIVE"},"typeName":"hive_column","values":{"name":"name","qualifiedName":"default.tablenzpoji7dap.name@primary","position":1,"owner":"jenkins","type":"string","table":{"jsonClass":"org.apache.atlas.typesystem.json.InstanceSerialization$_Id","id":"636877ca-f7a3-4d80-ab5c-f00f54b6f2e7","version":0,"typeName":"hive_table","state":"ACTIVE"}},"traitNames":[],"traits":{},"systemAttributes":{}},"operationType":"ENTITY_CREATE","traits":[]}}
(KafkaNotification:218)
2017-09-02 00:54:42,466 DEBUG - [NotificationHookConsumer thread-0:] ~ Sending message for
topic ATLAS_ENTITIES: {"version":{"version":"1.0.0"},"message":{"entity":{"jsonClass":"org.apache.atlas.typesystem.json.InstanceSerialization$_Reference","id":{"jsonClass":"org.apache.atlas.typesystem.json.InstanceSerialization$_Id","id":"3bca10e7-f01b-4c79-9624-27799357faf4","version":0,"typeName":"hive_storagedesc","state":"ACTIVE"},"typeName":"hive_storagedesc","values":{"location":"p<https://builds.apache.org/job/Atlas-master-IntegrationTests/ws/addons/hive-bridge/target/someTestPath-data-XuNXeHq6a4","serdeInfo">:{"jsonClass":"org.apache.atlas.typesystem.json.InstanceSerialization$_Struct","typeName":"hive_serde","values":{"serializationLib":"org.apache.hadoop.hive.serde2.lazy.LazySimpleSerDe","parameters":{"serialization.format":"1"}}},"qualifiedName":"default.tablenzpoji7dap@primary_storage","outputFormat":"org.apache.hadoop.hive.ql.io.HiveIgnoreKeyTextOutputFormat","compressed":false,"numBuckets":-1,"inputFormat":"org.apache.hadoop.mapred.TextInputFormat","storedAsSubDirectories":false,"table":{"jsonClass":"org.apache.atlas.typesystem.json.InstanceSerialization$_Id","id":"636877ca-f7a3-4d80-ab5c-f00f54b6f2e7","version":0,"typeName":"hive_table","state":"ACTIVE"}},"traitNames":[],"traits":{},"systemAttributes":{}},"operationType":"ENTITY_CREATE","traits":[]}}
(KafkaNotification:218)
2017-09-02 00:54:42,466 DEBUG - [NotificationHookConsumer thread-0:] ~ Sending message for
topic ATLAS_ENTITIES: {"version":{"version":"1.0.0"},"message":{"entity":{"jsonClass":"org.apache.atlas.typesystem.json.InstanceSerialization$_Reference","id":{"jsonClass":"org.apache.atlas.typesystem.json.InstanceSerialization$_Id","id":"ec4a85ae-41a8-43e2-825e-96321bd80dd3","version":0,"typeName":"hive_column","state":"ACTIVE"},"typeName":"hive_column","values":{"name":"dt","qualifiedName":"default.tablenzpoji7dap.dt@primary","position":0,"owner":"jenkins","type":"string","table":{"jsonClass":"org.apache.atlas.typesystem.json.InstanceSerialization$_Id","id":"636877ca-f7a3-4d80-ab5c-f00f54b6f2e7","version":0,"typeName":"hive_table","state":"ACTIVE"}},"traitNames":[],"traits":{},"systemAttributes":{}},"operationType":"ENTITY_CREATE","traits":[]}}
(KafkaNotification:218)
2017-09-02 00:54:42,569 DEBUG - [main-SendThread(localhost:19026):] ~ ==> InMemoryJAASConfiguration.getAppConfigurationEntry(Client)
(InMemoryJAASConfiguration:208)
2017-09-02 00:54:42,569 DEBUG - [main-SendThread(localhost:19026):] ~ <== InMemoryJAASConfiguration.getAppConfigurationEntry(Client):
{} (InMemoryJAASConfiguration:238)
2017-09-02 00:54:42,570 WARN  - [main-SendThread(localhost:19026):] ~ Session 0x15e4010774a0002
for server null, unexpected error, closing socket connection and attempting reconnect (ClientCnxn$SendThread:1102)
java.net.ConnectException: Connection refused
	at sun.nio.ch.SocketChannelImpl.checkConnect(Native Method)
	at sun.nio.ch.SocketChannelImpl.finishConnect(SocketChannelImpl.java:744)
	at org.apache.zookeeper.ClientCnxnSocketNIO.doTransport(ClientCnxnSocketNIO.java:361)
	at org.apache.zookeeper.ClientCnxn$SendThread.run(ClientCnxn.java:1081)
2017-09-02 00:54:43,358 DEBUG - [Curator-Framework-0-SendThread(localhost:19026):] ~ ==>
InMemoryJAASConfiguration.getAppConfigurationEntry(Client) (InMemoryJAASConfiguration:208)
2017-09-02 00:54:43,359 DEBUG - [Curator-Framework-0-SendThread(localhost:19026):] ~ <==
InMemoryJAASConfiguration.getAppConfigurationEntry(Client): {} (InMemoryJAASConfiguration:238)
2017-09-02 00:54:44,188 DEBUG - [main-SendThread(localhost:19026):] ~ ==> InMemoryJAASConfiguration.getAppConfigurationEntry(Client)
(InMemoryJAASConfiguration:208)
2017-09-02 00:54:44,189 DEBUG - [main-SendThread(localhost:19026):] ~ <== InMemoryJAASConfiguration.getAppConfigurationEntry(Client):
{} (InMemoryJAASConfiguration:238)
2017-09-02 00:54:44,189 WARN  - [main-SendThread(localhost:19026):] ~ Session 0x15e4010774a0002
for server null, unexpected error, closing socket connection and attempting reconnect (ClientCnxn$SendThread:1102)
java.net.ConnectException: Connection refused
	at sun.nio.ch.SocketChannelImpl.checkConnect(Native Method)
	at sun.nio.ch.SocketChannelImpl.finishConnect(SocketChannelImpl.java:744)
	at org.apache.zookeeper.ClientCnxnSocketNIO.doTransport(ClientCnxnSocketNIO.java:361)
	at org.apache.zookeeper.ClientCnxn$SendThread.run(ClientCnxn.java:1081)
2017-09-02 00:54:44,737 DEBUG - [main-SendThread(localhost:19026):] ~ ==> InMemoryJAASConfiguration.getAppConfigurationEntry(Client)
(InMemoryJAASConfiguration:208)
2017-09-02 00:54:44,737 DEBUG - [main-SendThread(localhost:19026):] ~ <== InMemoryJAASConfiguration.getAppConfigurationEntry(Client):
{} (InMemoryJAASConfiguration:238)
2017-09-02 00:54:44,738 WARN  - [main-SendThread(localhost:19026):] ~ Session 0x15e4010774a0002
for server null, unexpected error, closing socket connection and attempting reconnect (ClientCnxn$SendThread:1102)
java.net.ConnectException: Connection refused
	at sun.nio.ch.SocketChannelImpl.checkConnect(Native Method)
	at sun.nio.ch.SocketChannelImpl.finishConnect(SocketChannelImpl.java:744)
	at org.apache.zookeeper.ClientCnxnSocketNIO.doTransport(ClientCnxnSocketNIO.java:361)
	at org.apache.zookeeper.ClientCnxn$SendThread.run(ClientCnxn.java:1081)
2017-09-02 00:54:45,419 DEBUG - [Curator-Framework-0-SendThread(localhost:19026):] ~ ==>
InMemoryJAASConfiguration.getAppConfigurationEntry(Client) (InMemoryJAASConfiguration:208)
2017-09-02 00:54:45,420 DEBUG - [Curator-Framework-0-SendThread(localhost:19026):] ~ <==
InMemoryJAASConfiguration.getAppConfigurationEntry(Client): {} (InMemoryJAASConfiguration:238)
2017-09-02 00:54:45,895 DEBUG - [Curator-Framework-0-SendThread(localhost:19026):] ~ ==>
InMemoryJAASConfiguration.getAppConfigurationEntry(Client) (InMemoryJAASConfiguration:208)
2017-09-02 00:54:45,895 DEBUG - [Curator-Framework-0-SendThread(localhost:19026):] ~ <==
InMemoryJAASConfiguration.getAppConfigurationEntry(Client): {} (InMemoryJAASConfiguration:238)
2017-09-02 00:54:46,615 DEBUG - [main-SendThread(localhost:19026):] ~ ==> InMemoryJAASConfiguration.getAppConfigurationEntry(Client)
(InMemoryJAASConfiguration:208)
2017-09-02 00:54:46,615 DEBUG - [main-SendThread(localhost:19026):] ~ <== InMemoryJAASConfiguration.getAppConfigurationEntry(Client):
{} (InMemoryJAASConfiguration:238)
2017-09-02 00:54:46,616 WARN  - [main-SendThread(localhost:19026):] ~ Session 0x15e4010774a0002
for server null, unexpected error, closing socket connection and attempting reconnect (ClientCnxn$SendThread:1102)
java.net.ConnectException: Connection refused
	at sun.nio.ch.SocketChannelImpl.checkConnect(Native Method)
	at sun.nio.ch.SocketChannelImpl.finishConnect(SocketChannelImpl.java:744)
	at org.apache.zookeeper.ClientCnxnSocketNIO.doTransport(ClientCnxnSocketNIO.java:361)
	at org.apache.zookeeper.ClientCnxn$SendThread.run(ClientCnxn.java:1081)
2017-09-02 00:54:47,693 DEBUG - [main-SendThread(localhost:19026):] ~ ==> InMemoryJAASConfiguration.getAppConfigurationEntry(Client)
(InMemoryJAASConfiguration:208)
2017-09-02 00:54:47,694 DEBUG - [main-SendThread(localhost:19026):] ~ <== InMemoryJAASConfiguration.getAppConfigurationEntry(Client):
{} (InMemoryJAASConfiguration:238)
2017-09-02 00:54:47,694 WARN  - [main-SendThread(localhost:19026):] ~ Session 0x15e4010774a0002
for server null, unexpected error, closing socket connection and attempting reconnect (ClientCnxn$SendThread:1102)
java.net.ConnectException: Connection refused
	at sun.nio.ch.SocketChannelImpl.checkConnect(Native Method)
	at sun.nio.ch.SocketChannelImpl.finishConnect(SocketChannelImpl.java:744)
	at org.apache.zookeeper.ClientCnxnSocketNIO.doTransport(ClientCnxnSocketNIO.java:361)
	at org.apache.zookeeper.ClientCnxn$SendThread.run(ClientCnxn.java:1081)
2017-09-02 00:54:47,762 DEBUG - [Curator-Framework-0-SendThread(localhost:19026):] ~ ==>
InMemoryJAASConfiguration.getAppConfigurationEntry(Client) (InMemoryJAASConfiguration:208)
2017-09-02 00:54:47,762 DEBUG - [Curator-Framework-0-SendThread(localhost:19026):] ~ <==
InMemoryJAASConfiguration.getAppConfigurationEntry(Client): {} (InMemoryJAASConfiguration:238)
2017-09-02 00:54:48,418 DEBUG - [Curator-Framework-0-SendThread(localhost:19026):] ~ ==>
InMemoryJAASConfiguration.getAppConfigurationEntry(Client) (InMemoryJAASConfiguration:208)
2017-09-02 00:54:48,419 DEBUG - [Curator-Framework-0-SendThread(localhost:19026):] ~ <==
InMemoryJAASConfiguration.getAppConfigurationEntry(Client): {} (InMemoryJAASConfiguration:238)
2017-09-02 00:54:49,110 DEBUG - [main-SendThread(localhost:19026):] ~ ==> InMemoryJAASConfiguration.getAppConfigurationEntry(Client)
(InMemoryJAASConfiguration:208)
2017-09-02 00:54:49,111 DEBUG - [main-SendThread(localhost:19026):] ~ <== InMemoryJAASConfiguration.getAppConfigurationEntry(Client):
{} (InMemoryJAASConfiguration:238)
2017-09-02 00:54:49,111 WARN  - [main-SendThread(localhost:19026):] ~ Session 0x15e4010774a0002
for server null, unexpected error, closing socket connection and attempting reconnect (ClientCnxn$SendThread:1102)
java.net.ConnectException: Connection refused
	at sun.nio.ch.SocketChannelImpl.checkConnect(Native Method)
	at sun.nio.ch.SocketChannelImpl.finishConnect(SocketChannelImpl.java:744)
	at org.apache.zookeeper.ClientCnxnSocketNIO.doTransport(ClientCnxnSocketNIO.java:361)
	at org.apache.zookeeper.ClientCnxn$SendThread.run(ClientCnxn.java:1081)
2017-09-02 00:54:49,527 DEBUG - [main-SendThread(localhost:19026):] ~ ==> InMemoryJAASConfiguration.getAppConfigurationEntry(Client)
(InMemoryJAASConfiguration:208)
2017-09-02 00:54:49,528 DEBUG - [main-SendThread(localhost:19026):] ~ <== InMemoryJAASConfiguration.getAppConfigurationEntry(Client):
{} (InMemoryJAASConfiguration:238)
2017-09-02 00:54:49,528 WARN  - [main-SendThread(localhost:19026):] ~ Session 0x15e4010774a0002
for server null, unexpected error, closing socket connection and attempting reconnect (ClientCnxn$SendThread:1102)
java.net.ConnectException: Connection refused
	at sun.nio.ch.SocketChannelImpl.checkConnect(Native Method)
	at sun.nio.ch.SocketChannelImpl.finishConnect(SocketChannelImpl.java:744)
	at org.apache.zookeeper.ClientCnxnSocketNIO.doTransport(ClientCnxnSocketNIO.java:361)
	at org.apache.zookeeper.ClientCnxn$SendThread.run(ClientCnxn.java:1081)
[ERROR] 
java.net.SocketTimeoutException: Read timed out
	at java.net.SocketInputStream.socketRead0(Native Method)
	at java.net.SocketInputStream.read(SocketInputStream.java:152)
	at java.net.SocketInputStream.read(SocketInputStream.java:122)
	at sun.nio.cs.StreamDecoder.readBytes(StreamDecoder.java:283)
	at sun.nio.cs.StreamDecoder.implRead(StreamDecoder.java:325)
	at sun.nio.cs.StreamDecoder.read(StreamDecoder.java:177)
	at java.io.InputStreamReader.read(InputStreamReader.java:184)
	at java.io.BufferedReader.fill(BufferedReader.java:154)
	at java.io.BufferedReader.readLine(BufferedReader.java:317)
	at java.io.LineNumberReader.readLine(LineNumberReader.java:199)
	at org.eclipse.jetty.maven.plugin.JettyStopMojo.execute(JettyStopMojo.java:100)
	at org.apache.maven.plugin.DefaultBuildPluginManager.executeMojo(DefaultBuildPluginManager.java:134)
	at org.apache.maven.lifecycle.internal.MojoExecutor.execute(MojoExecutor.java:208)
	at org.apache.maven.lifecycle.internal.MojoExecutor.execute(MojoExecutor.java:154)
	at org.apache.maven.lifecycle.internal.MojoExecutor.execute(MojoExecutor.java:146)
	at org.apache.maven.lifecycle.internal.LifecycleModuleBuilder.buildProject(LifecycleModuleBuilder.java:117)
	at org.apache.maven.lifecycle.internal.LifecycleModuleBuilder.buildProject(LifecycleModuleBuilder.java:81)
	at org.apache.maven.lifecycle.internal.builder.singlethreaded.SingleThreadedBuilder.build(SingleThreadedBuilder.java:51)
	at org.apache.maven.lifecycle.internal.LifecycleStarter.execute(LifecycleStarter.java:128)
	at org.apache.maven.DefaultMaven.doExecute(DefaultMaven.java:309)
	at org.apache.maven.DefaultMaven.doExecute(DefaultMaven.java:194)
	at org.apache.maven.DefaultMaven.execute(DefaultMaven.java:107)
	at org.apache.maven.cli.MavenCli.execute(MavenCli.java:993)
	at org.apache.maven.cli.MavenCli.doMain(MavenCli.java:345)
	at org.apache.maven.cli.MavenCli.main(MavenCli.java:191)
	at sun.reflect.NativeMethodAccessorImpl.invoke0(Native Method)
	at sun.reflect.NativeMethodAccessorImpl.invoke(NativeMethodAccessorImpl.java:57)
	at sun.reflect.DelegatingMethodAccessorImpl.invoke(DelegatingMethodAccessorImpl.java:43)
	at java.lang.reflect.Method.invoke(Method.java:606)
	at org.codehaus.plexus.classworlds.launcher.Launcher.launchEnhanced(Launcher.java:289)
	at org.codehaus.plexus.classworlds.launcher.Launcher.launch(Launcher.java:229)
	at org.codehaus.plexus.classworlds.launcher.Launcher.mainWithExitCode(Launcher.java:415)
	at org.codehaus.plexus.classworlds.launcher.Launcher.main(Launcher.java:356)
[INFO] 
[INFO] --- maven-source-plugin:2.4:jar-no-fork (attach-sources) @ hive-bridge ---
[INFO] Building jar: <https://builds.apache.org/job/Atlas-master-IntegrationTests/ws/addons/hive-bridge/target/hive-bridge-0.9-SNAPSHOT-sources.jar>
[INFO] 
[INFO] --- maven-source-plugin:2.4:test-jar-no-fork (attach-sources) @ hive-bridge ---
[INFO] Building jar: <https://builds.apache.org/job/Atlas-master-IntegrationTests/ws/addons/hive-bridge/target/hive-bridge-0.9-SNAPSHOT-test-sources.jar>
[INFO] 
[INFO] --- maven-failsafe-plugin:2.19.1:verify (verify) @ hive-bridge ---
[INFO] ------------------------------------------------------------------------
[INFO] Reactor Summary:
[INFO] 
[INFO] Apache Atlas Server Build Tools .................... SUCCESS [  0.803 s]
[INFO] apache-atlas ....................................... SUCCESS [  4.839 s]
[INFO] Apache Atlas Integration ........................... SUCCESS [ 28.390 s]
[INFO] Apache Atlas Common ................................ SUCCESS [ 14.562 s]
[INFO] Apache Atlas Typesystem ............................ SUCCESS [01:02 min]
[INFO] Apache Atlas Client ................................ SUCCESS [ 15.858 s]
[INFO] Apache Atlas Server API ............................ SUCCESS [  9.858 s]
[INFO] Apache Atlas Notification .......................... SUCCESS [ 14.442 s]
[INFO] Apache Atlas Graph Database Projects ............... SUCCESS [  0.560 s]
[INFO] Apache Atlas Graph Database API .................... SUCCESS [  7.396 s]
[INFO] Graph Database Common Code ......................... SUCCESS [  7.424 s]
[INFO] Apache Atlas Titan 1.0.0 GraphDB Impl .............. SUCCESS [ 31.791 s]
[INFO] Shaded version of Apache hbase client .............. SUCCESS [  8.344 s]
[INFO] Apache Atlas Titan 0.5.4 Graph DB Impl ............. SUCCESS [ 42.528 s]
[INFO] Apache Atlas Graph Database Implementation Dependencies SUCCESS [  0.777 s]
[INFO] Shaded version of Apache hbase server .............. SUCCESS [ 23.154 s]
[INFO] Apache Atlas Repository ............................ SUCCESS [01:45 min]
[INFO] Apache Atlas Authorization ......................... SUCCESS [ 11.855 s]
[INFO] Apache Atlas Business Catalog ...................... SUCCESS [ 15.761 s]
[INFO] Apache Atlas UI .................................... SUCCESS [01:29 min]
[INFO] Apache Atlas Web Application ....................... SUCCESS [04:36 min]
[INFO] Apache Atlas Documentation ......................... SUCCESS [ 12.700 s]
[INFO] Apache Atlas FileSystem Model ...................... SUCCESS [  2.612 s]
[INFO] Apache Atlas Plugin Classloader .................... SUCCESS [  9.798 s]
[INFO] Apache Atlas Hive Bridge Shim ...................... SUCCESS [  9.489 s]
[INFO] Apache Atlas Hive Bridge ........................... FAILURE [08:01 min]
[INFO] Apache Atlas Falcon Bridge Shim .................... SKIPPED
[INFO] Apache Atlas Falcon Bridge ......................... SKIPPED
[INFO] Apache Atlas Sqoop Bridge Shim ..................... SKIPPED
[INFO] Apache Atlas Sqoop Bridge .......................... SKIPPED
[INFO] Apache Atlas Storm Bridge Shim ..................... SKIPPED
[INFO] Apache Atlas Storm Bridge .......................... SKIPPED
[INFO] Apache Atlas Distribution .......................... SKIPPED
[INFO] ------------------------------------------------------------------------
[INFO] BUILD FAILURE
[INFO] ------------------------------------------------------------------------
[INFO] Total time: 21:31 min
[INFO] Finished at: 2017-09-02T00:54:49Z
[INFO] Final Memory: 575M/1745M
[INFO] ------------------------------------------------------------------------
2017-09-02 00:54:51,687 DEBUG - [Curator-Framework-0-SendThread(localhost:19026):] ~ ==>
InMemoryJAASConfiguration.getAppConfigurationEntry(Client) (InMemoryJAASConfiguration:208)
2017-09-02 00:54:51,688 DEBUG - [Curator-Framework-0-SendThread(localhost:19026):] ~ <==
InMemoryJAASConfiguration.getAppConfigurationEntry(Client): {} (InMemoryJAASConfiguration:238)
[ERROR] Failed to execute goal org.apache.maven.plugins:maven-failsafe-plugin:2.19.1:verify
(verify) on project hive-bridge: There are test failures.
[ERROR] 
[ERROR] Please refer to <https://builds.apache.org/job/Atlas-master-IntegrationTests/ws/addons/hive-bridge/target/failsafe-reports>
for the individual test results.
[ERROR] -> [Help 1]
[ERROR] 
[ERROR] To see the full stack trace of the errors, re-run Maven with the -e switch.
[ERROR] Re-run Maven using the -X switch to enable full debug logging.
[ERROR] 
[ERROR] For more information about the errors and possible solutions, please read the following
articles:
[ERROR] [Help 1] http://cwiki.apache.org/confluence/display/MAVEN/MojoFailureException
[ERROR] 
[ERROR] After correcting the problems, you can resume the build with the command
[ERROR]   mvn <goals> -rf :hive-bridge
2017-09-02 00:54:52,520 DEBUG - [Curator-Framework-0-SendThread(localhost:19026):] ~ ==>
InMemoryJAASConfiguration.getAppConfigurationEntry(Client) (InMemoryJAASConfiguration:208)
2017-09-02 00:54:52,521 DEBUG - [Curator-Framework-0-SendThread(localhost:19026):] ~ <==
InMemoryJAASConfiguration.getAppConfigurationEntry(Client): {} (InMemoryJAASConfiguration:238)
Build step 'Execute shell' marked build as failure
[CHECKSTYLE] Collecting checkstyle analysis files...
[CHECKSTYLE] Searching for all files in <https://builds.apache.org/job/Atlas-master-IntegrationTests/ws/>
that match the pattern **/target/checkstyle-result.xml
[CHECKSTYLE] Parsing 24 files in <https://builds.apache.org/job/Atlas-master-IntegrationTests/ws/>
[CHECKSTYLE] Successfully parsed file <https://builds.apache.org/job/Atlas-master-IntegrationTests/ws/addons/hdfs-model/target/checkstyle-result.xml>
with 0 unique warnings and 0 duplicates.
[CHECKSTYLE] Successfully parsed file <https://builds.apache.org/job/Atlas-master-IntegrationTests/ws/addons/hive-bridge-shim/target/checkstyle-result.xml>
with 15 unique warnings and 0 duplicates.
[CHECKSTYLE] Successfully parsed file <https://builds.apache.org/job/Atlas-master-IntegrationTests/ws/authorization/target/checkstyle-result.xml>
with 482 unique warnings and 0 duplicates.
[CHECKSTYLE] Successfully parsed file <https://builds.apache.org/job/Atlas-master-IntegrationTests/ws/catalog/target/checkstyle-result.xml>
with 2619 unique warnings and 0 duplicates.
[CHECKSTYLE] Successfully parsed file <https://builds.apache.org/job/Atlas-master-IntegrationTests/ws/client/target/checkstyle-result.xml>
with 4256 unique warnings and 0 duplicates.
[CHECKSTYLE] Successfully parsed file <https://builds.apache.org/job/Atlas-master-IntegrationTests/ws/common/target/checkstyle-result.xml>
with 5468 unique warnings and 0 duplicates.
[CHECKSTYLE] Successfully parsed file <https://builds.apache.org/job/Atlas-master-IntegrationTests/ws/dashboardv2/target/checkstyle-result.xml>
with 5468 unique warnings and 0 duplicates.
[CHECKSTYLE] Successfully parsed file <https://builds.apache.org/job/Atlas-master-IntegrationTests/ws/docs/target/checkstyle-result.xml>
with 5468 unique warnings and 0 duplicates.
[CHECKSTYLE] Successfully parsed file <https://builds.apache.org/job/Atlas-master-IntegrationTests/ws/graphdb/api/target/checkstyle-result.xml>
with 5737 unique warnings and 0 duplicates.
[CHECKSTYLE] Successfully parsed file <https://builds.apache.org/job/Atlas-master-IntegrationTests/ws/graphdb/common/target/checkstyle-result.xml>
with 5924 unique warnings and 0 duplicates.
[CHECKSTYLE] Successfully parsed file <https://builds.apache.org/job/Atlas-master-IntegrationTests/ws/graphdb/graphdb-impls/target/checkstyle-result.xml>
with 5924 unique warnings and 0 duplicates.
[CHECKSTYLE] Successfully parsed file <https://builds.apache.org/job/Atlas-master-IntegrationTests/ws/graphdb/target/checkstyle-result.xml>
with 5924 unique warnings and 0 duplicates.
[CHECKSTYLE] Successfully parsed file <https://builds.apache.org/job/Atlas-master-IntegrationTests/ws/graphdb/titan0/target/checkstyle-result.xml>
with 8198 unique warnings and 0 duplicates.
[CHECKSTYLE] Successfully parsed file <https://builds.apache.org/job/Atlas-master-IntegrationTests/ws/graphdb/titan1/target/checkstyle-result.xml>
with 9146 unique warnings and 0 duplicates.
[CHECKSTYLE] Successfully parsed file <https://builds.apache.org/job/Atlas-master-IntegrationTests/ws/intg/target/checkstyle-result.xml>
with 16711 unique warnings and 0 duplicates.
[CHECKSTYLE] Successfully parsed file <https://builds.apache.org/job/Atlas-master-IntegrationTests/ws/notification/target/checkstyle-result.xml>
with 17921 unique warnings and 0 duplicates.
[CHECKSTYLE] Successfully parsed file <https://builds.apache.org/job/Atlas-master-IntegrationTests/ws/plugin-classloader/target/checkstyle-result.xml>
with 18029 unique warnings and 0 duplicates.
[CHECKSTYLE] Successfully parsed file <https://builds.apache.org/job/Atlas-master-IntegrationTests/ws/repository/target/checkstyle-result.xml>
with 37569 unique warnings and 0 duplicates.
[CHECKSTYLE] Successfully parsed file <https://builds.apache.org/job/Atlas-master-IntegrationTests/ws/server-api/target/checkstyle-result.xml>
with 37948 unique warnings and 0 duplicates.
[CHECKSTYLE] Successfully parsed file <https://builds.apache.org/job/Atlas-master-IntegrationTests/ws/shaded/hbase-client-shaded/target/checkstyle-result.xml>
with 37948 unique warnings and 0 duplicates.
[CHECKSTYLE] Successfully parsed file <https://builds.apache.org/job/Atlas-master-IntegrationTests/ws/shaded/hbase-server-shaded/target/checkstyle-result.xml>
with 37948 unique warnings and 0 duplicates.
[CHECKSTYLE] Successfully parsed file <https://builds.apache.org/job/Atlas-master-IntegrationTests/ws/target/checkstyle-result.xml>
with 37948 unique warnings and 0 duplicates.
[CHECKSTYLE] Successfully parsed file <https://builds.apache.org/job/Atlas-master-IntegrationTests/ws/typesystem/target/checkstyle-result.xml>
with 42166 unique warnings and 0 duplicates.
[CHECKSTYLE] Successfully parsed file <https://builds.apache.org/job/Atlas-master-IntegrationTests/ws/webapp/target/checkstyle-result.xml>
with 50344 unique warnings and 0 duplicates.
<Git Blamer> Using GitBlamer to create author and commit information for all warnings.
<Git Blamer> GIT_COMMIT=9d38c6a94f1962a55efb8e047428c2be1e61ad25, workspace=<https://builds.apache.org/job/Atlas-master-IntegrationTests/ws/>
 > git rev-parse 9d38c6a94f1962a55efb8e047428c2be1e61ad25^{commit} # timeout=10
[FINDBUGS] Collecting findbugs analysis files...
[FINDBUGS] Searching for all files in <https://builds.apache.org/job/Atlas-master-IntegrationTests/ws/>
that match the pattern **/target/findbugs.xml
[FINDBUGS] Parsing 15 files in <https://builds.apache.org/job/Atlas-master-IntegrationTests/ws/>
[FINDBUGS] Successfully parsed file <https://builds.apache.org/job/Atlas-master-IntegrationTests/ws/addons/hive-bridge-shim/target/findbugs.xml>
with 0 unique warnings and 0 duplicates.
[FINDBUGS] Successfully parsed file <https://builds.apache.org/job/Atlas-master-IntegrationTests/ws/authorization/target/findbugs.xml>
with 0 unique warnings and 0 duplicates.
[FINDBUGS] Successfully parsed file <https://builds.apache.org/job/Atlas-master-IntegrationTests/ws/catalog/target/findbugs.xml>
with 0 unique warnings and 0 duplicates.
[FINDBUGS] Successfully parsed file <https://builds.apache.org/job/Atlas-master-IntegrationTests/ws/client/target/findbugs.xml>
with 0 unique warnings and 0 duplicates.
[FINDBUGS] Successfully parsed file <https://builds.apache.org/job/Atlas-master-IntegrationTests/ws/common/target/findbugs.xml>
with 0 unique warnings and 0 duplicates.
[FINDBUGS] Successfully parsed file <https://builds.apache.org/job/Atlas-master-IntegrationTests/ws/graphdb/api/target/findbugs.xml>
with 0 unique warnings and 0 duplicates.
[FINDBUGS] Successfully parsed file <https://builds.apache.org/job/Atlas-master-IntegrationTests/ws/graphdb/common/target/findbugs.xml>
with 0 unique warnings and 0 duplicates.
[FINDBUGS] Successfully parsed file <https://builds.apache.org/job/Atlas-master-IntegrationTests/ws/graphdb/titan0/target/findbugs.xml>
with 0 unique warnings and 0 duplicates.
[FINDBUGS] Successfully parsed file <https://builds.apache.org/job/Atlas-master-IntegrationTests/ws/intg/target/findbugs.xml>
with 0 unique warnings and 0 duplicates.
[FINDBUGS] Successfully parsed file <https://builds.apache.org/job/Atlas-master-IntegrationTests/ws/notification/target/findbugs.xml>
with 0 unique warnings and 0 duplicates.
[FINDBUGS] Successfully parsed file <https://builds.apache.org/job/Atlas-master-IntegrationTests/ws/plugin-classloader/target/findbugs.xml>
with 0 unique warnings and 0 duplicates.
[FINDBUGS] Successfully parsed file <https://builds.apache.org/job/Atlas-master-IntegrationTests/ws/repository/target/findbugs.xml>
with 0 unique warnings and 0 duplicates.
[FINDBUGS] Successfully parsed file <https://builds.apache.org/job/Atlas-master-IntegrationTests/ws/server-api/target/findbugs.xml>
with 0 unique warnings and 0 duplicates.
[FINDBUGS] Successfully parsed file <https://builds.apache.org/job/Atlas-master-IntegrationTests/ws/typesystem/target/findbugs.xml>
with 0 unique warnings and 0 duplicates.
[FINDBUGS] Successfully parsed file <https://builds.apache.org/job/Atlas-master-IntegrationTests/ws/webapp/target/findbugs.xml>
with 0 unique warnings and 0 duplicates.
<Git Blamer> Using GitBlamer to create author and commit information for all warnings.
<Git Blamer> GIT_COMMIT=9d38c6a94f1962a55efb8e047428c2be1e61ad25, workspace=<https://builds.apache.org/job/Atlas-master-IntegrationTests/ws/>
Archiving artifacts
[Fast Archiver] No prior successful build to compare, so performing full copy of artifacts
TestNG Reports Processing: START
Looking for TestNG results report in workspace using pattern: **/target/surefire-reports/testng-results.xml,**/target/failsafe-reports/testng-results.xml
Saving reports...
Processing '/x1/jenkins/jenkins-home/jobs/Atlas-master-IntegrationTests/builds/57/testng/testng-results-1.xml'
Processing '/x1/jenkins/jenkins-home/jobs/Atlas-master-IntegrationTests/builds/57/testng/testng-results.xml'
20.786516% of tests failed, which exceeded threshold of 0%. Marking build as UNSTABLE
TestNG Reports Processing: FINISH

Mime
View raw message