atlas-dev mailing list archives

Site index · List index
Message view « Date » · « Thread »
Top « Date » · « Thread »
From Apache Jenkins Server <jenk...@builds.apache.org>
Subject Build failed in Jenkins: Atlas-0.8-IntegrationTests #68
Date Tue, 19 Sep 2017 07:58:23 GMT
See <https://builds.apache.org/job/Atlas-0.8-IntegrationTests/68/display/redirect?page=changes>

Changes:

[madhan] ATLAS-2132: incorrect error for invalid file path/unreadable file

------------------------------------------
[...truncated 535.27 KB...]
127.0.0.1 - - [19/Sep/2017:07:53:47 +0000] "GET /api/atlas/v2/types/classificationdef/name/blah
HTTP/1.1" 404 - "-" "Java/1.7.0_80"
127.0.0.1 - - [19/Sep/2017:07:53:47 +0000] "GET /api/atlas/v2/types/classificationdef/guid/blah
HTTP/1.1" 404 - "-" "Java/1.7.0_80"
127.0.0.1 - - [19/Sep/2017:07:53:47 +0000] "GET /api/atlas/v2/types/entitydef/name/blah HTTP/1.1"
404 - "-" "Java/1.7.0_80"
127.0.0.1 - - [19/Sep/2017:07:53:47 +0000] "GET /api/atlas/v2/types/entitydef/guid/blah HTTP/1.1"
404 - "-" "Java/1.7.0_80"
127.0.0.1 - - [19/Sep/2017:07:53:47 +0000] "POST /api/atlas/v2/types/typedefs/ HTTP/1.1" 200
- "-" "Java/1.7.0_80"
127.0.0.1 - - [19/Sep/2017:07:53:47 +0000] "GET /api/atlas/v2/types/typedefs/?supertype=AmCWthYYQhJ&type=CLASS
HTTP/1.1" 200 - "-" "Java/1.7.0_80"
127.0.0.1 - - [19/Sep/2017:07:53:47 +0000] "GET /api/atlas/v2/types/typedefs/?notsupertype=Bo8z7Ew8H07&supertype=AmCWthYYQhJ&type=CLASS
HTTP/1.1" 200 - "-" "Java/1.7.0_80"
127.0.0.1 - - [19/Sep/2017:07:53:47 +0000] "POST /api/atlas/v2/types/typedefs/ HTTP/1.1" 200
- "-" "Java/1.7.0_80"
127.0.0.1 - - [19/Sep/2017:07:53:47 +0000] "PUT /api/atlas/v2/types/typedefs/ HTTP/1.1" 200
- "-" "Java/1.7.0_80"
127.0.0.1 - - [19/Sep/2017:07:53:48 +0000] "GET /api/atlas/v2/types/typedefs/?type=ENTITY
HTTP/1.1" 200 - "-" "Java/1.7.0_80"
127.0.0.1 - - [19/Sep/2017:07:53:48 +0000] "POST /api/atlas/types HTTP/1.1" 201 - "-" "Java/1.7.0_80"
127.0.0.1 - - [19/Sep/2017:07:53:48 +0000] "POST /api/atlas/types HTTP/1.1" 409 - "-" "Java/1.7.0_80"
127.0.0.1 - - [19/Sep/2017:07:53:48 +0000] "GET /api/atlas/types/blah HTTP/1.1" 404 - "-"
"Java/1.7.0_80"
127.0.0.1 - - [19/Sep/2017:07:53:48 +0000] "GET /api/atlas/v2/types/typedef/name/class_trait
HTTP/1.1" 200 - "-" "Java/1.7.0_80"
127.0.0.1 - - [19/Sep/2017:07:53:48 +0000] "POST /api/atlas/types HTTP/1.1" 201 - "-" "Java/1.7.0_80"
127.0.0.1 - - [19/Sep/2017:07:53:48 +0000] "GET /api/atlas/v2/types/typedef/name/secure_trait
HTTP/1.1" 200 - "-" "Java/1.7.0_80"
127.0.0.1 - - [19/Sep/2017:07:53:48 +0000] "POST /api/atlas/types HTTP/1.1" 201 - "-" "Java/1.7.0_80"
127.0.0.1 - - [19/Sep/2017:07:53:48 +0000] "GET /api/atlas/v2/types/typedef/name/pii_trait
HTTP/1.1" 200 - "-" "Java/1.7.0_80"
127.0.0.1 - - [19/Sep/2017:07:53:48 +0000] "POST /api/atlas/types HTTP/1.1" 201 - "-" "Java/1.7.0_80"
127.0.0.1 - - [19/Sep/2017:07:53:49 +0000] "GET /api/atlas/v2/types/typedef/name/ssn_trait
HTTP/1.1" 200 - "-" "Java/1.7.0_80"
127.0.0.1 - - [19/Sep/2017:07:53:49 +0000] "POST /api/atlas/types HTTP/1.1" 201 - "-" "Java/1.7.0_80"
127.0.0.1 - - [19/Sep/2017:07:53:49 +0000] "GET /api/atlas/v2/types/typedef/name/salary_trait
HTTP/1.1" 200 - "-" "Java/1.7.0_80"
127.0.0.1 - - [19/Sep/2017:07:53:49 +0000] "POST /api/atlas/types HTTP/1.1" 201 - "-" "Java/1.7.0_80"
127.0.0.1 - - [19/Sep/2017:07:53:49 +0000] "GET /api/atlas/v2/types/typedef/name/sox_trait
HTTP/1.1" 200 - "-" "Java/1.7.0_80"
127.0.0.1 - - [19/Sep/2017:07:53:49 +0000] "POST /api/atlas/types HTTP/1.1" 201 - "-" "Java/1.7.0_80"
127.0.0.1 - - [19/Sep/2017:07:53:49 +0000] "GET /api/atlas/types?type=TRAIT HTTP/1.1" 200
- "-" "Java/1.7.0_80"
127.0.0.1 - - [19/Sep/2017:07:53:49 +0000] "GET /api/atlas/v2/types/typedef/name/AvB69Z2RgF1
HTTP/1.1" 404 - "-" "Java/1.7.0_80"
127.0.0.1 - - [19/Sep/2017:07:53:49 +0000] "POST /api/atlas/types HTTP/1.1" 201 - "-" "Java/1.7.0_80"
127.0.0.1 - - [19/Sep/2017:07:53:49 +0000] "GET /api/atlas/v2/types/typedef/name/A1VWivS235qW
HTTP/1.1" 404 - "-" "Java/1.7.0_80"
127.0.0.1 - - [19/Sep/2017:07:53:49 +0000] "POST /api/atlas/types HTTP/1.1" 201 - "-" "Java/1.7.0_80"
127.0.0.1 - - [19/Sep/2017:07:53:50 +0000] "GET /api/atlas/v2/types/typedef/name/Bub6qPrixhl
HTTP/1.1" 404 - "-" "Java/1.7.0_80"
127.0.0.1 - - [19/Sep/2017:07:53:50 +0000] "POST /api/atlas/types HTTP/1.1" 201 - "-" "Java/1.7.0_80"
127.0.0.1 - - [19/Sep/2017:07:53:50 +0000] "GET /api/atlas/v2/types/typedef/name/CsTgFBJWQXM
HTTP/1.1" 404 - "-" "Java/1.7.0_80"
127.0.0.1 - - [19/Sep/2017:07:53:50 +0000] "POST /api/atlas/types HTTP/1.1" 201 - "-" "Java/1.7.0_80"
127.0.0.1 - - [19/Sep/2017:07:53:50 +0000] "GET /api/atlas/types?type=CLASS&supertype=AvB69Z2RgF1&notsupertype=Bub6qPrixhl
HTTP/1.1" 200 - "-" "Java/1.7.0_80"
127.0.0.1 - - [19/Sep/2017:07:53:50 +0000] "POST /api/atlas/types HTTP/1.1" 201 - "-" "Java/1.7.0_80"
127.0.0.1 - - [19/Sep/2017:07:53:50 +0000] "PUT /api/atlas/types HTTP/1.1" 200 - "-" "Java/1.7.0_80"
127.0.0.1 - - [19/Sep/2017:07:53:51 +0000] "GET /api/atlas/types/EWhhzMJVGP HTTP/1.1" 200
- "-" "Java/1.7.0_80"
127.0.0.1 - - [19/Sep/2017:07:54:08 +0000] "GET /api/atlas/v2/types/typedef/name/tableType
HTTP/1.1" 200 - "-" "Java/1.7.0_80"
127.0.0.1 - - [19/Sep/2017:07:54:08 +0000] "GET /api/atlas/v2/types/typedef/name/serdeType
HTTP/1.1" 200 - "-" "Java/1.7.0_80"
127.0.0.1 - - [19/Sep/2017:07:54:08 +0000] "GET /api/atlas/v2/types/typedef/name/classification
HTTP/1.1" 200 - "-" "Java/1.7.0_80"
127.0.0.1 - - [19/Sep/2017:07:54:08 +0000] "GET /api/atlas/v2/types/typedef/name/pii HTTP/1.1"
200 - "-" "Java/1.7.0_80"
127.0.0.1 - - [19/Sep/2017:07:54:08 +0000] "GET /api/atlas/v2/types/typedef/name/phi HTTP/1.1"
200 - "-" "Java/1.7.0_80"
127.0.0.1 - - [19/Sep/2017:07:54:08 +0000] "GET /api/atlas/v2/types/typedef/name/pci HTTP/1.1"
200 - "-" "Java/1.7.0_80"
127.0.0.1 - - [19/Sep/2017:07:54:08 +0000] "GET /api/atlas/v2/types/typedef/name/sox HTTP/1.1"
200 - "-" "Java/1.7.0_80"
127.0.0.1 - - [19/Sep/2017:07:54:08 +0000] "GET /api/atlas/v2/types/typedef/name/sec HTTP/1.1"
200 - "-" "Java/1.7.0_80"
127.0.0.1 - - [19/Sep/2017:07:54:08 +0000] "GET /api/atlas/v2/types/typedef/name/finance HTTP/1.1"
200 - "-" "Java/1.7.0_80"
127.0.0.1 - - [19/Sep/2017:07:54:08 +0000] "GET /api/atlas/v2/types/typedef/name/FactGpZbkbE4v8
HTTP/1.1" 404 - "-" "Java/1.7.0_80"
127.0.0.1 - - [19/Sep/2017:07:54:08 +0000] "GET /api/atlas/v2/types/typedef/name/ETLqYkprYYGwu
HTTP/1.1" 404 - "-" "Java/1.7.0_80"
127.0.0.1 - - [19/Sep/2017:07:54:08 +0000] "GET /api/atlas/v2/types/typedef/name/DimensionfqiceGLMIC
HTTP/1.1" 404 - "-" "Java/1.7.0_80"
127.0.0.1 - - [19/Sep/2017:07:54:08 +0000] "GET /api/atlas/v2/types/typedef/name/MetricnKCWGVrNiu
HTTP/1.1" 404 - "-" "Java/1.7.0_80"
127.0.0.1 - - [19/Sep/2017:07:54:08 +0000] "GET /api/atlas/v2/types/typedef/name/hive_db_v1
HTTP/1.1" 200 - "-" "Java/1.7.0_80"
127.0.0.1 - - [19/Sep/2017:07:54:08 +0000] "GET /api/atlas/v2/types/typedef/name/hive_column_v1
HTTP/1.1" 200 - "-" "Java/1.7.0_80"
127.0.0.1 - - [19/Sep/2017:07:54:08 +0000] "GET /api/atlas/v2/types/typedef/name/hive_table_v1
HTTP/1.1" 200 - "-" "Java/1.7.0_80"
127.0.0.1 - - [19/Sep/2017:07:54:08 +0000] "GET /api/atlas/v2/types/typedef/name/hive_process_v1
HTTP/1.1" 200 - "-" "Java/1.7.0_80"
127.0.0.1 - - [19/Sep/2017:07:54:08 +0000] "POST /api/atlas/types HTTP/1.1" 201 - "-" "Java/1.7.0_80"
127.0.0.1 - - [19/Sep/2017:07:54:08 +0000] "POST /api/atlas/entities HTTP/1.1" 201 - "-" "Java/1.7.0_80"
127.0.0.1 - - [19/Sep/2017:07:54:10 +0000] "GET /api/atlas/discovery/search/dsl?query=hive_db+where+qualifiedName%3D'dbqydK93fNoq'&limit=10&offset=0
HTTP/1.1" 200 - "-" "Java/1.7.0_80"
127.0.0.1 - - [19/Sep/2017:07:54:10 +0000] "GET /api/atlas/entities?type=hive_db&property=qualifiedName&value=dbqydK93fNoq
HTTP/1.1" 200 - "-" "Java/1.7.0_80"
127.0.0.1 - - [19/Sep/2017:07:54:10 +0000] "POST /api/atlas/entities HTTP/1.1" 201 - "-" "Java/1.7.0_80"
127.0.0.1 - - [19/Sep/2017:07:54:12 +0000] "GET /api/atlas/discovery/search/dsl?query=hive_db+where+qualifiedName%3D'dbWUbbG2PTXR'&limit=10&offset=0
HTTP/1.1" 200 - "-" "Java/1.7.0_80"
127.0.0.1 - - [19/Sep/2017:07:54:12 +0000] "GET /api/atlas/discovery/search/dsl?query=hive_db+where+qualifiedName%3D'dbYmIyFtTGL5'&limit=10&offset=0
HTTP/1.1" 200 - "-" "Java/1.7.0_80"
127.0.0.1 - - [19/Sep/2017:07:54:14 +0000] "GET /api/atlas/discovery/search/dsl?query=hive_db+where+qualifiedName%3D'dbjKZRd79o02'&limit=10&offset=0
HTTP/1.1" 200 - "-" "Java/1.7.0_80"
127.0.0.1 - - [19/Sep/2017:07:54:15 +0000] "GET /api/atlas/entities?type=hive_db&property=qualifiedName&value=dbjKZRd79o02
HTTP/1.1" 200 - "-" "Java/1.7.0_80"
127.0.0.1 - - [19/Sep/2017:07:54:15 +0000] "GET /api/atlas/entities/651ec450-c523-4b3c-ab60-ef22adecdf87/audit?count=1
HTTP/1.1" 200 - "-" "Java/1.7.0_80"
127.0.0.1 - - [19/Sep/2017:07:54:15 +0000] "POST /api/atlas/entities HTTP/1.1" 201 - "-" "Java/1.7.0_80"
127.0.0.1 - - [19/Sep/2017:07:54:16 +0000] "GET /api/atlas/entities?type=hive_db&property=qualifiedName&value=dbZmq99MK3ys
HTTP/1.1" 200 - "-" "Java/1.7.0_80"
127.0.0.1 - - [19/Sep/2017:07:54:16 +0000] "GET /api/atlas/entities?type=hive_db&property=qualifiedName&value=dbZmq99MK3ys
HTTP/1.1" 200 - "-" "Java/1.7.0_80"
127.0.0.1 - - [19/Sep/2017:07:54:18 +0000] "GET /api/atlas/discovery/search/dsl?query=hive_db+where+name%3D'dbSOmPgjCVwq'&limit=10&offset=0
HTTP/1.1" 200 - "-" "Java/1.7.0_80"
127.0.0.1 - - [19/Sep/2017:07:54:19 +0000] "POST /api/atlas/entities HTTP/1.1" 201 - "-" "Java/1.7.0_80"
127.0.0.1 - - [19/Sep/2017:07:54:20 +0000] "GET /api/atlas/entities/1616bb48-f7dd-4c3c-ae62-9ad083418c82
HTTP/1.1" 200 - "-" "Java/1.7.0_80"
Tests run: 134, Failures: 10, Errors: 0, Skipped: 3, Time elapsed: 188.768 sec <<<
FAILURE! - in TestSuite
setUp(org.apache.atlas.web.integration.EntityLineageJerseyResourceIT)  Time elapsed: 0.7 sec
 <<< FAILURE!
org.apache.atlas.AtlasServiceException: Metadata service API org.apache.atlas.AtlasBaseClient$APIInfo@537cab13
failed with status 400 (Bad Request) Response Body ({"error":"org.apache.atlas.typesystem.exception.TypeNotFoundException:
Unknown datatype: hive_table_v1"})
	at org.apache.atlas.web.integration.EntityLineageJerseyResourceIT.setUp(EntityLineageJerseyResourceIT.java:61)

testInputsGraph(org.apache.atlas.web.integration.EntityLineageJerseyResourceIT)  Time elapsed:
0.001 sec  <<< FAILURE!
java.lang.IllegalArgumentException: Path segment is null

testInputsGraphForEntity(org.apache.atlas.web.integration.EntityLineageJerseyResourceIT) 
Time elapsed: 0 sec  <<< FAILURE!
java.lang.IllegalArgumentException: One or more of query value parameters are null

testOutputsGraph(org.apache.atlas.web.integration.EntityLineageJerseyResourceIT)  Time elapsed:
0.01 sec  <<< FAILURE!
org.apache.atlas.AtlasServiceException: Metadata service API org.apache.atlas.AtlasBaseClient$APIInfo@4fe802ae
failed with status 404 (Not Found) Response Body ({"error":"Dataset with name = sales_factaCaSLYR9PF
does not exist"})

testOutputsGraphForEntity(org.apache.atlas.web.integration.EntityLineageJerseyResourceIT)
 Time elapsed: 0.009 sec  <<< FAILURE!
org.apache.atlas.AtlasServiceException: Metadata service API org.apache.atlas.AtlasBaseClient$APIInfo@4fb2c0d5
failed with status 404 (Not Found) Response Body ({"error":"Instance hive_table_v1 with unique
attribute {qualifiedName=sales_factaCaSLYR9PF} does not exist"})

testSchema(org.apache.atlas.web.integration.EntityLineageJerseyResourceIT)  Time elapsed:
0.007 sec  <<< FAILURE!
org.apache.atlas.AtlasServiceException: Metadata service API org.apache.atlas.AtlasBaseClient$APIInfo@2bb1b0ae
failed with status 404 (Not Found) Response Body ({"error":"Dataset with name = sales_factaCaSLYR9PF
does not exist"})

testSchemaForEntity(org.apache.atlas.web.integration.EntityLineageJerseyResourceIT)  Time
elapsed: 0.015 sec  <<< FAILURE!
org.apache.atlas.AtlasServiceException: Metadata service API org.apache.atlas.AtlasBaseClient$APIInfo@41373790
failed with status 404 (Not Found) Response Body ({"error":"Instance hive_table_v1 with unique
attribute {qualifiedName=sales_factaCaSLYR9PF} does not exist"})

testAddReferenceProperty(org.apache.atlas.web.integration.EntityJerseyResourceIT)  Time elapsed:
0.301 sec  <<< FAILURE!
org.apache.atlas.AtlasServiceException: Metadata service API org.apache.atlas.AtlasBaseClient$APIInfo@17af0f13
failed with status 400 (Bad Request) Response Body ({"error":"org.apache.atlas.typesystem.exception.TypeNotFoundException:
Unknown datatype: hive_db"})
	at org.apache.atlas.web.integration.EntityJerseyResourceIT.testAddReferenceProperty(EntityJerseyResourceIT.java:447)

testCreateNestedEntities(org.apache.atlas.web.integration.EntityJerseyResourceIT)  Time elapsed:
0.643 sec  <<< FAILURE!
java.lang.AssertionError: expected:<21> but was:<15>
	at org.apache.atlas.web.integration.EntityJerseyResourceIT.testCreateNestedEntities(EntityJerseyResourceIT.java:132)

testDeleteTrait(org.apache.atlas.web.integration.EntityJerseyResourceIT)  Time elapsed: 0.173
sec  <<< FAILURE!
org.apache.atlas.AtlasServiceException: Metadata service API org.apache.atlas.AtlasBaseClient$APIInfo@6a0d2262
failed with status 400 (Bad Request) Response Body ({"error":"org.apache.atlas.typesystem.exception.TypeNotFoundException:
Unknown datatype: hive_table"})
	at org.apache.atlas.web.integration.EntityJerseyResourceIT.testDeleteTrait(EntityJerseyResourceIT.java:726)


Results :

Failed tests: 
  EntityJerseyResourceIT.testAddReferenceProperty:447->BaseResourceIT.createInstance:215
» AtlasService
  EntityJerseyResourceIT.testCreateNestedEntities:132 expected:<21> but was:<15>
  EntityJerseyResourceIT.testDeleteTrait:726->BaseResourceIT.createInstance:215 » AtlasService
  EntityLineageJerseyResourceIT.setUp:61->DataSetLineageJerseyResourceIT.setUp:57->DataSetLineageJerseyResourceIT.setupInstances:206->DataSetLineageJerseyResourceIT.table:275->BaseResourceIT.createInstance:215
» AtlasService
  EntityLineageJerseyResourceIT>DataSetLineageJerseyResourceIT.testInputsGraph:62 »
IllegalArgument
  EntityLineageJerseyResourceIT>DataSetLineageJerseyResourceIT.testInputsGraphForEntity:81
» IllegalArgument
  EntityLineageJerseyResourceIT>DataSetLineageJerseyResourceIT.testOutputsGraph:98 »
AtlasService
  EntityLineageJerseyResourceIT>DataSetLineageJerseyResourceIT.testOutputsGraphForEntity:117
» AtlasService
  EntityLineageJerseyResourceIT>DataSetLineageJerseyResourceIT.testSchema:134 » AtlasService
  EntityLineageJerseyResourceIT>DataSetLineageJerseyResourceIT.testSchemaForEntity:158
» AtlasService

Tests run: 134, Failures: 10, Errors: 0, Skipped: 3

[INFO] 
[INFO] --- jetty-maven-plugin:9.2.12.v20150709:stop (stop-jetty) @ atlas-webapp ---
[INFO] Waiting 10 seconds for jetty to stop
[INFO] Stopped ServerConnector@15821b2a{HTTP/1.1}{0.0.0.0:31000}
[INFO] Closing Spring root WebApplicationContext
[INFO] Shutting down log4j
[INFO] Stopped o.e.j.m.p.JettyWebAppContext@5dde9d79{/,<https://builds.apache.org/job/Atlas-0.8-IntegrationTests/ws/webapp/target/atlas-webapp-0.8.2-SNAPSHOT/,UNAVAILABLE}{/home/jenkins/jenkins-slave/workspace/Atlas-0.8-IntegrationTests/webapp/target/atlas-webapp-0.8.2-SNAPSHOT.war}>
[INFO] Server reports itself as stopped
[INFO] 
[INFO] --- maven-source-plugin:2.4:jar-no-fork (attach-sources) @ atlas-webapp ---
[INFO] Building jar: <https://builds.apache.org/job/Atlas-0.8-IntegrationTests/ws/webapp/target/atlas-webapp-0.8.2-SNAPSHOT-sources.jar>
log4j:WARN No appenders could be found for logger (org.apache.zookeeper.ClientCnxn).
log4j:WARN Please initialize the log4j system properly.
log4j:WARN See http://logging.apache.org/log4j/1.2/faq.html#noconfig for more info.
[INFO] 
[INFO] --- maven-source-plugin:2.4:test-jar-no-fork (attach-sources) @ atlas-webapp ---
[INFO] Building jar: <https://builds.apache.org/job/Atlas-0.8-IntegrationTests/ws/webapp/target/atlas-webapp-0.8.2-SNAPSHOT-test-sources.jar>
[INFO] 
[INFO] --- maven-failsafe-plugin:2.19.1:verify (verify) @ atlas-webapp ---
[INFO] ------------------------------------------------------------------------
[INFO] Reactor Summary:
[INFO] 
[INFO] Apache Atlas Server Build Tools .................... SUCCESS [  0.886 s]
[INFO] apache-atlas ....................................... SUCCESS [  5.037 s]
[INFO] Apache Atlas Integration ........................... SUCCESS [ 26.354 s]
[INFO] Apache Atlas Common ................................ SUCCESS [ 14.388 s]
[INFO] Apache Atlas Typesystem ............................ SUCCESS [01:59 min]
[INFO] Apache Atlas Client ................................ SUCCESS [ 44.561 s]
[INFO] Apache Atlas Server API ............................ SUCCESS [ 12.026 s]
[INFO] Apache Atlas Notification .......................... SUCCESS [ 17.503 s]
[INFO] Apache Atlas Graph Database Projects ............... SUCCESS [  0.648 s]
[INFO] Apache Atlas Graph Database API .................... SUCCESS [  7.708 s]
[INFO] Graph Database Common Code ......................... SUCCESS [  8.047 s]
[INFO] Apache Atlas Titan 1.0.0 GraphDB Impl .............. SUCCESS [ 35.536 s]
[INFO] Shaded version of Apache hbase client .............. SUCCESS [  9.686 s]
[INFO] Apache Atlas Titan 0.5.4 Graph DB Impl ............. SUCCESS [ 47.138 s]
[INFO] Apache Atlas Graph Database Implementation Dependencies SUCCESS [  0.744 s]
[INFO] Shaded version of Apache hbase server .............. SUCCESS [ 26.626 s]
[INFO] Apache Atlas Repository ............................ SUCCESS [01:50 min]
[INFO] Apache Atlas Authorization ......................... SUCCESS [ 11.410 s]
[INFO] Apache Atlas Business Catalog ...................... SUCCESS [ 15.798 s]
[INFO] Apache Atlas UI .................................... SUCCESS [01:40 min]
[INFO] Apache Atlas Web Application ....................... FAILURE [04:50 min]
[INFO] Apache Atlas Documentation ......................... SKIPPED
[INFO] Apache Atlas FileSystem Model ...................... SKIPPED
[INFO] Apache Atlas Plugin Classloader .................... SKIPPED
[INFO] Apache Atlas Hive Bridge Shim ...................... SKIPPED
[INFO] Apache Atlas Hive Bridge ........................... SKIPPED
[INFO] Apache Atlas Falcon Bridge Shim .................... SKIPPED
[INFO] Apache Atlas Falcon Bridge ......................... SKIPPED
[INFO] Apache Atlas Sqoop Bridge Shim ..................... SKIPPED
[INFO] Apache Atlas Sqoop Bridge .......................... SKIPPED
[INFO] Apache Atlas Storm Bridge Shim ..................... SKIPPED
[INFO] Apache Atlas Storm Bridge .......................... SKIPPED
[INFO] Apache Atlas Distribution .......................... SKIPPED
[INFO] ------------------------------------------------------------------------
[INFO] BUILD FAILURE
[INFO] ------------------------------------------------------------------------
[INFO] Total time: 15:07 min
[INFO] Finished at: 2017-09-19T07:54:25Z
[INFO] Final Memory: 358M/1860M
[INFO] ------------------------------------------------------------------------
[ERROR] Failed to execute goal org.apache.maven.plugins:maven-failsafe-plugin:2.19.1:verify
(verify) on project atlas-webapp: There are test failures.
[ERROR] 
[ERROR] Please refer to <https://builds.apache.org/job/Atlas-0.8-IntegrationTests/ws/webapp/target/failsafe-reports>
for the individual test results.
[ERROR] -> [Help 1]
[ERROR] 
[ERROR] To see the full stack trace of the errors, re-run Maven with the -e switch.
[ERROR] Re-run Maven using the -X switch to enable full debug logging.
[ERROR] 
[ERROR] For more information about the errors and possible solutions, please read the following
articles:
[ERROR] [Help 1] http://cwiki.apache.org/confluence/display/MAVEN/MojoFailureException
[ERROR] 
[ERROR] After correcting the problems, you can resume the build with the command
[ERROR]   mvn <goals> -rf :atlas-webapp
Build step 'Execute shell' marked build as failure
[CHECKSTYLE] Collecting checkstyle analysis files...
[CHECKSTYLE] Searching for all files in <https://builds.apache.org/job/Atlas-0.8-IntegrationTests/ws/>
that match the pattern **/target/checkstyle-result.xml
[CHECKSTYLE] Parsing 19 files in <https://builds.apache.org/job/Atlas-0.8-IntegrationTests/ws/>
[CHECKSTYLE] Successfully parsed file <https://builds.apache.org/job/Atlas-0.8-IntegrationTests/ws/authorization/target/checkstyle-result.xml>
with 467 unique warnings and 0 duplicates.
[CHECKSTYLE] Successfully parsed file <https://builds.apache.org/job/Atlas-0.8-IntegrationTests/ws/catalog/target/checkstyle-result.xml>
with 2604 unique warnings and 0 duplicates.
[CHECKSTYLE] Successfully parsed file <https://builds.apache.org/job/Atlas-0.8-IntegrationTests/ws/client/target/checkstyle-result.xml>
with 4242 unique warnings and 0 duplicates.
[CHECKSTYLE] Successfully parsed file <https://builds.apache.org/job/Atlas-0.8-IntegrationTests/ws/common/target/checkstyle-result.xml>
with 5450 unique warnings and 0 duplicates.
[CHECKSTYLE] Successfully parsed file <https://builds.apache.org/job/Atlas-0.8-IntegrationTests/ws/dashboardv2/target/checkstyle-result.xml>
with 5450 unique warnings and 0 duplicates.
[CHECKSTYLE] Successfully parsed file <https://builds.apache.org/job/Atlas-0.8-IntegrationTests/ws/graphdb/api/target/checkstyle-result.xml>
with 5719 unique warnings and 0 duplicates.
[CHECKSTYLE] Successfully parsed file <https://builds.apache.org/job/Atlas-0.8-IntegrationTests/ws/graphdb/common/target/checkstyle-result.xml>
with 5906 unique warnings and 0 duplicates.
[CHECKSTYLE] Successfully parsed file <https://builds.apache.org/job/Atlas-0.8-IntegrationTests/ws/graphdb/graphdb-impls/target/checkstyle-result.xml>
with 5906 unique warnings and 0 duplicates.
[CHECKSTYLE] Successfully parsed file <https://builds.apache.org/job/Atlas-0.8-IntegrationTests/ws/graphdb/target/checkstyle-result.xml>
with 5906 unique warnings and 0 duplicates.
[CHECKSTYLE] Successfully parsed file <https://builds.apache.org/job/Atlas-0.8-IntegrationTests/ws/graphdb/titan0/target/checkstyle-result.xml>
with 8291 unique warnings and 0 duplicates.
[CHECKSTYLE] Successfully parsed file <https://builds.apache.org/job/Atlas-0.8-IntegrationTests/ws/graphdb/titan1/target/checkstyle-result.xml>
with 9239 unique warnings and 0 duplicates.
[CHECKSTYLE] Successfully parsed file <https://builds.apache.org/job/Atlas-0.8-IntegrationTests/ws/intg/target/checkstyle-result.xml>
with 15671 unique warnings and 0 duplicates.
[CHECKSTYLE] Successfully parsed file <https://builds.apache.org/job/Atlas-0.8-IntegrationTests/ws/notification/target/checkstyle-result.xml>
with 16881 unique warnings and 0 duplicates.
[CHECKSTYLE] Successfully parsed file <https://builds.apache.org/job/Atlas-0.8-IntegrationTests/ws/repository/target/checkstyle-result.xml>
with 35705 unique warnings and 0 duplicates.
[CHECKSTYLE] Successfully parsed file <https://builds.apache.org/job/Atlas-0.8-IntegrationTests/ws/server-api/target/checkstyle-result.xml>
with 36084 unique warnings and 0 duplicates.
[CHECKSTYLE] Successfully parsed file <https://builds.apache.org/job/Atlas-0.8-IntegrationTests/ws/shaded/hbase-client-shaded/target/checkstyle-result.xml>
with 36084 unique warnings and 0 duplicates.
[CHECKSTYLE] Successfully parsed file <https://builds.apache.org/job/Atlas-0.8-IntegrationTests/ws/shaded/hbase-server-shaded/target/checkstyle-result.xml>
with 36084 unique warnings and 0 duplicates.
[CHECKSTYLE] Successfully parsed file <https://builds.apache.org/job/Atlas-0.8-IntegrationTests/ws/target/checkstyle-result.xml>
with 36084 unique warnings and 0 duplicates.
[CHECKSTYLE] Successfully parsed file <https://builds.apache.org/job/Atlas-0.8-IntegrationTests/ws/typesystem/target/checkstyle-result.xml>
with 40302 unique warnings and 0 duplicates.
<Git Blamer> Using GitBlamer to create author and commit information for all warnings.
<Git Blamer> GIT_COMMIT=1b56bec751c3a2664a1bf852cf7e4256cfdb8b1d, workspace=<https://builds.apache.org/job/Atlas-0.8-IntegrationTests/ws/>
 > git rev-parse 1b56bec751c3a2664a1bf852cf7e4256cfdb8b1d^{commit} # timeout=10
[FINDBUGS] Collecting findbugs analysis files...
[FINDBUGS] Searching for all files in <https://builds.apache.org/job/Atlas-0.8-IntegrationTests/ws/>
that match the pattern **/target/findbugs.xml
[FINDBUGS] Parsing 12 files in <https://builds.apache.org/job/Atlas-0.8-IntegrationTests/ws/>
[FINDBUGS] Successfully parsed file <https://builds.apache.org/job/Atlas-0.8-IntegrationTests/ws/authorization/target/findbugs.xml>
with 0 unique warnings and 0 duplicates.
[FINDBUGS] Successfully parsed file <https://builds.apache.org/job/Atlas-0.8-IntegrationTests/ws/catalog/target/findbugs.xml>
with 0 unique warnings and 0 duplicates.
[FINDBUGS] Successfully parsed file <https://builds.apache.org/job/Atlas-0.8-IntegrationTests/ws/client/target/findbugs.xml>
with 0 unique warnings and 0 duplicates.
[FINDBUGS] Successfully parsed file <https://builds.apache.org/job/Atlas-0.8-IntegrationTests/ws/common/target/findbugs.xml>
with 0 unique warnings and 0 duplicates.
[FINDBUGS] Successfully parsed file <https://builds.apache.org/job/Atlas-0.8-IntegrationTests/ws/graphdb/api/target/findbugs.xml>
with 0 unique warnings and 0 duplicates.
[FINDBUGS] Successfully parsed file <https://builds.apache.org/job/Atlas-0.8-IntegrationTests/ws/graphdb/common/target/findbugs.xml>
with 0 unique warnings and 0 duplicates.
[FINDBUGS] Successfully parsed file <https://builds.apache.org/job/Atlas-0.8-IntegrationTests/ws/graphdb/titan0/target/findbugs.xml>
with 0 unique warnings and 0 duplicates.
[FINDBUGS] Successfully parsed file <https://builds.apache.org/job/Atlas-0.8-IntegrationTests/ws/intg/target/findbugs.xml>
with 0 unique warnings and 0 duplicates.
[FINDBUGS] Successfully parsed file <https://builds.apache.org/job/Atlas-0.8-IntegrationTests/ws/notification/target/findbugs.xml>
with 0 unique warnings and 0 duplicates.
[FINDBUGS] Successfully parsed file <https://builds.apache.org/job/Atlas-0.8-IntegrationTests/ws/repository/target/findbugs.xml>
with 0 unique warnings and 0 duplicates.
[FINDBUGS] Successfully parsed file <https://builds.apache.org/job/Atlas-0.8-IntegrationTests/ws/server-api/target/findbugs.xml>
with 0 unique warnings and 0 duplicates.
[FINDBUGS] Successfully parsed file <https://builds.apache.org/job/Atlas-0.8-IntegrationTests/ws/typesystem/target/findbugs.xml>
with 0 unique warnings and 0 duplicates.
<Git Blamer> Using GitBlamer to create author and commit information for all warnings.
<Git Blamer> GIT_COMMIT=1b56bec751c3a2664a1bf852cf7e4256cfdb8b1d, workspace=<https://builds.apache.org/job/Atlas-0.8-IntegrationTests/ws/>
Archiving artifacts
[Fast Archiver] No prior successful build to compare, so performing full copy of artifacts
TestNG Reports Processing: START
Looking for TestNG results report in workspace using pattern: **/target/surefire-reports/testng-results.xml,**/target/failsafe-reports/testng-results.xml
Saving reports...
Processing '/x1/jenkins/jenkins-home/jobs/Atlas-0.8-IntegrationTests/builds/68/testng/testng-results.xml'
6.766917% of tests failed, which exceeded threshold of 0%. Marking build as UNSTABLE
TestNG Reports Processing: FINISH

Mime
View raw message