atlas-dev mailing list archives

Site index · List index
Message view « Date » · « Thread »
Top « Date » · « Thread »
From Apache Jenkins Server <jenk...@builds.apache.org>
Subject Build failed in Jenkins: Atlas-0.8-IntegrationTests #76
Date Fri, 22 Sep 2017 13:55:55 GMT
See <https://builds.apache.org/job/Atlas-0.8-IntegrationTests/76/display/redirect?page=changes>

Changes:

[kbhatt] ATLAS-2039 : Unable to edit date value from UI when entity definition is

[kbhatt] ATLAS-1905 : Search UI is confusing to user

[kbhatt] ATLAS-2162 : Add hyperlink for URI formatted attribute value on property

[kbhatt] ATLAS-2167 : UI - Redirection of Pagination gives issue if user enter

------------------------------------------
[...truncated 491.09 KB...]
127.0.0.1 - - [22/Sep/2017:13:51:11 +0000] "POST /api/atlas/v2/entity/ HTTP/1.1" 200 - "-"
"Java/1.7.0_80"
127.0.0.1 - - [22/Sep/2017:13:51:11 +0000] "DELETE /api/atlas/v2/entity/uniqueAttribute/type/hive_db_v2?attr:name=dbKizHvwaO5P%EA%82%9C%EF%BB%8C%E1%8E%92%E4%96%92%EE%85%B1%E5%8D%82%EC%90%9F%DC%BD%D0%B6%EE%8D%B5
HTTP/1.1" 200 - "-" "Java/1.7.0_80"
127.0.0.1 - - [22/Sep/2017:13:51:11 +0000] "DELETE /api/atlas/v2/entity/guid/random/classification/blah_trait
HTTP/1.1" 400 - "-" "Java/1.7.0_80"
127.0.0.1 - - [22/Sep/2017:13:51:11 +0000] "GET /api/atlas/discovery/search/dsl?query=hive_db_v2+where+name%3D'dbKizHvwaO5P'&limit=10&offset=0
HTTP/1.1" 200 - "-" "Java/1.7.0_80"
127.0.0.1 - - [22/Sep/2017:13:51:12 +0000] "GET /api/atlas/discovery/search/dsl?query=hive_db_v2+where+name%3D'dbKizHvwaO5P'&limit=10&offset=0
HTTP/1.1" 200 - "-" "Java/1.7.0_80"
127.0.0.1 - - [22/Sep/2017:13:51:13 +0000] "POST /api/atlas/v2/entity/ HTTP/1.1" 200 - "-"
"Java/1.7.0_80"
127.0.0.1 - - [22/Sep/2017:13:51:13 +0000] "GET /api/atlas/discovery/search/dsl?query=hive_db_v2+where+name%3D'dbKizHvwaO5P'&limit=10&offset=0
HTTP/1.1" 200 - "-" "Java/1.7.0_80"
127.0.0.1 - - [22/Sep/2017:13:51:13 +0000] "POST /api/atlas/v2/types/typedefs/ HTTP/1.1" 200
- "-" "Java/1.7.0_80"
127.0.0.1 - - [22/Sep/2017:13:51:14 +0000] "POST /api/atlas/v2/entity/ HTTP/1.1" 200 - "-"
"Java/1.7.0_80"
127.0.0.1 - - [22/Sep/2017:13:51:14 +0000] "PUT /api/atlas/v2/types/typedefs/ HTTP/1.1" 200
- "-" "Java/1.7.0_80"
127.0.0.1 - - [22/Sep/2017:13:51:14 +0000] "GET /api/atlas/v2/entity/guid/e7380a67-16ae-46b9-943c-8d0ebcaeadaa
HTTP/1.1" 200 - "-" "Java/1.7.0_80"
127.0.0.1 - - [22/Sep/2017:13:51:14 +0000] "POST /api/atlas/v2/entity/ HTTP/1.1" 404 - "-"
"Java/1.7.0_80"
127.0.0.1 - - [22/Sep/2017:13:51:14 +0000] "POST /api/atlas/v2/entity/ HTTP/1.1" 200 - "-"
"Java/1.7.0_80"
127.0.0.1 - - [22/Sep/2017:13:51:14 +0000] "POST /api/atlas/v2/entity/ HTTP/1.1" 200 - "-"
"Java/1.7.0_80"
127.0.0.1 - - [22/Sep/2017:13:51:14 +0000] "GET /api/atlas/v2/entity/uniqueAttribute/type/hive_db_v2?attr:name=dbKizHvwaO5P
HTTP/1.1" 200 - "-" "Java/1.7.0_80"
127.0.0.1 - - [22/Sep/2017:13:51:14 +0000] "POST /api/atlas/v2/entity/ HTTP/1.1" 200 - "-"
"Java/1.7.0_80"
127.0.0.1 - - [22/Sep/2017:13:51:14 +0000] "POST /api/atlas/v2/entity/ HTTP/1.1" 200 - "-"
"Java/1.7.0_80"
127.0.0.1 - - [22/Sep/2017:13:51:14 +0000] "GET /api/atlas/v2/types/typedef/name/ii1RoiuVwA
HTTP/1.1" 404 - "-" "Java/1.7.0_80"
127.0.0.1 - - [22/Sep/2017:13:51:14 +0000] "POST /api/atlas/v2/types/typedefs/ HTTP/1.1" 200
- "-" "Java/1.7.0_80"
127.0.0.1 - - [22/Sep/2017:13:51:14 +0000] "POST /api/atlas/v2/entity/ HTTP/1.1" 200 - "-"
"Java/1.7.0_80"
127.0.0.1 - - [22/Sep/2017:13:51:14 +0000] "GET /api/atlas/v2/entity/guid/54b4ed19-082c-4716-a10b-6ddf4f0c6652
HTTP/1.1" 200 - "-" "Java/1.7.0_80"
127.0.0.1 - - [22/Sep/2017:13:51:14 +0000] "GET /api/atlas/v2/entity/guid/blah HTTP/1.1" 404
- "-" "Java/1.7.0_80"
127.0.0.1 - - [22/Sep/2017:13:51:14 +0000] "POST /api/atlas/v2/entity/ HTTP/1.1" 200 - "-"
"Java/1.7.0_80"
127.0.0.1 - - [22/Sep/2017:13:51:14 +0000] "GET /api/atlas/entities/5e0cacfa-d573-434f-abf5-a7c7c923833c/audit?count=10
HTTP/1.1" 200 - "-" "Java/1.7.0_80"
127.0.0.1 - - [22/Sep/2017:13:51:14 +0000] "GET /api/atlas/discovery/search/dsl?query=from+hive_db_v1+name%3D%22dbbapcWK8yEU%22
HTTP/1.1" 200 - "-" "Java/1.7.0_80"
127.0.0.1 - - [22/Sep/2017:13:51:15 +0000] "GET /api/atlas/discovery/search/dsl?query=from+blah
HTTP/1.1" 400 - "-" "Java/1.7.0_80"
127.0.0.1 - - [22/Sep/2017:13:51:15 +0000] "GET /api/atlas/discovery/search?query=* HTTP/1.1"
200 - "-" "Java/1.7.0_80"
127.0.0.1 - - [22/Sep/2017:13:51:15 +0000] "GET /api/atlas/discovery/search?query=from+hive_db_v1+name%3D%22dbbapcWK8yEU%22
HTTP/1.1" 200 - "-" "Java/1.7.0_80"
127.0.0.1 - - [22/Sep/2017:13:51:16 +0000] "GET /api/atlas/discovery/search/gremlin?query=g.V.has('type',+'hive_table_v1').toList()
HTTP/1.1" 200 - "-" "Java/1.7.0_80"
127.0.0.1 - - [22/Sep/2017:13:51:17 +0000] "POST /api/atlas/v2/types/typedefs/ HTTP/1.1" 200
- "-" "Java/1.7.0_80"
127.0.0.1 - - [22/Sep/2017:13:51:17 +0000] "POST /api/atlas/v2/types/typedefs/ HTTP/1.1" 409
- "-" "Java/1.7.0_80"
127.0.0.1 - - [22/Sep/2017:13:51:17 +0000] "GET /api/atlas/v2/types/enumdef/name/blah HTTP/1.1"
404 - "-" "Java/1.7.0_80"
127.0.0.1 - - [22/Sep/2017:13:51:17 +0000] "GET /api/atlas/v2/types/enumdef/guid/blah HTTP/1.1"
404 - "-" "Java/1.7.0_80"
127.0.0.1 - - [22/Sep/2017:13:51:17 +0000] "GET /api/atlas/v2/types/structdef/name/blah HTTP/1.1"
404 - "-" "Java/1.7.0_80"
127.0.0.1 - - [22/Sep/2017:13:51:17 +0000] "GET /api/atlas/v2/types/structdef/guid/blah HTTP/1.1"
404 - "-" "Java/1.7.0_80"
127.0.0.1 - - [22/Sep/2017:13:51:17 +0000] "GET /api/atlas/v2/types/classificationdef/name/blah
HTTP/1.1" 404 - "-" "Java/1.7.0_80"
127.0.0.1 - - [22/Sep/2017:13:51:17 +0000] "GET /api/atlas/v2/types/classificationdef/guid/blah
HTTP/1.1" 404 - "-" "Java/1.7.0_80"
127.0.0.1 - - [22/Sep/2017:13:51:17 +0000] "GET /api/atlas/v2/types/entitydef/name/blah HTTP/1.1"
404 - "-" "Java/1.7.0_80"
127.0.0.1 - - [22/Sep/2017:13:51:17 +0000] "GET /api/atlas/v2/types/entitydef/guid/blah HTTP/1.1"
404 - "-" "Java/1.7.0_80"
127.0.0.1 - - [22/Sep/2017:13:51:17 +0000] "POST /api/atlas/v2/types/typedefs/ HTTP/1.1" 200
- "-" "Java/1.7.0_80"
127.0.0.1 - - [22/Sep/2017:13:51:17 +0000] "GET /api/atlas/v2/types/typedefs/?supertype=Ag9CjvdXAtk&type=CLASS
HTTP/1.1" 200 - "-" "Java/1.7.0_80"
127.0.0.1 - - [22/Sep/2017:13:51:17 +0000] "GET /api/atlas/v2/types/typedefs/?notsupertype=BITMqgz8SCJ&supertype=Ag9CjvdXAtk&type=CLASS
HTTP/1.1" 200 - "-" "Java/1.7.0_80"
127.0.0.1 - - [22/Sep/2017:13:51:17 +0000] "POST /api/atlas/v2/types/typedefs/ HTTP/1.1" 200
- "-" "Java/1.7.0_80"
127.0.0.1 - - [22/Sep/2017:13:51:17 +0000] "PUT /api/atlas/v2/types/typedefs/ HTTP/1.1" 200
- "-" "Java/1.7.0_80"
127.0.0.1 - - [22/Sep/2017:13:51:17 +0000] "GET /api/atlas/v2/types/typedefs/?type=ENTITY
HTTP/1.1" 200 - "-" "Java/1.7.0_80"
127.0.0.1 - - [22/Sep/2017:13:51:17 +0000] "POST /api/atlas/types HTTP/1.1" 201 - "-" "Java/1.7.0_80"
127.0.0.1 - - [22/Sep/2017:13:51:18 +0000] "POST /api/atlas/types HTTP/1.1" 409 - "-" "Java/1.7.0_80"
127.0.0.1 - - [22/Sep/2017:13:51:18 +0000] "GET /api/atlas/types/blah HTTP/1.1" 404 - "-"
"Java/1.7.0_80"
127.0.0.1 - - [22/Sep/2017:13:51:18 +0000] "GET /api/atlas/v2/types/typedef/name/class_trait
HTTP/1.1" 404 - "-" "Java/1.7.0_80"
127.0.0.1 - - [22/Sep/2017:13:51:18 +0000] "POST /api/atlas/types HTTP/1.1" 201 - "-" "Java/1.7.0_80"
127.0.0.1 - - [22/Sep/2017:13:51:18 +0000] "GET /api/atlas/v2/types/typedef/name/secure_trait
HTTP/1.1" 404 - "-" "Java/1.7.0_80"
127.0.0.1 - - [22/Sep/2017:13:51:18 +0000] "POST /api/atlas/types HTTP/1.1" 201 - "-" "Java/1.7.0_80"
127.0.0.1 - - [22/Sep/2017:13:51:18 +0000] "GET /api/atlas/v2/types/typedef/name/pii_trait
HTTP/1.1" 404 - "-" "Java/1.7.0_80"
127.0.0.1 - - [22/Sep/2017:13:51:18 +0000] "POST /api/atlas/types HTTP/1.1" 201 - "-" "Java/1.7.0_80"
127.0.0.1 - - [22/Sep/2017:13:51:18 +0000] "GET /api/atlas/v2/types/typedef/name/ssn_trait
HTTP/1.1" 404 - "-" "Java/1.7.0_80"
127.0.0.1 - - [22/Sep/2017:13:51:18 +0000] "POST /api/atlas/types HTTP/1.1" 201 - "-" "Java/1.7.0_80"
127.0.0.1 - - [22/Sep/2017:13:51:18 +0000] "GET /api/atlas/v2/types/typedef/name/salary_trait
HTTP/1.1" 404 - "-" "Java/1.7.0_80"
127.0.0.1 - - [22/Sep/2017:13:51:18 +0000] "POST /api/atlas/types HTTP/1.1" 201 - "-" "Java/1.7.0_80"
127.0.0.1 - - [22/Sep/2017:13:51:18 +0000] "GET /api/atlas/v2/types/typedef/name/sox_trait
HTTP/1.1" 404 - "-" "Java/1.7.0_80"
127.0.0.1 - - [22/Sep/2017:13:51:18 +0000] "POST /api/atlas/types HTTP/1.1" 201 - "-" "Java/1.7.0_80"
127.0.0.1 - - [22/Sep/2017:13:51:18 +0000] "GET /api/atlas/types?type=TRAIT HTTP/1.1" 200
- "-" "Java/1.7.0_80"
127.0.0.1 - - [22/Sep/2017:13:51:18 +0000] "GET /api/atlas/v2/types/typedef/name/AE8GtlY5W26
HTTP/1.1" 404 - "-" "Java/1.7.0_80"
127.0.0.1 - - [22/Sep/2017:13:51:18 +0000] "POST /api/atlas/types HTTP/1.1" 201 - "-" "Java/1.7.0_80"
127.0.0.1 - - [22/Sep/2017:13:51:18 +0000] "GET /api/atlas/v2/types/typedef/name/A1QBFtMUJ5Ze
HTTP/1.1" 404 - "-" "Java/1.7.0_80"
127.0.0.1 - - [22/Sep/2017:13:51:18 +0000] "POST /api/atlas/types HTTP/1.1" 201 - "-" "Java/1.7.0_80"
127.0.0.1 - - [22/Sep/2017:13:51:19 +0000] "GET /api/atlas/v2/types/typedef/name/BJWTylScKR5
HTTP/1.1" 404 - "-" "Java/1.7.0_80"
127.0.0.1 - - [22/Sep/2017:13:51:19 +0000] "POST /api/atlas/types HTTP/1.1" 201 - "-" "Java/1.7.0_80"
127.0.0.1 - - [22/Sep/2017:13:51:19 +0000] "GET /api/atlas/v2/types/typedef/name/Cd4q9seEwuP
HTTP/1.1" 404 - "-" "Java/1.7.0_80"
127.0.0.1 - - [22/Sep/2017:13:51:19 +0000] "POST /api/atlas/types HTTP/1.1" 201 - "-" "Java/1.7.0_80"
127.0.0.1 - - [22/Sep/2017:13:51:19 +0000] "GET /api/atlas/types?type=CLASS&supertype=AE8GtlY5W26&notsupertype=BJWTylScKR5
HTTP/1.1" 200 - "-" "Java/1.7.0_80"
127.0.0.1 - - [22/Sep/2017:13:51:19 +0000] "POST /api/atlas/types HTTP/1.1" 201 - "-" "Java/1.7.0_80"
127.0.0.1 - - [22/Sep/2017:13:51:19 +0000] "PUT /api/atlas/types HTTP/1.1" 200 - "-" "Java/1.7.0_80"
127.0.0.1 - - [22/Sep/2017:13:51:19 +0000] "GET /api/atlas/types/BEyFQlAdpd HTTP/1.1" 200
- "-" "Java/1.7.0_80"
127.0.0.1 - - [22/Sep/2017:13:51:20 +0000] "GET /api/atlas/v2/types/typedef/name/tableType
HTTP/1.1" 200 - "-" "Java/1.7.0_80"
127.0.0.1 - - [22/Sep/2017:13:51:20 +0000] "GET /api/atlas/v2/types/typedef/name/serdeType
HTTP/1.1" 200 - "-" "Java/1.7.0_80"
127.0.0.1 - - [22/Sep/2017:13:51:20 +0000] "GET /api/atlas/v2/types/typedef/name/classification
HTTP/1.1" 200 - "-" "Java/1.7.0_80"
127.0.0.1 - - [22/Sep/2017:13:51:20 +0000] "GET /api/atlas/v2/types/typedef/name/pii HTTP/1.1"
200 - "-" "Java/1.7.0_80"
127.0.0.1 - - [22/Sep/2017:13:51:20 +0000] "GET /api/atlas/v2/types/typedef/name/phi HTTP/1.1"
200 - "-" "Java/1.7.0_80"
127.0.0.1 - - [22/Sep/2017:13:51:20 +0000] "GET /api/atlas/v2/types/typedef/name/pci HTTP/1.1"
200 - "-" "Java/1.7.0_80"
127.0.0.1 - - [22/Sep/2017:13:51:20 +0000] "GET /api/atlas/v2/types/typedef/name/sox HTTP/1.1"
200 - "-" "Java/1.7.0_80"
127.0.0.1 - - [22/Sep/2017:13:51:20 +0000] "GET /api/atlas/v2/types/typedef/name/sec HTTP/1.1"
200 - "-" "Java/1.7.0_80"
127.0.0.1 - - [22/Sep/2017:13:51:20 +0000] "GET /api/atlas/v2/types/typedef/name/finance HTTP/1.1"
200 - "-" "Java/1.7.0_80"
127.0.0.1 - - [22/Sep/2017:13:51:20 +0000] "GET /api/atlas/v2/types/typedef/name/FactcPUcd1suMZ
HTTP/1.1" 404 - "-" "Java/1.7.0_80"
127.0.0.1 - - [22/Sep/2017:13:51:20 +0000] "GET /api/atlas/v2/types/typedef/name/ETLRIptg65YWC
HTTP/1.1" 404 - "-" "Java/1.7.0_80"
127.0.0.1 - - [22/Sep/2017:13:51:20 +0000] "GET /api/atlas/v2/types/typedef/name/DimensionbxrLlO9B8b
HTTP/1.1" 404 - "-" "Java/1.7.0_80"
127.0.0.1 - - [22/Sep/2017:13:51:20 +0000] "GET /api/atlas/v2/types/typedef/name/MetricLzmGCvg7Yf
HTTP/1.1" 404 - "-" "Java/1.7.0_80"
127.0.0.1 - - [22/Sep/2017:13:51:20 +0000] "GET /api/atlas/v2/types/typedef/name/hive_db_v1
HTTP/1.1" 200 - "-" "Java/1.7.0_80"
127.0.0.1 - - [22/Sep/2017:13:51:20 +0000] "GET /api/atlas/v2/types/typedef/name/hive_column_v1
HTTP/1.1" 200 - "-" "Java/1.7.0_80"
127.0.0.1 - - [22/Sep/2017:13:51:20 +0000] "GET /api/atlas/v2/types/typedef/name/hive_table_v1
HTTP/1.1" 200 - "-" "Java/1.7.0_80"
127.0.0.1 - - [22/Sep/2017:13:51:20 +0000] "GET /api/atlas/v2/types/typedef/name/hive_process_v1
HTTP/1.1" 200 - "-" "Java/1.7.0_80"
127.0.0.1 - - [22/Sep/2017:13:51:20 +0000] "POST /api/atlas/types HTTP/1.1" 201 - "-" "Java/1.7.0_80"
127.0.0.1 - - [22/Sep/2017:13:51:20 +0000] "POST /api/atlas/entities HTTP/1.1" 201 - "-" "Java/1.7.0_80"
127.0.0.1 - - [22/Sep/2017:13:51:22 +0000] "GET /api/atlas/discovery/search/dsl?query=hive_db+where+qualifiedName%3D'dbZ5YC3BdkWR'&limit=10&offset=0
HTTP/1.1" 200 - "-" "Java/1.7.0_80"
127.0.0.1 - - [22/Sep/2017:13:51:22 +0000] "GET /api/atlas/entities?type=hive_db&property=qualifiedName&value=dbZ5YC3BdkWR
HTTP/1.1" 200 - "-" "Java/1.7.0_80"
127.0.0.1 - - [22/Sep/2017:13:51:22 +0000] "POST /api/atlas/entities HTTP/1.1" 201 - "-" "Java/1.7.0_80"
127.0.0.1 - - [22/Sep/2017:13:51:24 +0000] "GET /api/atlas/discovery/search/dsl?query=hive_db+where+qualifiedName%3D'dbXXZEcJmqxy'&limit=10&offset=0
HTTP/1.1" 200 - "-" "Java/1.7.0_80"
127.0.0.1 - - [22/Sep/2017:13:51:24 +0000] "GET /api/atlas/discovery/search/dsl?query=hive_db+where+qualifiedName%3D'dbsIlBlRpNL4'&limit=10&offset=0
HTTP/1.1" 200 - "-" "Java/1.7.0_80"
127.0.0.1 - - [22/Sep/2017:13:51:26 +0000] "GET /api/atlas/discovery/search/dsl?query=hive_db+where+qualifiedName%3D'dbSuFIFUM0MS'&limit=10&offset=0
HTTP/1.1" 200 - "-" "Java/1.7.0_80"
127.0.0.1 - - [22/Sep/2017:13:51:27 +0000] "GET /api/atlas/entities?type=hive_db&property=qualifiedName&value=dbSuFIFUM0MS
HTTP/1.1" 200 - "-" "Java/1.7.0_80"
127.0.0.1 - - [22/Sep/2017:13:51:27 +0000] "GET /api/atlas/entities/e0243881-8b3d-4ff2-b0e1-d7ec668cd022/audit?count=1
HTTP/1.1" 200 - "-" "Java/1.7.0_80"
127.0.0.1 - - [22/Sep/2017:13:51:27 +0000] "POST /api/atlas/entities HTTP/1.1" 201 - "-" "Java/1.7.0_80"
127.0.0.1 - - [22/Sep/2017:13:51:28 +0000] "GET /api/atlas/entities?type=hive_db&property=qualifiedName&value=dbMpFhKuE9Et
HTTP/1.1" 200 - "-" "Java/1.7.0_80"
127.0.0.1 - - [22/Sep/2017:13:51:28 +0000] "GET /api/atlas/entities?type=hive_db&property=qualifiedName&value=dbMpFhKuE9Et
HTTP/1.1" 200 - "-" "Java/1.7.0_80"
127.0.0.1 - - [22/Sep/2017:13:51:30 +0000] "GET /api/atlas/discovery/search/dsl?query=hive_db+where+name%3D'dbJliwLlHpfv'&limit=10&offset=0
HTTP/1.1" 200 - "-" "Java/1.7.0_80"
127.0.0.1 - - [22/Sep/2017:13:51:31 +0000] "POST /api/atlas/entities HTTP/1.1" 201 - "-" "Java/1.7.0_80"
127.0.0.1 - - [22/Sep/2017:13:51:32 +0000] "GET /api/atlas/entities/72625230-18eb-476a-ba6a-bc02d645eea1
HTTP/1.1" 200 - "-" "Java/1.7.0_80"
127.0.0.1 - - [22/Sep/2017:13:51:32 +0000] "GET /api/atlas/admin/session HTTP/1.1" 200 - "-"
"Java/1.7.0_80"
127.0.0.1 - - [22/Sep/2017:13:51:32 +0000] "GET /api/atlas/v1/taxonomies HTTP/1.1" 403 493
"-" "Java/1.7.0_80"
127.0.0.1 - - [22/Sep/2017:13:51:32 +0000] "GET /api/atlas/admin/status HTTP/1.1" 200 - "-"
"Java/1.7.0_80"
127.0.0.1 - - [22/Sep/2017:13:51:32 +0000] "GET /api/atlas/admin/session HTTP/1.1" 401 317
"-" "Java/1.7.0_80"
127.0.0.1 - - [22/Sep/2017:13:51:36 +0000] "POST /api/atlas/v2/types/typedefs/ HTTP/1.1" 409
- "-" "Java/1.7.0_80"
Tests run: 134, Failures: 1, Errors: 0, Skipped: 5, Time elapsed: 117.507 sec <<<
FAILURE! - in TestSuite
runQuickStart(org.apache.atlas.examples.QuickStartV2IT)  Time elapsed: 0.486 sec  <<<
FAILURE!
org.apache.atlas.AtlasServiceException: Metadata service API org.apache.atlas.AtlasBaseClient$APIInfo@5a56db88
failed with status 409 (Conflict) Response Body ({"errorCode":"ATLAS-409-00-001","errorMessage":"Given
type Dimension already exists"})
	at org.apache.atlas.examples.QuickStartV2IT.runQuickStart(QuickStartV2IT.java:49)


Results :

Failed tests: 
  QuickStartV2IT.runQuickStart:49 » AtlasService Metadata service API org.apache...

Tests run: 134, Failures: 1, Errors: 0, Skipped: 5

[INFO] 
[INFO] --- jetty-maven-plugin:9.2.12.v20150709:stop (stop-jetty) @ atlas-webapp ---
[INFO] Waiting 10 seconds for jetty to stop
[INFO] Stopped ServerConnector@44c87a70{HTTP/1.1}{0.0.0.0:31000}
[INFO] Closing Spring root WebApplicationContext
[INFO] Shutting down log4j
[INFO] Stopped o.e.j.m.p.JettyWebAppContext@312747f7{/,<https://builds.apache.org/job/Atlas-0.8-IntegrationTests/ws/webapp/target/atlas-webapp-0.8.2-SNAPSHOT/,UNAVAILABLE}{/home/jenkins/jenkins-slave/workspace/Atlas-0.8-IntegrationTests/webapp/target/atlas-webapp-0.8.2-SNAPSHOT.war}>
[INFO] Server reports itself as stopped
[INFO] 
[INFO] --- maven-source-plugin:2.4:jar-no-fork (attach-sources) @ atlas-webapp ---
[INFO] Building jar: <https://builds.apache.org/job/Atlas-0.8-IntegrationTests/ws/webapp/target/atlas-webapp-0.8.2-SNAPSHOT-sources.jar>
log4j:WARN No appenders could be found for logger (org.apache.zookeeper.ClientCnxn).
log4j:WARN Please initialize the log4j system properly.
log4j:WARN See http://logging.apache.org/log4j/1.2/faq.html#noconfig for more info.
[INFO] 
[INFO] --- maven-source-plugin:2.4:test-jar-no-fork (attach-sources) @ atlas-webapp ---
[INFO] Building jar: <https://builds.apache.org/job/Atlas-0.8-IntegrationTests/ws/webapp/target/atlas-webapp-0.8.2-SNAPSHOT-test-sources.jar>
[INFO] 
[INFO] --- maven-failsafe-plugin:2.19.1:verify (verify) @ atlas-webapp ---
[INFO] ------------------------------------------------------------------------
[INFO] Reactor Summary:
[INFO] 
[INFO] Apache Atlas Server Build Tools .................... SUCCESS [  1.907 s]
[INFO] apache-atlas ....................................... SUCCESS [  7.801 s]
[INFO] Apache Atlas Integration ........................... SUCCESS [ 29.441 s]
[INFO] Apache Atlas Common ................................ SUCCESS [ 14.280 s]
[INFO] Apache Atlas Typesystem ............................ SUCCESS [01:06 min]
[INFO] Apache Atlas Client ................................ SUCCESS [ 16.938 s]
[INFO] Apache Atlas Server API ............................ SUCCESS [  9.425 s]
[INFO] Apache Atlas Notification .......................... SUCCESS [ 15.885 s]
[INFO] Apache Atlas Graph Database Projects ............... SUCCESS [  0.609 s]
[INFO] Apache Atlas Graph Database API .................... SUCCESS [  7.598 s]
[INFO] Graph Database Common Code ......................... SUCCESS [  7.598 s]
[INFO] Apache Atlas Titan 1.0.0 GraphDB Impl .............. SUCCESS [ 33.912 s]
[INFO] Shaded version of Apache hbase client .............. SUCCESS [  8.819 s]
[INFO] Apache Atlas Titan 0.5.4 Graph DB Impl ............. SUCCESS [ 43.219 s]
[INFO] Apache Atlas Graph Database Implementation Dependencies SUCCESS [  0.864 s]
[INFO] Shaded version of Apache hbase server .............. SUCCESS [ 23.587 s]
[INFO] Apache Atlas Repository ............................ SUCCESS [01:46 min]
[INFO] Apache Atlas Authorization ......................... SUCCESS [ 11.073 s]
[INFO] Apache Atlas Business Catalog ...................... SUCCESS [ 15.380 s]
[INFO] Apache Atlas UI .................................... SUCCESS [01:42 min]
[INFO] Apache Atlas Web Application ....................... FAILURE [03:33 min]
[INFO] Apache Atlas Documentation ......................... SKIPPED
[INFO] Apache Atlas FileSystem Model ...................... SKIPPED
[INFO] Apache Atlas Plugin Classloader .................... SKIPPED
[INFO] Apache Atlas Hive Bridge Shim ...................... SKIPPED
[INFO] Apache Atlas Hive Bridge ........................... SKIPPED
[INFO] Apache Atlas Falcon Bridge Shim .................... SKIPPED
[INFO] Apache Atlas Falcon Bridge ......................... SKIPPED
[INFO] Apache Atlas Sqoop Bridge Shim ..................... SKIPPED
[INFO] Apache Atlas Sqoop Bridge .......................... SKIPPED
[INFO] Apache Atlas Storm Bridge Shim ..................... SKIPPED
[INFO] Apache Atlas Storm Bridge .......................... SKIPPED
[INFO] Apache Atlas Distribution .......................... SKIPPED
[INFO] ------------------------------------------------------------------------
[INFO] BUILD FAILURE
[INFO] ------------------------------------------------------------------------
[INFO] Total time: 12:18 min
[INFO] Finished at: 2017-09-22T13:51:40Z
[INFO] Final Memory: 354M/1391M
[INFO] ------------------------------------------------------------------------
[ERROR] Failed to execute goal org.apache.maven.plugins:maven-failsafe-plugin:2.19.1:verify
(verify) on project atlas-webapp: There are test failures.
[ERROR] 
[ERROR] Please refer to <https://builds.apache.org/job/Atlas-0.8-IntegrationTests/ws/webapp/target/failsafe-reports>
for the individual test results.
[ERROR] -> [Help 1]
[ERROR] 
[ERROR] To see the full stack trace of the errors, re-run Maven with the -e switch.
[ERROR] Re-run Maven using the -X switch to enable full debug logging.
[ERROR] 
[ERROR] For more information about the errors and possible solutions, please read the following
articles:
[ERROR] [Help 1] http://cwiki.apache.org/confluence/display/MAVEN/MojoFailureException
[ERROR] 
[ERROR] After correcting the problems, you can resume the build with the command
[ERROR]   mvn <goals> -rf :atlas-webapp
Build step 'Execute shell' marked build as failure
[CHECKSTYLE] Collecting checkstyle analysis files...
[CHECKSTYLE] Searching for all files in <https://builds.apache.org/job/Atlas-0.8-IntegrationTests/ws/>
that match the pattern **/target/checkstyle-result.xml
[CHECKSTYLE] Parsing 19 files in <https://builds.apache.org/job/Atlas-0.8-IntegrationTests/ws/>
[CHECKSTYLE] Successfully parsed file <https://builds.apache.org/job/Atlas-0.8-IntegrationTests/ws/authorization/target/checkstyle-result.xml>
with 467 unique warnings and 0 duplicates.
[CHECKSTYLE] Successfully parsed file <https://builds.apache.org/job/Atlas-0.8-IntegrationTests/ws/catalog/target/checkstyle-result.xml>
with 2604 unique warnings and 0 duplicates.
[CHECKSTYLE] Successfully parsed file <https://builds.apache.org/job/Atlas-0.8-IntegrationTests/ws/client/target/checkstyle-result.xml>
with 4242 unique warnings and 0 duplicates.
[CHECKSTYLE] Successfully parsed file <https://builds.apache.org/job/Atlas-0.8-IntegrationTests/ws/common/target/checkstyle-result.xml>
with 5450 unique warnings and 0 duplicates.
[CHECKSTYLE] Successfully parsed file <https://builds.apache.org/job/Atlas-0.8-IntegrationTests/ws/dashboardv2/target/checkstyle-result.xml>
with 5450 unique warnings and 0 duplicates.
[CHECKSTYLE] Successfully parsed file <https://builds.apache.org/job/Atlas-0.8-IntegrationTests/ws/graphdb/api/target/checkstyle-result.xml>
with 5719 unique warnings and 0 duplicates.
[CHECKSTYLE] Successfully parsed file <https://builds.apache.org/job/Atlas-0.8-IntegrationTests/ws/graphdb/common/target/checkstyle-result.xml>
with 5906 unique warnings and 0 duplicates.
[CHECKSTYLE] Successfully parsed file <https://builds.apache.org/job/Atlas-0.8-IntegrationTests/ws/graphdb/graphdb-impls/target/checkstyle-result.xml>
with 5906 unique warnings and 0 duplicates.
[CHECKSTYLE] Successfully parsed file <https://builds.apache.org/job/Atlas-0.8-IntegrationTests/ws/graphdb/target/checkstyle-result.xml>
with 5906 unique warnings and 0 duplicates.
[CHECKSTYLE] Successfully parsed file <https://builds.apache.org/job/Atlas-0.8-IntegrationTests/ws/graphdb/titan0/target/checkstyle-result.xml>
with 8291 unique warnings and 0 duplicates.
[CHECKSTYLE] Successfully parsed file <https://builds.apache.org/job/Atlas-0.8-IntegrationTests/ws/graphdb/titan1/target/checkstyle-result.xml>
with 9239 unique warnings and 0 duplicates.
[CHECKSTYLE] Successfully parsed file <https://builds.apache.org/job/Atlas-0.8-IntegrationTests/ws/intg/target/checkstyle-result.xml>
with 15696 unique warnings and 0 duplicates.
[CHECKSTYLE] Successfully parsed file <https://builds.apache.org/job/Atlas-0.8-IntegrationTests/ws/notification/target/checkstyle-result.xml>
with 16906 unique warnings and 0 duplicates.
[CHECKSTYLE] Successfully parsed file <https://builds.apache.org/job/Atlas-0.8-IntegrationTests/ws/repository/target/checkstyle-result.xml>
with 35761 unique warnings and 0 duplicates.
[CHECKSTYLE] Successfully parsed file <https://builds.apache.org/job/Atlas-0.8-IntegrationTests/ws/server-api/target/checkstyle-result.xml>
with 36140 unique warnings and 0 duplicates.
[CHECKSTYLE] Successfully parsed file <https://builds.apache.org/job/Atlas-0.8-IntegrationTests/ws/shaded/hbase-client-shaded/target/checkstyle-result.xml>
with 36140 unique warnings and 0 duplicates.
[CHECKSTYLE] Successfully parsed file <https://builds.apache.org/job/Atlas-0.8-IntegrationTests/ws/shaded/hbase-server-shaded/target/checkstyle-result.xml>
with 36140 unique warnings and 0 duplicates.
[CHECKSTYLE] Successfully parsed file <https://builds.apache.org/job/Atlas-0.8-IntegrationTests/ws/target/checkstyle-result.xml>
with 36140 unique warnings and 0 duplicates.
[CHECKSTYLE] Successfully parsed file <https://builds.apache.org/job/Atlas-0.8-IntegrationTests/ws/typesystem/target/checkstyle-result.xml>
with 40358 unique warnings and 0 duplicates.
<Git Blamer> Using GitBlamer to create author and commit information for all warnings.
<Git Blamer> GIT_COMMIT=a84c610df0e5ee152532fe1ef7585340a3a275cb, workspace=<https://builds.apache.org/job/Atlas-0.8-IntegrationTests/ws/>
 > git rev-parse a84c610df0e5ee152532fe1ef7585340a3a275cb^{commit} # timeout=10
[FINDBUGS] Collecting findbugs analysis files...
[FINDBUGS] Searching for all files in <https://builds.apache.org/job/Atlas-0.8-IntegrationTests/ws/>
that match the pattern **/target/findbugs.xml
[FINDBUGS] Parsing 12 files in <https://builds.apache.org/job/Atlas-0.8-IntegrationTests/ws/>
[FINDBUGS] Successfully parsed file <https://builds.apache.org/job/Atlas-0.8-IntegrationTests/ws/authorization/target/findbugs.xml>
with 0 unique warnings and 0 duplicates.
[FINDBUGS] Successfully parsed file <https://builds.apache.org/job/Atlas-0.8-IntegrationTests/ws/catalog/target/findbugs.xml>
with 0 unique warnings and 0 duplicates.
[FINDBUGS] Successfully parsed file <https://builds.apache.org/job/Atlas-0.8-IntegrationTests/ws/client/target/findbugs.xml>
with 0 unique warnings and 0 duplicates.
[FINDBUGS] Successfully parsed file <https://builds.apache.org/job/Atlas-0.8-IntegrationTests/ws/common/target/findbugs.xml>
with 0 unique warnings and 0 duplicates.
[FINDBUGS] Successfully parsed file <https://builds.apache.org/job/Atlas-0.8-IntegrationTests/ws/graphdb/api/target/findbugs.xml>
with 0 unique warnings and 0 duplicates.
[FINDBUGS] Successfully parsed file <https://builds.apache.org/job/Atlas-0.8-IntegrationTests/ws/graphdb/common/target/findbugs.xml>
with 0 unique warnings and 0 duplicates.
[FINDBUGS] Successfully parsed file <https://builds.apache.org/job/Atlas-0.8-IntegrationTests/ws/graphdb/titan0/target/findbugs.xml>
with 0 unique warnings and 0 duplicates.
[FINDBUGS] Successfully parsed file <https://builds.apache.org/job/Atlas-0.8-IntegrationTests/ws/intg/target/findbugs.xml>
with 0 unique warnings and 0 duplicates.
[FINDBUGS] Successfully parsed file <https://builds.apache.org/job/Atlas-0.8-IntegrationTests/ws/notification/target/findbugs.xml>
with 0 unique warnings and 0 duplicates.
[FINDBUGS] Successfully parsed file <https://builds.apache.org/job/Atlas-0.8-IntegrationTests/ws/repository/target/findbugs.xml>
with 0 unique warnings and 0 duplicates.
[FINDBUGS] Successfully parsed file <https://builds.apache.org/job/Atlas-0.8-IntegrationTests/ws/server-api/target/findbugs.xml>
with 0 unique warnings and 0 duplicates.
[FINDBUGS] Successfully parsed file <https://builds.apache.org/job/Atlas-0.8-IntegrationTests/ws/typesystem/target/findbugs.xml>
with 0 unique warnings and 0 duplicates.
<Git Blamer> Using GitBlamer to create author and commit information for all warnings.
<Git Blamer> GIT_COMMIT=a84c610df0e5ee152532fe1ef7585340a3a275cb, workspace=<https://builds.apache.org/job/Atlas-0.8-IntegrationTests/ws/>
Archiving artifacts
[Fast Archiver] No prior successful build to compare, so performing full copy of artifacts
TestNG Reports Processing: START
Looking for TestNG results report in workspace using pattern: **/target/surefire-reports/testng-results.xml,**/target/failsafe-reports/testng-results.xml
Saving reports...
Processing '/x1/jenkins/jenkins-home/jobs/Atlas-0.8-IntegrationTests/builds/76/testng/testng-results.xml'
TestNG Reports Processing: FINISH

Mime
View raw message