atlas-dev mailing list archives

Site index · List index
Message view « Date » · « Thread »
Top « Date » · « Thread »
From Apache Jenkins Server <jenk...@builds.apache.org>
Subject Build failed in Jenkins: Atlas-master-UnitTests #96
Date Sat, 23 Sep 2017 00:43:29 GMT
See <https://builds.apache.org/job/Atlas-master-UnitTests/96/display/redirect?page=changes>

Changes:

[madhan] ATLAS-2160: added REST APIs to execute a saved-search

------------------------------------------
[...truncated 261.63 KB...]
Running org.apache.atlas.query.BaseGremlinTest
Running org.apache.atlas.lineage.EntityLineageServiceTest
Running org.apache.atlas.discovery.EntityDiscoveryServiceTest
Running org.apache.atlas.query.ExpressionTest
Running org.apache.atlas.service.DefaultMetadataServiceTest
Running org.apache.atlas.query.LineageQueryTest
Running org.apache.atlas.query.LexerTest
Running org.apache.atlas.repository.store.graph.v1.AtlasEntityStoreV1BulkImportPercentTest
Running org.apache.atlas.utils.ObjectUpdateSynchronizerTest
Running org.apache.atlas.TestModules
Running org.apache.atlas.repository.store.graph.v1.InverseReferenceUpdateSoftDeleteV1Test
Running org.apache.atlas.repository.store.graph.v1.SoftDeleteHandlerV1Test
Running org.apache.atlas.repository.store.graph.v1.AtlasRelationshipDefStoreV1Test
Running org.apache.atlas.repository.store.graph.v1.AtlasDeleteHandlerV1Test
Running org.apache.atlas.repository.store.graph.v1.InverseReferenceUpdateHardDeleteV1Test
Running org.apache.atlas.repository.store.graph.v1.AtlasEntityStoreV1Test
Running org.apache.atlas.repository.store.graph.v1.AtlasRelationshipStoreSoftDeleteV1Test
Running org.apache.atlas.repository.store.graph.v1.AtlasRelationshipStoreHardDeleteV1Test
Running org.apache.atlas.repository.store.graph.v1.AtlasEntityDefStoreV1Test
Tests run: 0, Failures: 0, Errors: 0, Skipped: 0, Time elapsed: 23.455 sec - in org.apache.atlas.TestModules
Running org.apache.atlas.repository.store.graph.AtlasTypeDefGraphStoreTest
Tests run: 0, Failures: 0, Errors: 0, Skipped: 0, Time elapsed: 25.193 sec - in org.apache.atlas.repository.store.graph.v1.AtlasRelationshipStoreV1Test
Tests run: 0, Failures: 0, Errors: 0, Skipped: 0, Time elapsed: 25.966 sec - in org.apache.atlas.repository.store.graph.v1.InverseReferenceUpdateV1Test
Running org.apache.atlas.repository.typestore.GraphBackedTypeStoreTest
Tests run: 0, Failures: 0, Errors: 0, Skipped: 0, Time elapsed: 27.393 sec - in org.apache.atlas.BaseRepositoryTest
Tests run: 9, Failures: 0, Errors: 0, Skipped: 0, Time elapsed: 27.241 sec - in org.apache.atlas.repository.store.graph.v1.AtlasEntityStoreV1BulkImportPercentTest
Tests run: 9, Failures: 0, Errors: 0, Skipped: 0, Time elapsed: 27.273 sec - in org.apache.atlas.utils.ObjectUpdateSynchronizerTest
Running org.apache.atlas.repository.typestore.StoreBackedTypeCacheTest
Running org.apache.atlas.repository.graph.TestIntSequence
Running org.apache.atlas.repository.graph.Gremlin2QueryOptimizerTest
Running org.apache.atlas.repository.graph.AbstractGremlinQueryOptimizerTest
Tests run: 0, Failures: 0, Errors: 0, Skipped: 0, Time elapsed: 28.248 sec - in org.apache.atlas.repository.store.graph.v1.AtlasDeleteHandlerV1Test
Tests run: 0, Failures: 0, Errors: 0, Skipped: 0, Time elapsed: 29.671 sec - in org.apache.atlas.query.BaseGremlinTest
Tests run: 19, Failures: 0, Errors: 0, Skipped: 0, Time elapsed: 29.884 sec - in org.apache.atlas.query.ExpressionTest
Tests run: 1, Failures: 0, Errors: 0, Skipped: 0, Time elapsed: 29.993 sec - in org.apache.atlas.query.LexerTest
Running org.apache.atlas.repository.graph.GraphBackedSearchIndexerTest
Running org.apache.atlas.repository.graph.ReverseReferenceUpdateHardDeleteTest
Running org.apache.atlas.repository.graph.GraphRepoMapperScaleTest
Running org.apache.atlas.repository.graph.GraphHelperTest
Tests run: 5, Failures: 0, Errors: 0, Skipped: 0, Time elapsed: 31.156 sec - in org.apache.atlas.query.QueryProcessorTest
Tests run: 5, Failures: 0, Errors: 0, Skipped: 0, Time elapsed: 31.73 sec - in org.apache.atlas.util.CompiledQueryCacheKeyTest
Running org.apache.atlas.repository.graph.Gremlin3QueryOptimizerTest
Tests run: 14, Failures: 0, Errors: 0, Skipped: 0, Time elapsed: 31.959 sec - in org.apache.atlas.query.ParserTest
Running org.apache.atlas.repository.graph.ReverseReferenceUpdateSoftDeleteTest
Running org.apache.atlas.repository.graph.GraphBackedRepositoryHardDeleteTest
Tests run: 0, Failures: 0, Errors: 0, Skipped: 0, Time elapsed: 35.051 sec - in org.apache.atlas.discovery.DataSetLineageServiceTest
Tests run: 6, Failures: 0, Errors: 0, Skipped: 0, Time elapsed: 35.353 sec - in org.apache.atlas.discovery.EntityDiscoveryServiceTest
Tests run: 1, Failures: 0, Errors: 0, Skipped: 0, Time elapsed: 35.966 sec - in org.apache.atlas.services.MetricsServiceTest
Tests run: 1, Failures: 0, Errors: 0, Skipped: 0, Time elapsed: 36.369 sec - in org.apache.atlas.RepositoryServiceLoadingTest
Running org.apache.atlas.repository.graph.GraphBackedRepositorySoftDeleteTest
Running org.apache.atlas.repository.graph.GraphBackedSearchIndexerMockTest
Running org.apache.atlas.repository.graph.GraphHelperMockTest
Running org.apache.atlas.repository.graph.GraphBackedMetadataRepositoryTest
Tests run: 10, Failures: 0, Errors: 0, Skipped: 0, Time elapsed: 45.675 sec - in org.apache.atlas.repository.store.graph.v1.AtlasRelationshipDefStoreV1Test
Running org.apache.atlas.repository.userprofile.UserProfileServiceTest
Tests run: 1, Failures: 0, Errors: 0, Skipped: 0, Time elapsed: 47.523 sec - in org.apache.atlas.repository.store.graph.v1.AtlasEntityDefStoreV1Test
Running org.apache.atlas.repository.impexp.ImportTransformerJSONTest
Tests run: 0, Failures: 0, Errors: 0, Skipped: 0, Time elapsed: 28.453 sec - in org.apache.atlas.repository.graph.TestIntSequence
Tests run: 0, Failures: 0, Errors: 0, Skipped: 0, Time elapsed: 28.692 sec - in org.apache.atlas.repository.graph.AbstractGremlinQueryOptimizerTest
Running org.apache.atlas.repository.impexp.ImportTransformsTest
Running org.apache.atlas.repository.impexp.ExportServiceTest
Tests run: 33, Failures: 0, Errors: 0, Skipped: 0, Time elapsed: 31.48 sec - in org.apache.atlas.repository.graph.Gremlin2QueryOptimizerTest
Running org.apache.atlas.repository.impexp.UniqueListTest
Tests run: 33, Failures: 0, Errors: 0, Skipped: 0, Time elapsed: 32.009 sec - in org.apache.atlas.repository.graph.Gremlin3QueryOptimizerTest
Tests run: 3, Failures: 0, Errors: 0, Skipped: 0, Time elapsed: 63.882 sec - in org.apache.atlas.service.StoreBackedTypeCacheMetadataServiceTest
Running org.apache.atlas.repository.impexp.AtlasImportRequestTest
Running org.apache.atlas.repository.impexp.ZipSinkTest
Tests run: 5, Failures: 0, Errors: 0, Skipped: 0, Time elapsed: 70.788 sec - in org.apache.atlas.repository.store.graph.v1.InverseReferenceUpdateSoftDeleteV1Test
Tests run: 5, Failures: 0, Errors: 0, Skipped: 0, Time elapsed: 46.462 sec - in org.apache.atlas.repository.typestore.GraphBackedTypeStoreTest
Running org.apache.atlas.repository.impexp.ZipSourceTest
Running org.apache.atlas.repository.impexp.TypeAttributeDifferenceTest
Tests run: 3, Failures: 0, Errors: 0, Skipped: 0, Time elapsed: 38.667 sec - in org.apache.atlas.repository.graph.GraphBackedSearchIndexerMockTest
Running org.apache.atlas.repository.impexp.ImportTransformerTest
Tests run: 5, Failures: 0, Errors: 0, Skipped: 0, Time elapsed: 75.653 sec - in org.apache.atlas.repository.store.graph.v1.InverseReferenceUpdateHardDeleteV1Test
Tests run: 5, Failures: 0, Errors: 0, Skipped: 0, Time elapsed: 47.509 sec - in org.apache.atlas.repository.graph.GraphBackedSearchIndexerTest
Tests run: 5, Failures: 0, Errors: 0, Skipped: 0, Time elapsed: 76.511 sec - in org.apache.atlas.repository.store.graph.v1.AtlasRelationshipStoreHardDeleteV1Test
Tests run: 2, Failures: 0, Errors: 0, Skipped: 0, Time elapsed: 40.856 sec - in org.apache.atlas.repository.graph.GraphHelperMockTest
Running org.apache.atlas.repository.impexp.ImportServiceTest
Tests run: 5, Failures: 0, Errors: 0, Skipped: 0, Time elapsed: 77.849 sec - in org.apache.atlas.repository.store.graph.v1.AtlasRelationshipStoreSoftDeleteV1Test
Running org.apache.atlas.repository.audit.HBaseBasedAuditRepositoryTest
Running org.apache.atlas.repository.audit.InMemoryAuditRepositoryTest
Running org.apache.atlas.repository.audit.HBaseBasedAuditRepositoryHATest
Running org.apache.atlas.repository.BaseTest
Tests run: 2, Failures: 0, Errors: 0, Skipped: 0, Time elapsed: 55.896 sec - in org.apache.atlas.repository.typestore.StoreBackedTypeCacheTest
Tests run: 1, Failures: 0, Errors: 0, Skipped: 0, Time elapsed: 34.89 sec - in org.apache.atlas.repository.impexp.ImportTransformerJSONTest
Running org.apache.atlas.TestUtils
Tests run: 5, Failures: 0, Errors: 0, Skipped: 0, Time elapsed: 88.225 sec - in org.apache.atlas.query.LineageQueryTest
Tests run: 3, Failures: 0, Errors: 0, Skipped: 0, Time elapsed: 30.02 sec - in org.apache.atlas.repository.impexp.ImportTransformsTest
Tests run: 5, Failures: 0, Errors: 0, Skipped: 0, Time elapsed: 58.098 sec - in org.apache.atlas.repository.graph.ReverseReferenceUpdateHardDeleteTest
Tests run: 5, Failures: 0, Errors: 0, Skipped: 0, Time elapsed: 56.801 sec - in org.apache.atlas.repository.graph.ReverseReferenceUpdateSoftDeleteTest
Tests run: 4, Failures: 0, Errors: 0, Skipped: 0, Time elapsed: 28.935 sec - in org.apache.atlas.repository.impexp.UniqueListTest
Tests run: 14, Failures: 0, Errors: 0, Skipped: 0, Time elapsed: 96.252 sec - in org.apache.atlas.repository.store.graph.v1.AtlasEntityStoreV1Test
Tests run: 14, Failures: 0, Errors: 0, Skipped: 0, Time elapsed: 67.589 sec - in org.apache.atlas.repository.graph.GraphHelperTest
Tests run: 8, Failures: 0, Errors: 0, Skipped: 0, Time elapsed: 33.941 sec - in org.apache.atlas.repository.impexp.ZipSinkTest
Tests run: 6, Failures: 0, Errors: 0, Skipped: 0, Time elapsed: 35.789 sec - in org.apache.atlas.repository.impexp.AtlasImportRequestTest
Tests run: 6, Failures: 0, Errors: 0, Skipped: 0, Time elapsed: 31.181 sec - in org.apache.atlas.repository.impexp.ZipSourceTest
Tests run: 8, Failures: 0, Errors: 0, Skipped: 0, Time elapsed: 27.811 sec - in org.apache.atlas.repository.impexp.ImportTransformerTest
Tests run: 6, Failures: 0, Errors: 0, Skipped: 0, Time elapsed: 31.311 sec - in org.apache.atlas.repository.impexp.TypeAttributeDifferenceTest
Tests run: 11, Failures: 0, Errors: 0, Skipped: 0, Time elapsed: 106.922 sec - in org.apache.atlas.repository.store.graph.v1.HardDeleteHandlerV1Test
Tests run: 0, Failures: 0, Errors: 0, Skipped: 0, Time elapsed: 27.822 sec - in org.apache.atlas.repository.BaseTest
Tests run: 23, Failures: 0, Errors: 0, Skipped: 0, Time elapsed: 109.436 sec - in org.apache.atlas.lineage.EntityLineageServiceTest
Tests run: 3, Failures: 0, Errors: 0, Skipped: 0, Time elapsed: 30.262 sec - in org.apache.atlas.repository.audit.InMemoryAuditRepositoryTest
Tests run: 21, Failures: 0, Errors: 0, Skipped: 0, Time elapsed: 111.032 sec - in org.apache.atlas.query.GremlinTest
Tests run: 0, Failures: 0, Errors: 0, Skipped: 0, Time elapsed: 25.37 sec - in org.apache.atlas.TestUtils
Tests run: 2, Failures: 0, Errors: 0, Skipped: 0, Time elapsed: 30.995 sec - in org.apache.atlas.repository.audit.HBaseBasedAuditRepositoryHATest
Tests run: 11, Failures: 0, Errors: 0, Skipped: 0, Time elapsed: 109.99 sec - in org.apache.atlas.repository.store.graph.v1.SoftDeleteHandlerV1Test
Tests run: 17, Failures: 0, Errors: 0, Skipped: 0, Time elapsed: 90.706 sec - in org.apache.atlas.repository.store.graph.AtlasTypeDefGraphStoreTest
Tests run: 11, Failures: 0, Errors: 0, Skipped: 0, Time elapsed: 68.754 sec - in org.apache.atlas.repository.userprofile.UserProfileServiceTest
Tests run: 30, Failures: 0, Errors: 0, Skipped: 0, Time elapsed: 79.463 sec - in org.apache.atlas.repository.graph.GraphBackedMetadataRepositoryTest
Tests run: 21, Failures: 0, Errors: 0, Skipped: 0, Time elapsed: 84.539 sec - in org.apache.atlas.repository.graph.GraphBackedRepositoryHardDeleteTest
Tests run: 27, Failures: 0, Errors: 0, Skipped: 0, Time elapsed: 118.302 sec - in org.apache.atlas.service.DefaultMetadataServiceTest
Tests run: 21, Failures: 0, Errors: 0, Skipped: 0, Time elapsed: 82.556 sec - in org.apache.atlas.repository.graph.GraphBackedRepositorySoftDeleteTest
Tests run: 10, Failures: 0, Errors: 0, Skipped: 0, Time elapsed: 65.49 sec - in org.apache.atlas.repository.impexp.ExportServiceTest
Tests run: 4, Failures: 0, Errors: 0, Skipped: 0, Time elapsed: 51.703 sec - in org.apache.atlas.repository.audit.HBaseBasedAuditRepositoryTest
Tests run: 9, Failures: 1, Errors: 0, Skipped: 0, Time elapsed: 61.374 sec <<< FAILURE!
- in org.apache.atlas.repository.impexp.ImportServiceTest
importCTAS(org.apache.atlas.repository.impexp.ImportServiceTest)  Time elapsed: 5.108 sec
 <<< FAILURE!
org.apache.atlas.exception.AtlasBaseException: Given instance is invalid/not found: Could
not find entities in the repository with guids: [73cb606c-6846-4718-a859-40c9c17e0b32]
	at org.apache.atlas.repository.converters.AtlasInstanceConverter.toAtlasBaseException(AtlasInstanceConverter.java:213)
	at org.apache.atlas.repository.converters.AtlasInstanceConverter.getITypedReferenceable(AtlasInstanceConverter.java:115)
	at org.apache.atlas.repository.store.graph.v1.AtlasEntityChangeNotifier.toITypedReferenceable(AtlasEntityChangeNotifier.java:184)
	at org.apache.atlas.repository.store.graph.v1.AtlasEntityChangeNotifier.notifyListeners(AtlasEntityChangeNotifier.java:158)
	at org.apache.atlas.repository.store.graph.v1.AtlasEntityChangeNotifier.onEntitiesMutated(AtlasEntityChangeNotifier.java:84)
	at org.apache.atlas.repository.store.graph.v1.AtlasEntityStoreV1.createOrUpdate(AtlasEntityStoreV1.java:165)
	at org.apache.atlas.repository.store.graph.v1.AtlasEntityStoreV1.createOrUpdateForImport(AtlasEntityStoreV1.java:179)
	at org.apache.atlas.GraphTransactionInterceptor.invoke(GraphTransactionInterceptor.java:60)
	at org.apache.atlas.repository.store.graph.v1.BulkImporterImpl.bulkImport(BulkImporterImpl.java:82)
	at org.apache.atlas.repository.impexp.ImportService.processEntities(ImportService.java:161)
	at org.apache.atlas.repository.impexp.ImportService.run(ImportService.java:82)
	at org.apache.atlas.repository.impexp.ImportService.run(ImportService.java:61)
	at org.apache.atlas.repository.impexp.ZipFileResourceTestUtils.runImportWithNoParameters(ZipFileResourceTestUtils.java:209)
	at org.apache.atlas.repository.impexp.ImportServiceTest.importCTAS(ImportServiceTest.java:168)

Tests run: 338, Failures: 0, Errors: 0, Skipped: 0, Time elapsed: 260.409 sec - in org.apache.atlas.discovery.GraphBackedDiscoveryServiceTest
Tests run: 2, Failures: 0, Errors: 0, Skipped: 0, Time elapsed: 258.064 sec - in org.apache.atlas.repository.graph.GraphRepoMapperScaleTest

Results :

Failed tests: 
  ImportServiceTest.importCTAS:168 » AtlasBase Given instance is invalid/not fou...

Tests run: 833, Failures: 1, Errors: 0, Skipped: 0

[INFO] ------------------------------------------------------------------------
[INFO] Reactor Summary:
[INFO] 
[INFO] Apache Atlas Server Build Tools .................... SUCCESS [  0.915 s]
[INFO] apache-atlas ....................................... SUCCESS [  4.472 s]
[INFO] Apache Atlas Integration ........................... SUCCESS [ 34.607 s]
[INFO] Apache Atlas Common ................................ SUCCESS [ 15.201 s]
[INFO] Apache Atlas Typesystem ............................ SUCCESS [01:08 min]
[INFO] Apache Atlas Client ................................ SUCCESS [ 18.720 s]
[INFO] Apache Atlas Server API ............................ SUCCESS [  9.509 s]
[INFO] Apache Atlas Notification .......................... SUCCESS [ 24.196 s]
[INFO] Apache Atlas Graph Database Projects ............... SUCCESS [  0.563 s]
[INFO] Apache Atlas Graph Database API .................... SUCCESS [  7.401 s]
[INFO] Graph Database Common Code ......................... SUCCESS [  7.646 s]
[INFO] Apache Atlas Titan 1.0.0 GraphDB Impl .............. SUCCESS [ 32.962 s]
[INFO] Shaded version of Apache hbase client .............. SUCCESS [  8.533 s]
[INFO] Apache Atlas Titan 0.5.4 Graph DB Impl ............. SUCCESS [01:25 min]
[INFO] Apache Atlas Graph Database Implementation Dependencies SUCCESS [  0.653 s]
[INFO] Shaded version of Apache hbase server .............. SUCCESS [ 23.340 s]
[INFO] Apache Atlas Repository ............................ FAILURE [05:50 min]
[INFO] Apache Atlas Authorization ......................... SKIPPED
[INFO] Apache Atlas Business Catalog ...................... SKIPPED
[INFO] Apache Atlas UI .................................... SKIPPED
[INFO] Apache Atlas Web Application ....................... SKIPPED
[INFO] Apache Atlas Documentation ......................... SKIPPED
[INFO] Apache Atlas FileSystem Model ...................... SKIPPED
[INFO] Apache Atlas Plugin Classloader .................... SKIPPED
[INFO] Apache Atlas Hive Bridge Shim ...................... SKIPPED
[INFO] Apache Atlas Hive Bridge ........................... SKIPPED
[INFO] Apache Atlas Falcon Bridge Shim .................... SKIPPED
[INFO] Apache Atlas Falcon Bridge ......................... SKIPPED
[INFO] Apache Atlas Sqoop Bridge Shim ..................... SKIPPED
[INFO] Apache Atlas Sqoop Bridge .......................... SKIPPED
[INFO] Apache Atlas Storm Bridge Shim ..................... SKIPPED
[INFO] Apache Atlas Storm Bridge .......................... SKIPPED
[INFO] Apache Atlas Distribution .......................... SKIPPED
[INFO] ------------------------------------------------------------------------
[INFO] BUILD FAILURE
[INFO] ------------------------------------------------------------------------
[INFO] Total time: 11:35 min
[INFO] Finished at: 2017-09-23T00:37:53Z
[INFO] Final Memory: 158M/1658M
[INFO] ------------------------------------------------------------------------
[ERROR] Failed to execute goal org.apache.maven.plugins:maven-surefire-plugin:2.18.1:test
(default-test) on project atlas-repository: There are test failures.
[ERROR] 
[ERROR] Please refer to <https://builds.apache.org/job/Atlas-master-UnitTests/ws/repository/target/surefire-reports>
for the individual test results.
[ERROR] -> [Help 1]
[ERROR] 
[ERROR] To see the full stack trace of the errors, re-run Maven with the -e switch.
[ERROR] Re-run Maven using the -X switch to enable full debug logging.
[ERROR] 
[ERROR] For more information about the errors and possible solutions, please read the following
articles:
[ERROR] [Help 1] http://cwiki.apache.org/confluence/display/MAVEN/MojoFailureException
[ERROR] 
[ERROR] After correcting the problems, you can resume the build with the command
[ERROR]   mvn <goals> -rf :atlas-repository
Build step 'Execute shell' marked build as failure
[CHECKSTYLE] Collecting checkstyle analysis files...
[CHECKSTYLE] Searching for all files in <https://builds.apache.org/job/Atlas-master-UnitTests/ws/>
that match the pattern **/target/checkstyle-result.xml
[CHECKSTYLE] Parsing 15 files in <https://builds.apache.org/job/Atlas-master-UnitTests/ws/>
[CHECKSTYLE] Successfully parsed file <https://builds.apache.org/job/Atlas-master-UnitTests/ws/client/target/checkstyle-result.xml>
with 1637 unique warnings and 0 duplicates.
[CHECKSTYLE] Successfully parsed file <https://builds.apache.org/job/Atlas-master-UnitTests/ws/common/target/checkstyle-result.xml>
with 2851 unique warnings and 0 duplicates.
[CHECKSTYLE] Successfully parsed file <https://builds.apache.org/job/Atlas-master-UnitTests/ws/graphdb/api/target/checkstyle-result.xml>
with 3124 unique warnings and 0 duplicates.
[CHECKSTYLE] Successfully parsed file <https://builds.apache.org/job/Atlas-master-UnitTests/ws/graphdb/common/target/checkstyle-result.xml>
with 3311 unique warnings and 0 duplicates.
[CHECKSTYLE] Successfully parsed file <https://builds.apache.org/job/Atlas-master-UnitTests/ws/graphdb/graphdb-impls/target/checkstyle-result.xml>
with 3311 unique warnings and 0 duplicates.
[CHECKSTYLE] Successfully parsed file <https://builds.apache.org/job/Atlas-master-UnitTests/ws/graphdb/target/checkstyle-result.xml>
with 3311 unique warnings and 0 duplicates.
[CHECKSTYLE] Successfully parsed file <https://builds.apache.org/job/Atlas-master-UnitTests/ws/graphdb/titan0/target/checkstyle-result.xml>
with 5713 unique warnings and 0 duplicates.
[CHECKSTYLE] Successfully parsed file <https://builds.apache.org/job/Atlas-master-UnitTests/ws/graphdb/titan1/target/checkstyle-result.xml>
with 6680 unique warnings and 0 duplicates.
[CHECKSTYLE] Successfully parsed file <https://builds.apache.org/job/Atlas-master-UnitTests/ws/intg/target/checkstyle-result.xml>
with 14621 unique warnings and 0 duplicates.
[CHECKSTYLE] Successfully parsed file <https://builds.apache.org/job/Atlas-master-UnitTests/ws/notification/target/checkstyle-result.xml>
with 15831 unique warnings and 0 duplicates.
[CHECKSTYLE] Successfully parsed file <https://builds.apache.org/job/Atlas-master-UnitTests/ws/server-api/target/checkstyle-result.xml>
with 16210 unique warnings and 0 duplicates.
[CHECKSTYLE] Successfully parsed file <https://builds.apache.org/job/Atlas-master-UnitTests/ws/shaded/hbase-client-shaded/target/checkstyle-result.xml>
with 16210 unique warnings and 0 duplicates.
[CHECKSTYLE] Successfully parsed file <https://builds.apache.org/job/Atlas-master-UnitTests/ws/shaded/hbase-server-shaded/target/checkstyle-result.xml>
with 16210 unique warnings and 0 duplicates.
[CHECKSTYLE] Successfully parsed file <https://builds.apache.org/job/Atlas-master-UnitTests/ws/target/checkstyle-result.xml>
with 16210 unique warnings and 0 duplicates.
[CHECKSTYLE] Successfully parsed file <https://builds.apache.org/job/Atlas-master-UnitTests/ws/typesystem/target/checkstyle-result.xml>
with 20428 unique warnings and 0 duplicates.
<Git Blamer> Using GitBlamer to create author and commit information for all warnings.
<Git Blamer> GIT_COMMIT=7cce1c4af84001c79b7e0d9ad2e566b8cbaf7ccb, workspace=<https://builds.apache.org/job/Atlas-master-UnitTests/ws/>
 > git rev-parse 7cce1c4af84001c79b7e0d9ad2e566b8cbaf7ccb^{commit} # timeout=10
<Git Blamer> Skipping file <https://builds.apache.org/job/Atlas-master-UnitTests/ws/graphdb/titan1/src/main/java/org/apache/atlas/repository/graphdb/titan1/graphson/AtlasGraphSONMode.java,>
no result found.
[CHECKSTYLE] Computing warning deltas based on reference build #59
[FINDBUGS] Collecting findbugs analysis files...
[FINDBUGS] Searching for all files in <https://builds.apache.org/job/Atlas-master-UnitTests/ws/>
that match the pattern **/target/findbugs.xml
[FINDBUGS] Parsing 9 files in <https://builds.apache.org/job/Atlas-master-UnitTests/ws/>
[FINDBUGS] Successfully parsed file <https://builds.apache.org/job/Atlas-master-UnitTests/ws/client/target/findbugs.xml>
with 0 unique warnings and 0 duplicates.
[FINDBUGS] Successfully parsed file <https://builds.apache.org/job/Atlas-master-UnitTests/ws/common/target/findbugs.xml>
with 0 unique warnings and 0 duplicates.
[FINDBUGS] Successfully parsed file <https://builds.apache.org/job/Atlas-master-UnitTests/ws/graphdb/api/target/findbugs.xml>
with 0 unique warnings and 0 duplicates.
[FINDBUGS] Successfully parsed file <https://builds.apache.org/job/Atlas-master-UnitTests/ws/graphdb/common/target/findbugs.xml>
with 0 unique warnings and 0 duplicates.
[FINDBUGS] Successfully parsed file <https://builds.apache.org/job/Atlas-master-UnitTests/ws/graphdb/titan0/target/findbugs.xml>
with 0 unique warnings and 0 duplicates.
[FINDBUGS] Successfully parsed file <https://builds.apache.org/job/Atlas-master-UnitTests/ws/intg/target/findbugs.xml>
with 0 unique warnings and 0 duplicates.
[FINDBUGS] Successfully parsed file <https://builds.apache.org/job/Atlas-master-UnitTests/ws/notification/target/findbugs.xml>
with 0 unique warnings and 0 duplicates.
[FINDBUGS] Successfully parsed file <https://builds.apache.org/job/Atlas-master-UnitTests/ws/server-api/target/findbugs.xml>
with 0 unique warnings and 0 duplicates.
[FINDBUGS] Successfully parsed file <https://builds.apache.org/job/Atlas-master-UnitTests/ws/typesystem/target/findbugs.xml>
with 0 unique warnings and 0 duplicates.
<Git Blamer> Using GitBlamer to create author and commit information for all warnings.
<Git Blamer> GIT_COMMIT=7cce1c4af84001c79b7e0d9ad2e566b8cbaf7ccb, workspace=<https://builds.apache.org/job/Atlas-master-UnitTests/ws/>
[FINDBUGS] Computing warning deltas based on reference build #59
Archiving artifacts
TestNG Reports Processing: START
Looking for TestNG results report in workspace using pattern: **/target/surefire-reports/testng-results.xml,**/target/failsafe-reports/testng-results.xml
Saving reports...
Processing '/x1/jenkins/jenkins-home/jobs/Atlas-master-UnitTests/builds/96/testng/testng-results-1.xml'
Processing '/x1/jenkins/jenkins-home/jobs/Atlas-master-UnitTests/builds/96/testng/testng-results-2.xml'
Processing '/x1/jenkins/jenkins-home/jobs/Atlas-master-UnitTests/builds/96/testng/testng-results-3.xml'
Processing '/x1/jenkins/jenkins-home/jobs/Atlas-master-UnitTests/builds/96/testng/testng-results-4.xml'
Processing '/x1/jenkins/jenkins-home/jobs/Atlas-master-UnitTests/builds/96/testng/testng-results-5.xml'
Processing '/x1/jenkins/jenkins-home/jobs/Atlas-master-UnitTests/builds/96/testng/testng-results-6.xml'
Processing '/x1/jenkins/jenkins-home/jobs/Atlas-master-UnitTests/builds/96/testng/testng-results.xml'
TestNG Reports Processing: FINISH

Mime
View raw message