atlas-dev mailing list archives

Site index · List index
Message view « Date » · « Thread »
Top « Date » · « Thread »
From Apache Jenkins Server <jenk...@builds.apache.org>
Subject Build failed in Jenkins: Atlas-master-UnitTests #107
Date Sat, 30 Sep 2017 01:19:02 GMT
See <https://builds.apache.org/job/Atlas-master-UnitTests/107/display/redirect?page=changes>

Changes:

[ssubramanian] ATLAS-2184: IS_NULL and NOT_NULL operator support

------------------------------------------
[...truncated 288.97 KB...]
Running org.apache.atlas.repository.audit.HBaseBasedAuditRepositoryTest
Running org.apache.atlas.repository.store.graph.v1.InverseReferenceUpdateV1Test
Running org.apache.atlas.repository.store.graph.v1.HardDeleteHandlerV1Test
Running org.apache.atlas.discovery.GraphBackedDiscoveryServiceTest
Running org.apache.atlas.repository.store.graph.v1.AtlasRelationshipDefStoreV1Test
Running org.apache.atlas.repository.store.graph.v1.AtlasEntityStoreV1BulkImportPercentTest
Running org.apache.atlas.repository.audit.InMemoryAuditRepositoryTest
Running org.apache.atlas.util.CompiledQueryCacheKeyTest
Running org.apache.atlas.discovery.DataSetLineageServiceTest
Running org.apache.atlas.repository.impexp.ImportTransformerTest
Running org.apache.atlas.service.StoreBackedTypeCacheMetadataServiceTest
Running org.apache.atlas.repository.impexp.AtlasImportRequestTest
Tests run: 2, Failures: 0, Errors: 0, Skipped: 0, Time elapsed: 33.664 sec - in org.apache.atlas.repository.audit.HBaseBasedAuditRepositoryHATest
Tests run: 5, Failures: 0, Errors: 0, Skipped: 0, Time elapsed: 33.647 sec - in org.apache.atlas.util.CompiledQueryCacheKeyTest
Tests run: 6, Failures: 0, Errors: 0, Skipped: 0, Time elapsed: 35.386 sec - in org.apache.atlas.repository.impexp.ZipSourceTest
Running org.apache.atlas.repository.impexp.ZipSinkTest
Tests run: 0, Failures: 0, Errors: 0, Skipped: 0, Time elapsed: 36.248 sec - in org.apache.atlas.repository.store.graph.v1.AtlasDeleteHandlerV1Test
Tests run: 4, Failures: 0, Errors: 0, Skipped: 0, Time elapsed: 36.538 sec - in org.apache.atlas.repository.impexp.UniqueListTest
Running org.apache.atlas.repository.impexp.ImportTransformerJSONTest
Tests run: 9, Failures: 0, Errors: 0, Skipped: 0, Time elapsed: 37.19 sec - in org.apache.atlas.utils.ObjectUpdateSynchronizerTest
Running org.apache.atlas.repository.impexp.ImportServiceTest
Tests run: 8, Failures: 0, Errors: 0, Skipped: 0, Time elapsed: 36.36 sec - in org.apache.atlas.repository.impexp.ImportTransformerTest
Tests run: 0, Failures: 0, Errors: 0, Skipped: 0, Time elapsed: 37.79 sec - in org.apache.atlas.repository.store.graph.v1.AtlasRelationshipStoreV1Test
Tests run: 9, Failures: 0, Errors: 0, Skipped: 0, Time elapsed: 37.034 sec - in org.apache.atlas.repository.store.graph.v1.AtlasEntityStoreV1BulkImportPercentTest
Tests run: 0, Failures: 0, Errors: 0, Skipped: 0, Time elapsed: 38.029 sec - in org.apache.atlas.TestModules
Running org.apache.atlas.repository.impexp.TypeAttributeDifferenceTest
Running org.apache.atlas.repository.graph.GraphBackedRepositoryHardDeleteTest
Tests run: 6, Failures: 0, Errors: 0, Skipped: 0, Time elapsed: 36.732 sec - in org.apache.atlas.repository.impexp.AtlasImportRequestTest
Running org.apache.atlas.repository.graph.GraphBackedMetadataRepositoryTest
Tests run: 3, Failures: 0, Errors: 0, Skipped: 0, Time elapsed: 37.851 sec - in org.apache.atlas.repository.audit.InMemoryAuditRepositoryTest
Running org.apache.atlas.repository.graph.ReverseReferenceUpdateSoftDeleteTest
Running org.apache.atlas.repository.graph.TestIntSequence
Running org.apache.atlas.repository.graph.GraphHelperTest
Tests run: 0, Failures: 0, Errors: 0, Skipped: 0, Time elapsed: 39.167 sec - in org.apache.atlas.repository.store.graph.v1.InverseReferenceUpdateV1Test
Running org.apache.atlas.repository.graph.Gremlin3QueryOptimizerTest
Running org.apache.atlas.repository.graph.ReverseReferenceUpdateHardDeleteTest
Running org.apache.atlas.repository.graph.GraphBackedRepositorySoftDeleteTest
Running org.apache.atlas.repository.graph.AbstractGremlinQueryOptimizerTest
Tests run: 3, Failures: 0, Errors: 0, Skipped: 0, Time elapsed: 42.128 sec - in org.apache.atlas.repository.impexp.ImportTransformsTest
Running org.apache.atlas.repository.graph.GraphBackedSearchIndexerMockTest
Tests run: 6, Failures: 0, Errors: 0, Skipped: 0, Time elapsed: 48.155 sec - in org.apache.atlas.discovery.EntityDiscoveryServiceTest
Tests run: 1, Failures: 0, Errors: 0, Skipped: 0, Time elapsed: 48.711 sec - in org.apache.atlas.RepositoryServiceLoadingTest
Running org.apache.atlas.repository.graph.GraphHelperMockTest
Tests run: 0, Failures: 0, Errors: 0, Skipped: 0, Time elapsed: 48.256 sec - in org.apache.atlas.discovery.DataSetLineageServiceTest
Running org.apache.atlas.repository.graph.Gremlin2QueryOptimizerTest
Running org.apache.atlas.repository.graph.GraphRepoMapperScaleTest
Tests run: 1, Failures: 0, Errors: 0, Skipped: 0, Time elapsed: 54.9 sec - in org.apache.atlas.repository.store.graph.v1.AtlasEntityDefStoreV1Test
Running org.apache.atlas.repository.graph.GraphBackedSearchIndexerTest
Tests run: 10, Failures: 0, Errors: 0, Skipped: 0, Time elapsed: 61.656 sec - in org.apache.atlas.repository.store.graph.v1.AtlasRelationshipDefStoreV1Test
Running org.apache.atlas.repository.BaseTest
Tests run: 6, Failures: 0, Errors: 0, Skipped: 0, Time elapsed: 34.198 sec - in org.apache.atlas.repository.impexp.TypeAttributeDifferenceTest
Tests run: 1, Failures: 0, Errors: 0, Skipped: 0, Time elapsed: 36.509 sec - in org.apache.atlas.repository.impexp.ImportTransformerJSONTest
Running org.apache.atlas.repository.typestore.GraphBackedTypeStoreTest
Running org.apache.atlas.repository.typestore.StoreBackedTypeCacheTest
Tests run: 8, Failures: 0, Errors: 0, Skipped: 0, Time elapsed: 39.361 sec - in org.apache.atlas.repository.impexp.ZipSinkTest
Running org.apache.atlas.repository.userprofile.UserProfileServiceTest
Tests run: 0, Failures: 0, Errors: 0, Skipped: 0, Time elapsed: 38.544 sec - in org.apache.atlas.repository.graph.TestIntSequence
Tests run: 3, Failures: 0, Errors: 0, Skipped: 0, Time elapsed: 77.245 sec - in org.apache.atlas.service.StoreBackedTypeCacheMetadataServiceTest
Tests run: 5, Failures: 0, Errors: 0, Skipped: 0, Time elapsed: 78.379 sec - in org.apache.atlas.repository.store.graph.v1.AtlasRelationshipStoreSoftDeleteV1Test
Running org.apache.atlas.lineage.EntityLineageServiceTest
Running org.apache.atlas.BaseRepositoryTest
Running org.apache.atlas.query.ExpressionTest
Tests run: 0, Failures: 0, Errors: 0, Skipped: 0, Time elapsed: 39.261 sec - in org.apache.atlas.repository.graph.AbstractGremlinQueryOptimizerTest
Tests run: 5, Failures: 0, Errors: 0, Skipped: 0, Time elapsed: 81.367 sec - in org.apache.atlas.repository.store.graph.v1.AtlasRelationshipStoreHardDeleteV1Test
Tests run: 33, Failures: 0, Errors: 0, Skipped: 0, Time elapsed: 42.984 sec - in org.apache.atlas.repository.graph.Gremlin3QueryOptimizerTest
Running org.apache.atlas.query.LexerTest
Running org.apache.atlas.query.ParserTest
Tests run: 5, Failures: 0, Errors: 0, Skipped: 0, Time elapsed: 83.88 sec - in org.apache.atlas.repository.store.graph.v1.InverseReferenceUpdateHardDeleteV1Test
Running org.apache.atlas.query.LineageQueryTest
Running org.apache.atlas.query.GremlinTest
Tests run: 3, Failures: 0, Errors: 0, Skipped: 0, Time elapsed: 43.201 sec - in org.apache.atlas.repository.graph.GraphBackedSearchIndexerMockTest
Tests run: 5, Failures: 0, Errors: 0, Skipped: 0, Time elapsed: 89.412 sec - in org.apache.atlas.repository.store.graph.v1.InverseReferenceUpdateSoftDeleteV1Test
Running org.apache.atlas.query.QueryProcessorTest
Running org.apache.atlas.query.BaseGremlinTest
Tests run: 2, Failures: 0, Errors: 0, Skipped: 0, Time elapsed: 42.764 sec - in org.apache.atlas.repository.graph.GraphHelperMockTest
Running org.apache.atlas.services.MetricsServiceTest
Tests run: 33, Failures: 0, Errors: 0, Skipped: 0, Time elapsed: 45.401 sec - in org.apache.atlas.repository.graph.Gremlin2QueryOptimizerTest
Tests run: 4, Failures: 0, Errors: 0, Skipped: 0, Time elapsed: 97.479 sec - in org.apache.atlas.repository.audit.HBaseBasedAuditRepositoryTest
Running org.apache.atlas.TestUtils
Tests run: 0, Failures: 0, Errors: 0, Skipped: 0, Time elapsed: 37.725 sec - in org.apache.atlas.repository.BaseTest
Tests run: 5, Failures: 0, Errors: 0, Skipped: 0, Time elapsed: 67.516 sec - in org.apache.atlas.repository.graph.ReverseReferenceUpdateSoftDeleteTest
Tests run: 5, Failures: 0, Errors: 0, Skipped: 0, Time elapsed: 51.556 sec - in org.apache.atlas.repository.graph.GraphBackedSearchIndexerTest
Tests run: 5, Failures: 0, Errors: 0, Skipped: 0, Time elapsed: 73.546 sec - in org.apache.atlas.repository.graph.ReverseReferenceUpdateHardDeleteTest
Tests run: 14, Failures: 0, Errors: 0, Skipped: 0, Time elapsed: 114.48 sec - in org.apache.atlas.repository.store.graph.v1.AtlasEntityStoreV1Test
Tests run: 1, Failures: 0, Errors: 0, Skipped: 0, Time elapsed: 32.274 sec - in org.apache.atlas.query.LexerTest
Tests run: 0, Failures: 0, Errors: 0, Skipped: 0, Time elapsed: 35.368 sec - in org.apache.atlas.BaseRepositoryTest
Tests run: 10, Failures: 0, Errors: 0, Skipped: 0, Time elapsed: 116.109 sec - in org.apache.atlas.repository.impexp.ExportServiceTest
Tests run: 19, Failures: 0, Errors: 0, Skipped: 0, Time elapsed: 37.75 sec - in org.apache.atlas.query.ExpressionTest
Tests run: 17, Failures: 0, Errors: 0, Skipped: 0, Time elapsed: 120.427 sec - in org.apache.atlas.repository.store.graph.AtlasTypeDefGraphStoreTest
Tests run: 0, Failures: 0, Errors: 0, Skipped: 0, Time elapsed: 29.542 sec - in org.apache.atlas.query.BaseGremlinTest
Tests run: 14, Failures: 0, Errors: 0, Skipped: 0, Time elapsed: 83.049 sec - in org.apache.atlas.repository.graph.GraphHelperTest
Tests run: 14, Failures: 0, Errors: 0, Skipped: 0, Time elapsed: 40.175 sec - in org.apache.atlas.query.ParserTest
Tests run: 0, Failures: 0, Errors: 0, Skipped: 0, Time elapsed: 27.508 sec - in org.apache.atlas.TestUtils
Tests run: 11, Failures: 0, Errors: 0, Skipped: 0, Time elapsed: 125.514 sec - in org.apache.atlas.repository.store.graph.v1.HardDeleteHandlerV1Test
Tests run: 5, Failures: 0, Errors: 0, Skipped: 0, Time elapsed: 37.341 sec - in org.apache.atlas.query.QueryProcessorTest
Tests run: 11, Failures: 0, Errors: 0, Skipped: 0, Time elapsed: 128.279 sec - in org.apache.atlas.repository.store.graph.v1.SoftDeleteHandlerV1Test
Tests run: 2, Failures: 0, Errors: 0, Skipped: 0, Time elapsed: 55.553 sec - in org.apache.atlas.repository.typestore.StoreBackedTypeCacheTest
Tests run: 5, Failures: 0, Errors: 0, Skipped: 0, Time elapsed: 58.328 sec - in org.apache.atlas.repository.typestore.GraphBackedTypeStoreTest
Tests run: 27, Failures: 0, Errors: 0, Skipped: 0, Time elapsed: 132.934 sec - in org.apache.atlas.service.DefaultMetadataServiceTest
Tests run: 1, Failures: 0, Errors: 0, Skipped: 0, Time elapsed: 40.057 sec - in org.apache.atlas.services.MetricsServiceTest
Tests run: 30, Failures: 0, Errors: 0, Skipped: 0, Time elapsed: 97.184 sec - in org.apache.atlas.repository.graph.GraphBackedMetadataRepositoryTest
Tests run: 21, Failures: 0, Errors: 0, Skipped: 0, Time elapsed: 100.661 sec - in org.apache.atlas.repository.graph.GraphBackedRepositoryHardDeleteTest
Tests run: 21, Failures: 0, Errors: 0, Skipped: 0, Time elapsed: 98.741 sec - in org.apache.atlas.repository.graph.GraphBackedRepositorySoftDeleteTest
Tests run: 11, Failures: 0, Errors: 0, Skipped: 0, Time elapsed: 67.513 sec - in org.apache.atlas.repository.userprofile.UserProfileServiceTest
Tests run: 5, Failures: 0, Errors: 0, Skipped: 0, Time elapsed: 62.292 sec - in org.apache.atlas.query.LineageQueryTest
Tests run: 9, Failures: 1, Errors: 0, Skipped: 0, Time elapsed: 109.313 sec <<< FAILURE!
- in org.apache.atlas.repository.impexp.ImportServiceTest
importCTAS(org.apache.atlas.repository.impexp.ImportServiceTest)  Time elapsed: 8.025 sec
 <<< FAILURE!
org.apache.atlas.exception.AtlasBaseException: Given instance is invalid/not found: Could
not find entities in the repository with guids: [73cb606c-6846-4718-a859-40c9c17e0b32]
	at org.apache.atlas.repository.converters.AtlasInstanceConverter.toAtlasBaseException(AtlasInstanceConverter.java:213)
	at org.apache.atlas.repository.converters.AtlasInstanceConverter.getITypedReferenceable(AtlasInstanceConverter.java:115)
	at org.apache.atlas.repository.store.graph.v1.AtlasEntityChangeNotifier.toITypedReferenceable(AtlasEntityChangeNotifier.java:184)
	at org.apache.atlas.repository.store.graph.v1.AtlasEntityChangeNotifier.notifyListeners(AtlasEntityChangeNotifier.java:158)
	at org.apache.atlas.repository.store.graph.v1.AtlasEntityChangeNotifier.onEntitiesMutated(AtlasEntityChangeNotifier.java:84)
	at org.apache.atlas.repository.store.graph.v1.AtlasEntityStoreV1.createOrUpdate(AtlasEntityStoreV1.java:165)
	at org.apache.atlas.repository.store.graph.v1.AtlasEntityStoreV1.createOrUpdateForImport(AtlasEntityStoreV1.java:179)
	at org.apache.atlas.GraphTransactionInterceptor.invoke(GraphTransactionInterceptor.java:60)
	at org.apache.atlas.repository.store.graph.v1.BulkImporterImpl.bulkImport(BulkImporterImpl.java:82)
	at org.apache.atlas.repository.impexp.ImportService.processEntities(ImportService.java:161)
	at org.apache.atlas.repository.impexp.ImportService.run(ImportService.java:82)
	at org.apache.atlas.repository.impexp.ImportService.run(ImportService.java:61)
	at org.apache.atlas.repository.impexp.ZipFileResourceTestUtils.runImportWithNoParameters(ZipFileResourceTestUtils.java:215)
	at org.apache.atlas.repository.impexp.ImportServiceTest.importCTAS(ImportServiceTest.java:168)

Tests run: 21, Failures: 0, Errors: 0, Skipped: 0, Time elapsed: 70.851 sec - in org.apache.atlas.query.GremlinTest
Tests run: 23, Failures: 0, Errors: 0, Skipped: 0, Time elapsed: 76.685 sec - in org.apache.atlas.lineage.EntityLineageServiceTest
Tests run: 2, Failures: 0, Errors: 0, Skipped: 0, Time elapsed: 252.182 sec - in org.apache.atlas.repository.graph.GraphRepoMapperScaleTest
Tests run: 338, Failures: 0, Errors: 0, Skipped: 0, Time elapsed: 305.582 sec - in org.apache.atlas.discovery.GraphBackedDiscoveryServiceTest

Results :

Failed tests: 
  ImportServiceTest.importCTAS:168 » AtlasBase Given instance is invalid/not fou...

Tests run: 833, Failures: 1, Errors: 0, Skipped: 0

[INFO] ------------------------------------------------------------------------
[INFO] Reactor Summary:
[INFO] 
[INFO] Apache Atlas Server Build Tools .................... SUCCESS [  1.153 s]
[INFO] apache-atlas ....................................... SUCCESS [ 12.269 s]
[INFO] Apache Atlas Integration ........................... SUCCESS [ 55.189 s]
[INFO] Apache Atlas Common ................................ SUCCESS [ 18.329 s]
[INFO] Apache Atlas Typesystem ............................ SUCCESS [01:29 min]
[INFO] Apache Atlas Client ................................ SUCCESS [  0.668 s]
[INFO] atlas-client-common ................................ SUCCESS [ 15.658 s]
[INFO] atlas-client-v1 .................................... SUCCESS [ 20.988 s]
[INFO] Apache Atlas Server API ............................ SUCCESS [ 14.303 s]
[INFO] Apache Atlas Notification .......................... SUCCESS [ 32.836 s]
[INFO] atlas-client-v2 .................................... SUCCESS [ 12.169 s]
[INFO] Apache Atlas Graph Database Projects ............... SUCCESS [  0.759 s]
[INFO] Apache Atlas Graph Database API .................... SUCCESS [  9.440 s]
[INFO] Graph Database Common Code ......................... SUCCESS [ 10.933 s]
[INFO] Apache Atlas Titan 1.0.0 GraphDB Impl .............. SUCCESS [ 45.435 s]
[INFO] Shaded version of Apache hbase client .............. SUCCESS [ 11.703 s]
[INFO] Apache Atlas Titan 0.5.4 Graph DB Impl ............. SUCCESS [01:35 min]
[INFO] Apache Atlas Graph Database Implementation Dependencies SUCCESS [  1.043 s]
[INFO] Shaded version of Apache hbase server .............. SUCCESS [ 26.796 s]
[INFO] Apache Atlas Repository ............................ FAILURE [06:17 min]
[INFO] Apache Atlas Authorization ......................... SKIPPED
[INFO] Apache Atlas Business Catalog ...................... SKIPPED
[INFO] Apache Atlas UI .................................... SKIPPED
[INFO] Apache Atlas Web Application ....................... SKIPPED
[INFO] Apache Atlas Documentation ......................... SKIPPED
[INFO] Apache Atlas FileSystem Model ...................... SKIPPED
[INFO] Apache Atlas Plugin Classloader .................... SKIPPED
[INFO] Apache Atlas Hive Bridge Shim ...................... SKIPPED
[INFO] Apache Atlas Hive Bridge ........................... SKIPPED
[INFO] Apache Atlas Falcon Bridge Shim .................... SKIPPED
[INFO] Apache Atlas Falcon Bridge ......................... SKIPPED
[INFO] Apache Atlas Sqoop Bridge Shim ..................... SKIPPED
[INFO] Apache Atlas Sqoop Bridge .......................... SKIPPED
[INFO] Apache Atlas Storm Bridge Shim ..................... SKIPPED
[INFO] Apache Atlas Storm Bridge .......................... SKIPPED
[INFO] Apache Atlas Distribution .......................... SKIPPED
[INFO] ------------------------------------------------------------------------
[INFO] BUILD FAILURE
[INFO] ------------------------------------------------------------------------
[INFO] Total time: 14:16 min
[INFO] Finished at: 2017-09-30T00:55:22Z
[INFO] Final Memory: 153M/1691M
[INFO] ------------------------------------------------------------------------
[ERROR] Failed to execute goal org.apache.maven.plugins:maven-surefire-plugin:2.18.1:test
(default-test) on project atlas-repository: There are test failures.
[ERROR] 
[ERROR] Please refer to <https://builds.apache.org/job/Atlas-master-UnitTests/ws/repository/target/surefire-reports>
for the individual test results.
[ERROR] -> [Help 1]
[ERROR] 
[ERROR] To see the full stack trace of the errors, re-run Maven with the -e switch.
[ERROR] Re-run Maven using the -X switch to enable full debug logging.
[ERROR] 
[ERROR] For more information about the errors and possible solutions, please read the following
articles:
[ERROR] [Help 1] http://cwiki.apache.org/confluence/display/MAVEN/MojoFailureException
[ERROR] 
[ERROR] After correcting the problems, you can resume the build with the command
[ERROR]   mvn <goals> -rf :atlas-repository
Build step 'Execute shell' marked build as failure
[CHECKSTYLE] Collecting checkstyle analysis files...
[CHECKSTYLE] Searching for all files in <https://builds.apache.org/job/Atlas-master-UnitTests/ws/>
that match the pattern **/target/checkstyle-result.xml
[CHECKSTYLE] Parsing 18 files in <https://builds.apache.org/job/Atlas-master-UnitTests/ws/>
[CHECKSTYLE] Successfully parsed file <https://builds.apache.org/job/Atlas-master-UnitTests/ws/client/client-v1/target/checkstyle-result.xml>
with 873 unique warnings and 0 duplicates.
[CHECKSTYLE] Successfully parsed file <https://builds.apache.org/job/Atlas-master-UnitTests/ws/client/client-v2/target/checkstyle-result.xml>
with 1198 unique warnings and 0 duplicates.
[CHECKSTYLE] Successfully parsed file <https://builds.apache.org/job/Atlas-master-UnitTests/ws/client/common/target/checkstyle-result.xml>
with 1655 unique warnings and 0 duplicates.
[CHECKSTYLE] Successfully parsed file <https://builds.apache.org/job/Atlas-master-UnitTests/ws/client/target/checkstyle-result.xml>
with 1655 unique warnings and 0 duplicates.
[CHECKSTYLE] Successfully parsed file <https://builds.apache.org/job/Atlas-master-UnitTests/ws/common/target/checkstyle-result.xml>
with 2606 unique warnings and 0 duplicates.
[CHECKSTYLE] Successfully parsed file <https://builds.apache.org/job/Atlas-master-UnitTests/ws/graphdb/api/target/checkstyle-result.xml>
with 2879 unique warnings and 0 duplicates.
[CHECKSTYLE] Successfully parsed file <https://builds.apache.org/job/Atlas-master-UnitTests/ws/graphdb/common/target/checkstyle-result.xml>
with 3066 unique warnings and 0 duplicates.
[CHECKSTYLE] Successfully parsed file <https://builds.apache.org/job/Atlas-master-UnitTests/ws/graphdb/graphdb-impls/target/checkstyle-result.xml>
with 3066 unique warnings and 0 duplicates.
[CHECKSTYLE] Successfully parsed file <https://builds.apache.org/job/Atlas-master-UnitTests/ws/graphdb/target/checkstyle-result.xml>
with 3066 unique warnings and 0 duplicates.
[CHECKSTYLE] Successfully parsed file <https://builds.apache.org/job/Atlas-master-UnitTests/ws/graphdb/titan0/target/checkstyle-result.xml>
with 5468 unique warnings and 0 duplicates.
[CHECKSTYLE] Successfully parsed file <https://builds.apache.org/job/Atlas-master-UnitTests/ws/graphdb/titan1/target/checkstyle-result.xml>
with 6435 unique warnings and 0 duplicates.
[CHECKSTYLE] Successfully parsed file <https://builds.apache.org/job/Atlas-master-UnitTests/ws/intg/target/checkstyle-result.xml>
with 14646 unique warnings and 0 duplicates.
[CHECKSTYLE] Successfully parsed file <https://builds.apache.org/job/Atlas-master-UnitTests/ws/notification/target/checkstyle-result.xml>
with 15856 unique warnings and 0 duplicates.
[CHECKSTYLE] Successfully parsed file <https://builds.apache.org/job/Atlas-master-UnitTests/ws/server-api/target/checkstyle-result.xml>
with 16235 unique warnings and 0 duplicates.
[CHECKSTYLE] Successfully parsed file <https://builds.apache.org/job/Atlas-master-UnitTests/ws/shaded/hbase-client-shaded/target/checkstyle-result.xml>
with 16235 unique warnings and 0 duplicates.
[CHECKSTYLE] Successfully parsed file <https://builds.apache.org/job/Atlas-master-UnitTests/ws/shaded/hbase-server-shaded/target/checkstyle-result.xml>
with 16235 unique warnings and 0 duplicates.
[CHECKSTYLE] Successfully parsed file <https://builds.apache.org/job/Atlas-master-UnitTests/ws/target/checkstyle-result.xml>
with 16235 unique warnings and 0 duplicates.
[CHECKSTYLE] Successfully parsed file <https://builds.apache.org/job/Atlas-master-UnitTests/ws/typesystem/target/checkstyle-result.xml>
with 20453 unique warnings and 0 duplicates.
<Git Blamer> Using GitBlamer to create author and commit information for all warnings.
<Git Blamer> GIT_COMMIT=57fbb9cea1592a85b59a02b6a672bab43092f1d3, workspace=<https://builds.apache.org/job/Atlas-master-UnitTests/ws/>
 > git rev-parse 57fbb9cea1592a85b59a02b6a672bab43092f1d3^{commit} # timeout=10
[CHECKSTYLE] Computing warning deltas based on reference build #59
[FINDBUGS] Collecting findbugs analysis files...
[FINDBUGS] Searching for all files in <https://builds.apache.org/job/Atlas-master-UnitTests/ws/>
that match the pattern **/target/findbugs.xml
[FINDBUGS] Parsing 11 files in <https://builds.apache.org/job/Atlas-master-UnitTests/ws/>
[FINDBUGS] Successfully parsed file <https://builds.apache.org/job/Atlas-master-UnitTests/ws/client/client-v1/target/findbugs.xml>
with 0 unique warnings and 0 duplicates.
[FINDBUGS] Successfully parsed file <https://builds.apache.org/job/Atlas-master-UnitTests/ws/client/client-v2/target/findbugs.xml>
with 0 unique warnings and 0 duplicates.
[FINDBUGS] Successfully parsed file <https://builds.apache.org/job/Atlas-master-UnitTests/ws/client/common/target/findbugs.xml>
with 0 unique warnings and 0 duplicates.
[FINDBUGS] Successfully parsed file <https://builds.apache.org/job/Atlas-master-UnitTests/ws/common/target/findbugs.xml>
with 0 unique warnings and 0 duplicates.
[FINDBUGS] Successfully parsed file <https://builds.apache.org/job/Atlas-master-UnitTests/ws/graphdb/api/target/findbugs.xml>
with 0 unique warnings and 0 duplicates.
[FINDBUGS] Successfully parsed file <https://builds.apache.org/job/Atlas-master-UnitTests/ws/graphdb/common/target/findbugs.xml>
with 0 unique warnings and 0 duplicates.
[FINDBUGS] Successfully parsed file <https://builds.apache.org/job/Atlas-master-UnitTests/ws/graphdb/titan0/target/findbugs.xml>
with 0 unique warnings and 0 duplicates.
[FINDBUGS] Successfully parsed file <https://builds.apache.org/job/Atlas-master-UnitTests/ws/intg/target/findbugs.xml>
with 0 unique warnings and 0 duplicates.
[FINDBUGS] Successfully parsed file <https://builds.apache.org/job/Atlas-master-UnitTests/ws/notification/target/findbugs.xml>
with 0 unique warnings and 0 duplicates.
[FINDBUGS] Successfully parsed file <https://builds.apache.org/job/Atlas-master-UnitTests/ws/server-api/target/findbugs.xml>
with 0 unique warnings and 0 duplicates.
[FINDBUGS] Successfully parsed file <https://builds.apache.org/job/Atlas-master-UnitTests/ws/typesystem/target/findbugs.xml>
with 0 unique warnings and 0 duplicates.
<Git Blamer> Using GitBlamer to create author and commit information for all warnings.
<Git Blamer> GIT_COMMIT=57fbb9cea1592a85b59a02b6a672bab43092f1d3, workspace=<https://builds.apache.org/job/Atlas-master-UnitTests/ws/>
[FINDBUGS] Computing warning deltas based on reference build #59
Archiving artifacts
TestNG Reports Processing: START
Looking for TestNG results report in workspace using pattern: **/target/surefire-reports/testng-results.xml,**/target/failsafe-reports/testng-results.xml
Saving reports...
Processing '/x1/jenkins/jenkins-home/jobs/Atlas-master-UnitTests/builds/107/testng/testng-results-1.xml'
Processing '/x1/jenkins/jenkins-home/jobs/Atlas-master-UnitTests/builds/107/testng/testng-results-2.xml'
Processing '/x1/jenkins/jenkins-home/jobs/Atlas-master-UnitTests/builds/107/testng/testng-results-3.xml'
Processing '/x1/jenkins/jenkins-home/jobs/Atlas-master-UnitTests/builds/107/testng/testng-results-4.xml'
Processing '/x1/jenkins/jenkins-home/jobs/Atlas-master-UnitTests/builds/107/testng/testng-results-5.xml'
Processing '/x1/jenkins/jenkins-home/jobs/Atlas-master-UnitTests/builds/107/testng/testng-results-6.xml'
Processing '/x1/jenkins/jenkins-home/jobs/Atlas-master-UnitTests/builds/107/testng/testng-results.xml'
TestNG Reports Processing: FINISH

Mime
View raw message