atlas-dev mailing list archives

Site index · List index
Message view « Date » · « Thread »
Top « Date » · « Thread »
From Apache Jenkins Server <jenk...@builds.apache.org>
Subject Build failed in Jenkins: Atlas-0.8-IntegrationTests #82
Date Tue, 26 Sep 2017 13:58:31 GMT
See <https://builds.apache.org/job/Atlas-0.8-IntegrationTests/82/display/redirect?page=changes>

Changes:

[kbhatt] ATLAS-2168 : When a second search is fired in between the pages of the

[kbhatt] ATLAS-2130 : Call made to fetch tables of a database doesn't have

[kbhatt] ATLAS-2153 : UI : Adding more columns to the search table masks the

------------------------------------------
[...truncated 491.44 KB...]
127.0.0.1 - - [26/Sep/2017:13:53:20 +0000] "GET /api/atlas/entities/blah HTTP/1.1" 404 - "-"
"Java/1.7.0_80"
127.0.0.1 - - [26/Sep/2017:13:53:20 +0000] "POST /api/atlas/entities HTTP/1.1" 201 - "-" "Java/1.7.0_80"
127.0.0.1 - - [26/Sep/2017:13:53:20 +0000] "POST /api/atlas/entities HTTP/1.1" 201 - "-" "Java/1.7.0_80"
127.0.0.1 - - [26/Sep/2017:13:53:20 +0000] "GET /api/atlas/v2/types/typedef/name/PII_TraitWwXnzGZdyk
HTTP/1.1" 404 - "-" "Java/1.7.0_80"
127.0.0.1 - - [26/Sep/2017:13:53:20 +0000] "POST /api/atlas/types HTTP/1.1" 201 - "-" "Java/1.7.0_80"
127.0.0.1 - - [26/Sep/2017:13:53:20 +0000] "POST /api/atlas/entities/c34b572f-5fd2-41a7-8679-424f88ade9ae/traits
HTTP/1.1" 201 - "-" "Java/1.7.0_80"
127.0.0.1 - - [26/Sep/2017:13:53:20 +0000] "GET /api/atlas/entities/c34b572f-5fd2-41a7-8679-424f88ade9ae/traitDefinitions/PII_TraitWwXnzGZdyk
HTTP/1.1" 200 - "-" "Java/1.7.0_80"
127.0.0.1 - - [26/Sep/2017:13:53:20 +0000] "GET /api/atlas/entities/c34b572f-5fd2-41a7-8679-424f88ade9ae/traitDefinitions
HTTP/1.1" 200 - "-" "Java/1.7.0_80"
127.0.0.1 - - [26/Sep/2017:13:53:20 +0000] "POST /api/atlas/entities HTTP/1.1" 201 - "-" "Java/1.7.0_80"
127.0.0.1 - - [26/Sep/2017:13:53:20 +0000] "POST /api/atlas/entities HTTP/1.1" 201 - "-" "Java/1.7.0_80"
127.0.0.1 - - [26/Sep/2017:13:53:20 +0000] "GET /api/atlas/entities/f2096ca6-89bf-4a4c-b893-8632d681c178/traits
HTTP/1.1" 200 - "-" "Java/1.7.0_80"
127.0.0.1 - - [26/Sep/2017:13:53:20 +0000] "POST /api/atlas/entities HTTP/1.1" 201 - "-" "Java/1.7.0_80"
127.0.0.1 - - [26/Sep/2017:13:53:20 +0000] "POST /api/atlas/entities HTTP/1.1" 201 - "-" "Java/1.7.0_80"
127.0.0.1 - - [26/Sep/2017:13:53:21 +0000] "POST /api/atlas/entities/72c3074d-f0a9-49bc-9333-22daa71b6305
HTTP/1.1" 200 - "-" "Java/1.7.0_80"
127.0.0.1 - - [26/Sep/2017:13:53:21 +0000] "GET /api/atlas/entities/72c3074d-f0a9-49bc-9333-22daa71b6305
HTTP/1.1" 200 - "-" "Java/1.7.0_80"
127.0.0.1 - - [26/Sep/2017:13:53:21 +0000] "POST /api/atlas/entities HTTP/1.1" 201 - "-" "Java/1.7.0_80"
127.0.0.1 - - [26/Sep/2017:13:53:21 +0000] "POST /api/atlas/entities HTTP/1.1" 201 - "-" "Java/1.7.0_80"
127.0.0.1 - - [26/Sep/2017:13:53:21 +0000] "POST /api/atlas/entities/qualifiedName?type=hive_table&property=qualifiedName&value=tableALNIPDjtAO
HTTP/1.1" 200 - "-" "Java/1.7.0_80"
127.0.0.1 - - [26/Sep/2017:13:53:21 +0000] "GET /api/atlas/entities/bfbe98dc-7109-442a-b460-c491ef23ab93
HTTP/1.1" 200 - "-" "Java/1.7.0_80"
127.0.0.1 - - [26/Sep/2017:13:53:21 +0000] "POST /api/atlas/entities HTTP/1.1" 201 - "-" "Java/1.7.0_80"
127.0.0.1 - - [26/Sep/2017:13:53:21 +0000] "GET /api/atlas/entities/b31d9c65-e068-4d08-96d4-13017b9478a7/audit?count=10
HTTP/1.1" 200 - "-" "Java/1.7.0_80"
127.0.0.1 - - [26/Sep/2017:13:53:21 +0000] "POST /api/atlas/entities HTTP/1.1" 201 - "-" "Java/1.7.0_80"
127.0.0.1 - - [26/Sep/2017:13:53:21 +0000] "POST /api/atlas/entities HTTP/1.1" 201 - "-" "Java/1.7.0_80"
127.0.0.1 - - [26/Sep/2017:13:53:21 +0000] "POST /api/atlas/entities HTTP/1.1" 201 - "-" "Java/1.7.0_80"
127.0.0.1 - - [26/Sep/2017:13:53:21 +0000] "POST /api/atlas/entities HTTP/1.1" 400 - "-" "Java/1.7.0_80"
127.0.0.1 - - [26/Sep/2017:13:53:21 +0000] "POST /api/atlas/entities HTTP/1.1" 201 - "-" "Java/1.7.0_80"
127.0.0.1 - - [26/Sep/2017:13:53:21 +0000] "GET /api/atlas/v2/types/typedef/name/RznTXOSS73
HTTP/1.1" 404 - "-" "Java/1.7.0_80"
127.0.0.1 - - [26/Sep/2017:13:53:21 +0000] "POST /api/atlas/types HTTP/1.1" 201 - "-" "Java/1.7.0_80"
127.0.0.1 - - [26/Sep/2017:13:53:21 +0000] "POST /api/atlas/entities HTTP/1.1" 201 - "-" "Java/1.7.0_80"
127.0.0.1 - - [26/Sep/2017:13:53:21 +0000] "GET /api/atlas/entities/56e911bf-3023-46dd-a88e-347d746dc662
HTTP/1.1" 200 - "-" "Java/1.7.0_80"
127.0.0.1 - - [26/Sep/2017:13:53:21 +0000] "GET /api/atlas/v2/entity/guid/965c5715-c194-4986-844b-9b2820e1a803
HTTP/1.1" 200 - "-" "Java/1.7.0_80"
127.0.0.1 - - [26/Sep/2017:13:53:21 +0000] "POST /api/atlas/v2/entity/ HTTP/1.1" 200 - "-"
"Java/1.7.0_80"
127.0.0.1 - - [26/Sep/2017:13:53:22 +0000] "POST /api/atlas/v2/entity/guid/random/classifications
HTTP/1.1" 404 - "-" "Java/1.7.0_80"
127.0.0.1 - - [26/Sep/2017:13:53:22 +0000] "POST /api/atlas/v2/entity/bulk/ HTTP/1.1" 200
- "-" "Java/1.7.0_80"
127.0.0.1 - - [26/Sep/2017:13:53:22 +0000] "POST /api/atlas/v2/entity/ HTTP/1.1" 200 - "-"
"Java/1.7.0_80"
127.0.0.1 - - [26/Sep/2017:13:53:22 +0000] "POST /api/atlas/v2/entity/ HTTP/1.1" 200 - "-"
"Java/1.7.0_80"
127.0.0.1 - - [26/Sep/2017:13:53:22 +0000] "DELETE /api/atlas/v2/entity/bulk/?guid=25678ea7-ff50-4d27-b8fb-66a45c4865b4&guid=528c48ac-5c57-4ce9-9a1a-ae14d6800022
HTTP/1.1" 200 - "-" "Java/1.7.0_80"
127.0.0.1 - - [26/Sep/2017:13:53:22 +0000] "POST /api/atlas/v2/entity/ HTTP/1.1" 200 - "-"
"Java/1.7.0_80"
127.0.0.1 - - [26/Sep/2017:13:53:22 +0000] "DELETE /api/atlas/v2/entity/uniqueAttribute/type/hive_db_v2?attr:name=dbAJAPTYCshN%E8%B7%B4%EA%95%B3%E3%93%BC%EB%BB%B1%E3%91%9A%F2%84%80%9C%E9%84%BD%EE%B3%84%EE%AC%AB
HTTP/1.1" 200 - "-" "Java/1.7.0_80"
127.0.0.1 - - [26/Sep/2017:13:53:22 +0000] "DELETE /api/atlas/v2/entity/guid/random/classification/blah_trait
HTTP/1.1" 400 - "-" "Java/1.7.0_80"
127.0.0.1 - - [26/Sep/2017:13:53:22 +0000] "GET /api/atlas/discovery/search/dsl?query=hive_db_v2+where+name%3D'dbAJAPTYCshN'&limit=10&offset=0
HTTP/1.1" 200 - "-" "Java/1.7.0_80"
127.0.0.1 - - [26/Sep/2017:13:53:23 +0000] "GET /api/atlas/discovery/search/dsl?query=hive_db_v2+where+name%3D'dbAJAPTYCshN'&limit=10&offset=0
HTTP/1.1" 200 - "-" "Java/1.7.0_80"
127.0.0.1 - - [26/Sep/2017:13:53:24 +0000] "POST /api/atlas/v2/entity/ HTTP/1.1" 200 - "-"
"Java/1.7.0_80"
127.0.0.1 - - [26/Sep/2017:13:53:24 +0000] "GET /api/atlas/discovery/search/dsl?query=hive_db_v2+where+name%3D'dbAJAPTYCshN'&limit=10&offset=0
HTTP/1.1" 200 - "-" "Java/1.7.0_80"
127.0.0.1 - - [26/Sep/2017:13:53:25 +0000] "POST /api/atlas/v2/types/typedefs/ HTTP/1.1" 200
- "-" "Java/1.7.0_80"
127.0.0.1 - - [26/Sep/2017:13:53:25 +0000] "POST /api/atlas/v2/entity/ HTTP/1.1" 200 - "-"
"Java/1.7.0_80"
127.0.0.1 - - [26/Sep/2017:13:53:25 +0000] "PUT /api/atlas/v2/types/typedefs/ HTTP/1.1" 200
- "-" "Java/1.7.0_80"
127.0.0.1 - - [26/Sep/2017:13:53:25 +0000] "GET /api/atlas/v2/entity/guid/5004966c-113e-40b7-9b22-43fbd49db9cb
HTTP/1.1" 200 - "-" "Java/1.7.0_80"
127.0.0.1 - - [26/Sep/2017:13:53:25 +0000] "POST /api/atlas/v2/entity/ HTTP/1.1" 404 - "-"
"Java/1.7.0_80"
127.0.0.1 - - [26/Sep/2017:13:53:25 +0000] "POST /api/atlas/v2/entity/ HTTP/1.1" 200 - "-"
"Java/1.7.0_80"
127.0.0.1 - - [26/Sep/2017:13:53:25 +0000] "POST /api/atlas/v2/entity/ HTTP/1.1" 200 - "-"
"Java/1.7.0_80"
127.0.0.1 - - [26/Sep/2017:13:53:25 +0000] "GET /api/atlas/v2/entity/uniqueAttribute/type/hive_db_v2?attr:name=dbAJAPTYCshN
HTTP/1.1" 200 - "-" "Java/1.7.0_80"
127.0.0.1 - - [26/Sep/2017:13:53:25 +0000] "GET /api/atlas/v2/entity/guid/blah HTTP/1.1" 404
- "-" "Java/1.7.0_80"
127.0.0.1 - - [26/Sep/2017:13:53:25 +0000] "POST /api/atlas/v2/entity/ HTTP/1.1" 200 - "-"
"Java/1.7.0_80"
127.0.0.1 - - [26/Sep/2017:13:53:25 +0000] "GET /api/atlas/entities/c2663067-df42-45b4-87b5-191089338016/audit?count=10
HTTP/1.1" 200 - "-" "Java/1.7.0_80"
127.0.0.1 - - [26/Sep/2017:13:53:26 +0000] "POST /api/atlas/v2/entity/ HTTP/1.1" 200 - "-"
"Java/1.7.0_80"
127.0.0.1 - - [26/Sep/2017:13:53:26 +0000] "POST /api/atlas/v2/entity/ HTTP/1.1" 200 - "-"
"Java/1.7.0_80"
127.0.0.1 - - [26/Sep/2017:13:53:26 +0000] "GET /api/atlas/v2/types/typedef/name/oo4Sa2VSAy
HTTP/1.1" 404 - "-" "Java/1.7.0_80"
127.0.0.1 - - [26/Sep/2017:13:53:26 +0000] "POST /api/atlas/v2/types/typedefs/ HTTP/1.1" 200
- "-" "Java/1.7.0_80"
127.0.0.1 - - [26/Sep/2017:13:53:26 +0000] "POST /api/atlas/v2/entity/ HTTP/1.1" 200 - "-"
"Java/1.7.0_80"
127.0.0.1 - - [26/Sep/2017:13:53:26 +0000] "GET /api/atlas/v2/entity/guid/db70d202-6110-4114-8ad1-2ac5ebcdd85c
HTTP/1.1" 200 - "-" "Java/1.7.0_80"
127.0.0.1 - - [26/Sep/2017:13:53:26 +0000] "GET /api/atlas/discovery/search/dsl?query=from+hive_db_v1+name%3D%22dbvsmrTvwLcd%22
HTTP/1.1" 200 - "-" "Java/1.7.0_80"
127.0.0.1 - - [26/Sep/2017:13:53:27 +0000] "GET /api/atlas/discovery/search/dsl?query=from+blah
HTTP/1.1" 400 - "-" "Java/1.7.0_80"
127.0.0.1 - - [26/Sep/2017:13:53:27 +0000] "GET /api/atlas/discovery/search?query=* HTTP/1.1"
200 - "-" "Java/1.7.0_80"
127.0.0.1 - - [26/Sep/2017:13:53:27 +0000] "GET /api/atlas/discovery/search?query=from+hive_db_v1+name%3D%22dbvsmrTvwLcd%22
HTTP/1.1" 200 - "-" "Java/1.7.0_80"
127.0.0.1 - - [26/Sep/2017:13:53:28 +0000] "GET /api/atlas/discovery/search/gremlin?query=g.V.has('type',+'hive_table_v1').toList()
HTTP/1.1" 200 - "-" "Java/1.7.0_80"
127.0.0.1 - - [26/Sep/2017:13:53:29 +0000] "GET /api/atlas/v2/types/enumdef/name/blah HTTP/1.1"
404 - "-" "Java/1.7.0_80"
127.0.0.1 - - [26/Sep/2017:13:53:29 +0000] "GET /api/atlas/v2/types/enumdef/guid/blah HTTP/1.1"
404 - "-" "Java/1.7.0_80"
127.0.0.1 - - [26/Sep/2017:13:53:29 +0000] "GET /api/atlas/v2/types/structdef/name/blah HTTP/1.1"
404 - "-" "Java/1.7.0_80"
127.0.0.1 - - [26/Sep/2017:13:53:29 +0000] "GET /api/atlas/v2/types/structdef/guid/blah HTTP/1.1"
404 - "-" "Java/1.7.0_80"
127.0.0.1 - - [26/Sep/2017:13:53:29 +0000] "GET /api/atlas/v2/types/classificationdef/name/blah
HTTP/1.1" 404 - "-" "Java/1.7.0_80"
127.0.0.1 - - [26/Sep/2017:13:53:29 +0000] "GET /api/atlas/v2/types/classificationdef/guid/blah
HTTP/1.1" 404 - "-" "Java/1.7.0_80"
127.0.0.1 - - [26/Sep/2017:13:53:29 +0000] "GET /api/atlas/v2/types/entitydef/name/blah HTTP/1.1"
404 - "-" "Java/1.7.0_80"
127.0.0.1 - - [26/Sep/2017:13:53:29 +0000] "GET /api/atlas/v2/types/entitydef/guid/blah HTTP/1.1"
404 - "-" "Java/1.7.0_80"
127.0.0.1 - - [26/Sep/2017:13:53:29 +0000] "POST /api/atlas/v2/types/typedefs/ HTTP/1.1" 200
- "-" "Java/1.7.0_80"
127.0.0.1 - - [26/Sep/2017:13:53:29 +0000] "PUT /api/atlas/v2/types/typedefs/ HTTP/1.1" 200
- "-" "Java/1.7.0_80"
127.0.0.1 - - [26/Sep/2017:13:53:29 +0000] "GET /api/atlas/v2/types/typedefs/?type=ENTITY
HTTP/1.1" 200 - "-" "Java/1.7.0_80"
127.0.0.1 - - [26/Sep/2017:13:53:29 +0000] "POST /api/atlas/v2/types/typedefs/ HTTP/1.1" 200
- "-" "Java/1.7.0_80"
127.0.0.1 - - [26/Sep/2017:13:53:30 +0000] "GET /api/atlas/v2/types/typedefs/?supertype=ABtxAG02ljs&type=CLASS
HTTP/1.1" 200 - "-" "Java/1.7.0_80"
127.0.0.1 - - [26/Sep/2017:13:53:30 +0000] "GET /api/atlas/v2/types/typedefs/?notsupertype=Bg9ejq0OE0z&supertype=ABtxAG02ljs&type=CLASS
HTTP/1.1" 200 - "-" "Java/1.7.0_80"
127.0.0.1 - - [26/Sep/2017:13:53:30 +0000] "POST /api/atlas/v2/types/typedefs/ HTTP/1.1" 200
- "-" "Java/1.7.0_80"
127.0.0.1 - - [26/Sep/2017:13:53:30 +0000] "POST /api/atlas/v2/types/typedefs/ HTTP/1.1" 409
- "-" "Java/1.7.0_80"
127.0.0.1 - - [26/Sep/2017:13:53:30 +0000] "POST /api/atlas/types HTTP/1.1" 201 - "-" "Java/1.7.0_80"
127.0.0.1 - - [26/Sep/2017:13:53:30 +0000] "POST /api/atlas/types HTTP/1.1" 409 - "-" "Java/1.7.0_80"
127.0.0.1 - - [26/Sep/2017:13:53:30 +0000] "GET /api/atlas/types/blah HTTP/1.1" 404 - "-"
"Java/1.7.0_80"
127.0.0.1 - - [26/Sep/2017:13:53:30 +0000] "GET /api/atlas/v2/types/typedef/name/class_trait
HTTP/1.1" 404 - "-" "Java/1.7.0_80"
127.0.0.1 - - [26/Sep/2017:13:53:30 +0000] "POST /api/atlas/types HTTP/1.1" 201 - "-" "Java/1.7.0_80"
127.0.0.1 - - [26/Sep/2017:13:53:30 +0000] "GET /api/atlas/v2/types/typedef/name/secure_trait
HTTP/1.1" 404 - "-" "Java/1.7.0_80"
127.0.0.1 - - [26/Sep/2017:13:53:30 +0000] "POST /api/atlas/types HTTP/1.1" 201 - "-" "Java/1.7.0_80"
127.0.0.1 - - [26/Sep/2017:13:53:30 +0000] "GET /api/atlas/v2/types/typedef/name/pii_trait
HTTP/1.1" 404 - "-" "Java/1.7.0_80"
127.0.0.1 - - [26/Sep/2017:13:53:30 +0000] "POST /api/atlas/types HTTP/1.1" 201 - "-" "Java/1.7.0_80"
127.0.0.1 - - [26/Sep/2017:13:53:30 +0000] "GET /api/atlas/v2/types/typedef/name/ssn_trait
HTTP/1.1" 404 - "-" "Java/1.7.0_80"
127.0.0.1 - - [26/Sep/2017:13:53:30 +0000] "POST /api/atlas/types HTTP/1.1" 201 - "-" "Java/1.7.0_80"
127.0.0.1 - - [26/Sep/2017:13:53:31 +0000] "GET /api/atlas/v2/types/typedef/name/salary_trait
HTTP/1.1" 404 - "-" "Java/1.7.0_80"
127.0.0.1 - - [26/Sep/2017:13:53:31 +0000] "POST /api/atlas/types HTTP/1.1" 201 - "-" "Java/1.7.0_80"
127.0.0.1 - - [26/Sep/2017:13:53:31 +0000] "GET /api/atlas/v2/types/typedef/name/sox_trait
HTTP/1.1" 404 - "-" "Java/1.7.0_80"
127.0.0.1 - - [26/Sep/2017:13:53:31 +0000] "POST /api/atlas/types HTTP/1.1" 201 - "-" "Java/1.7.0_80"
127.0.0.1 - - [26/Sep/2017:13:53:31 +0000] "GET /api/atlas/types?type=TRAIT HTTP/1.1" 200
- "-" "Java/1.7.0_80"
127.0.0.1 - - [26/Sep/2017:13:53:31 +0000] "GET /api/atlas/v2/types/typedef/name/ArbenGoIgHE
HTTP/1.1" 404 - "-" "Java/1.7.0_80"
127.0.0.1 - - [26/Sep/2017:13:53:31 +0000] "POST /api/atlas/types HTTP/1.1" 201 - "-" "Java/1.7.0_80"
127.0.0.1 - - [26/Sep/2017:13:53:31 +0000] "GET /api/atlas/v2/types/typedef/name/A1SR4kJVbGxq
HTTP/1.1" 404 - "-" "Java/1.7.0_80"
127.0.0.1 - - [26/Sep/2017:13:53:31 +0000] "POST /api/atlas/types HTTP/1.1" 201 - "-" "Java/1.7.0_80"
127.0.0.1 - - [26/Sep/2017:13:53:31 +0000] "GET /api/atlas/v2/types/typedef/name/BPbYYeYWGU1
HTTP/1.1" 404 - "-" "Java/1.7.0_80"
127.0.0.1 - - [26/Sep/2017:13:53:31 +0000] "POST /api/atlas/types HTTP/1.1" 201 - "-" "Java/1.7.0_80"
127.0.0.1 - - [26/Sep/2017:13:53:31 +0000] "GET /api/atlas/v2/types/typedef/name/CMTvqTgu4QX
HTTP/1.1" 404 - "-" "Java/1.7.0_80"
127.0.0.1 - - [26/Sep/2017:13:53:31 +0000] "POST /api/atlas/types HTTP/1.1" 201 - "-" "Java/1.7.0_80"
127.0.0.1 - - [26/Sep/2017:13:53:32 +0000] "GET /api/atlas/types?type=CLASS&supertype=ArbenGoIgHE&notsupertype=BPbYYeYWGU1
HTTP/1.1" 200 - "-" "Java/1.7.0_80"
127.0.0.1 - - [26/Sep/2017:13:53:32 +0000] "POST /api/atlas/types HTTP/1.1" 201 - "-" "Java/1.7.0_80"
127.0.0.1 - - [26/Sep/2017:13:53:32 +0000] "PUT /api/atlas/types HTTP/1.1" 200 - "-" "Java/1.7.0_80"
127.0.0.1 - - [26/Sep/2017:13:53:32 +0000] "GET /api/atlas/types/KXZ31bs1Ba HTTP/1.1" 200
- "-" "Java/1.7.0_80"
127.0.0.1 - - [26/Sep/2017:13:53:38 +0000] "POST /api/atlas/v2/types/typedefs/ HTTP/1.1" 409
- "-" "Java/1.7.0_80"
Tests run: 134, Failures: 1, Errors: 0, Skipped: 5, Time elapsed: 142.214 sec <<<
FAILURE! - in TestSuite
runQuickStart(org.apache.atlas.examples.QuickStartV2IT)  Time elapsed: 5.661 sec  <<<
FAILURE!
org.apache.atlas.AtlasServiceException: Metadata service API org.apache.atlas.AtlasBaseClient$APIInfo@f07a90a
failed with status 409 (Conflict) Response Body ({"errorCode":"ATLAS-409-00-001","errorMessage":"Given
type Dimension already exists"})
	at org.apache.atlas.examples.QuickStartV2IT.runQuickStart(QuickStartV2IT.java:49)


Results :

Failed tests: 
  QuickStartV2IT.runQuickStart:49 » AtlasService Metadata service API org.apache...

Tests run: 134, Failures: 1, Errors: 0, Skipped: 5

[INFO] 
[INFO] --- jetty-maven-plugin:9.2.12.v20150709:stop (stop-jetty) @ atlas-webapp ---
[INFO] Waiting 10 seconds for jetty to stop
[INFO] Stopped ServerConnector@1c65427e{HTTP/1.1}{0.0.0.0:31000}
[INFO] Closing Spring root WebApplicationContext
[INFO] Shutting down log4j
[INFO] Stopped o.e.j.m.p.JettyWebAppContext@4582fb49{/,<https://builds.apache.org/job/Atlas-0.8-IntegrationTests/ws/webapp/target/atlas-webapp-0.8.2-SNAPSHOT/,UNAVAILABLE}{/home/jenkins/jenkins-slave/workspace/Atlas-0.8-IntegrationTests/webapp/target/atlas-webapp-0.8.2-SNAPSHOT.war}>
[INFO] Server reports itself as stopped
[INFO] 
[INFO] --- maven-source-plugin:2.4:jar-no-fork (attach-sources) @ atlas-webapp ---
[INFO] Building jar: <https://builds.apache.org/job/Atlas-0.8-IntegrationTests/ws/webapp/target/atlas-webapp-0.8.2-SNAPSHOT-sources.jar>
log4j:WARN No appenders could be found for logger (org.apache.zookeeper.ClientCnxn).
log4j:WARN Please initialize the log4j system properly.
log4j:WARN See http://logging.apache.org/log4j/1.2/faq.html#noconfig for more info.
[INFO] 
[INFO] --- maven-source-plugin:2.4:test-jar-no-fork (attach-sources) @ atlas-webapp ---
[INFO] Building jar: <https://builds.apache.org/job/Atlas-0.8-IntegrationTests/ws/webapp/target/atlas-webapp-0.8.2-SNAPSHOT-test-sources.jar>
[INFO] 
[INFO] --- maven-failsafe-plugin:2.19.1:verify (verify) @ atlas-webapp ---
[INFO] ------------------------------------------------------------------------
[INFO] Reactor Summary:
[INFO] 
[INFO] Apache Atlas Server Build Tools .................... SUCCESS [  1.090 s]
[INFO] apache-atlas ....................................... SUCCESS [  5.497 s]
[INFO] Apache Atlas Integration ........................... SUCCESS [ 32.619 s]
[INFO] Apache Atlas Common ................................ SUCCESS [ 17.227 s]
[INFO] Apache Atlas Typesystem ............................ SUCCESS [01:14 min]
[INFO] Apache Atlas Client ................................ SUCCESS [ 20.496 s]
[INFO] Apache Atlas Server API ............................ SUCCESS [ 11.965 s]
[INFO] Apache Atlas Notification .......................... SUCCESS [ 19.657 s]
[INFO] Apache Atlas Graph Database Projects ............... SUCCESS [  0.774 s]
[INFO] Apache Atlas Graph Database API .................... SUCCESS [  9.264 s]
[INFO] Graph Database Common Code ......................... SUCCESS [  9.463 s]
[INFO] Apache Atlas Titan 1.0.0 GraphDB Impl .............. SUCCESS [ 34.156 s]
[INFO] Shaded version of Apache hbase client .............. SUCCESS [  9.475 s]
[INFO] Apache Atlas Titan 0.5.4 Graph DB Impl ............. SUCCESS [ 48.962 s]
[INFO] Apache Atlas Graph Database Implementation Dependencies SUCCESS [  0.741 s]
[INFO] Shaded version of Apache hbase server .............. SUCCESS [ 25.523 s]
[INFO] Apache Atlas Repository ............................ SUCCESS [02:13 min]
[INFO] Apache Atlas Authorization ......................... SUCCESS [ 14.009 s]
[INFO] Apache Atlas Business Catalog ...................... SUCCESS [ 19.247 s]
[INFO] Apache Atlas UI .................................... SUCCESS [01:48 min]
[INFO] Apache Atlas Web Application ....................... FAILURE [04:15 min]
[INFO] Apache Atlas Documentation ......................... SKIPPED
[INFO] Apache Atlas FileSystem Model ...................... SKIPPED
[INFO] Apache Atlas Plugin Classloader .................... SKIPPED
[INFO] Apache Atlas Hive Bridge Shim ...................... SKIPPED
[INFO] Apache Atlas Hive Bridge ........................... SKIPPED
[INFO] Apache Atlas Falcon Bridge Shim .................... SKIPPED
[INFO] Apache Atlas Falcon Bridge ......................... SKIPPED
[INFO] Apache Atlas Sqoop Bridge Shim ..................... SKIPPED
[INFO] Apache Atlas Sqoop Bridge .......................... SKIPPED
[INFO] Apache Atlas Storm Bridge Shim ..................... SKIPPED
[INFO] Apache Atlas Storm Bridge .......................... SKIPPED
[INFO] Apache Atlas Distribution .......................... SKIPPED
[INFO] ------------------------------------------------------------------------
[INFO] BUILD FAILURE
[INFO] ------------------------------------------------------------------------
[INFO] Total time: 14:14 min
[INFO] Finished at: 2017-09-26T13:53:41Z
[INFO] Final Memory: 355M/2137M
[INFO] ------------------------------------------------------------------------
[ERROR] Failed to execute goal org.apache.maven.plugins:maven-failsafe-plugin:2.19.1:verify
(verify) on project atlas-webapp: There are test failures.
[ERROR] 
[ERROR] Please refer to <https://builds.apache.org/job/Atlas-0.8-IntegrationTests/ws/webapp/target/failsafe-reports>
for the individual test results.
[ERROR] -> [Help 1]
[ERROR] 
[ERROR] To see the full stack trace of the errors, re-run Maven with the -e switch.
[ERROR] Re-run Maven using the -X switch to enable full debug logging.
[ERROR] 
[ERROR] For more information about the errors and possible solutions, please read the following
articles:
[ERROR] [Help 1] http://cwiki.apache.org/confluence/display/MAVEN/MojoFailureException
[ERROR] 
[ERROR] After correcting the problems, you can resume the build with the command
[ERROR]   mvn <goals> -rf :atlas-webapp
Build step 'Execute shell' marked build as failure
[CHECKSTYLE] Collecting checkstyle analysis files...
[CHECKSTYLE] Searching for all files in <https://builds.apache.org/job/Atlas-0.8-IntegrationTests/ws/>
that match the pattern **/target/checkstyle-result.xml
[CHECKSTYLE] Parsing 19 files in <https://builds.apache.org/job/Atlas-0.8-IntegrationTests/ws/>
[CHECKSTYLE] Successfully parsed file <https://builds.apache.org/job/Atlas-0.8-IntegrationTests/ws/authorization/target/checkstyle-result.xml>
with 467 unique warnings and 0 duplicates.
[CHECKSTYLE] Successfully parsed file <https://builds.apache.org/job/Atlas-0.8-IntegrationTests/ws/catalog/target/checkstyle-result.xml>
with 2604 unique warnings and 0 duplicates.
[CHECKSTYLE] Successfully parsed file <https://builds.apache.org/job/Atlas-0.8-IntegrationTests/ws/client/target/checkstyle-result.xml>
with 4242 unique warnings and 0 duplicates.
[CHECKSTYLE] Successfully parsed file <https://builds.apache.org/job/Atlas-0.8-IntegrationTests/ws/common/target/checkstyle-result.xml>
with 5450 unique warnings and 0 duplicates.
[CHECKSTYLE] Successfully parsed file <https://builds.apache.org/job/Atlas-0.8-IntegrationTests/ws/dashboardv2/target/checkstyle-result.xml>
with 5450 unique warnings and 0 duplicates.
[CHECKSTYLE] Successfully parsed file <https://builds.apache.org/job/Atlas-0.8-IntegrationTests/ws/graphdb/api/target/checkstyle-result.xml>
with 5723 unique warnings and 0 duplicates.
[CHECKSTYLE] Successfully parsed file <https://builds.apache.org/job/Atlas-0.8-IntegrationTests/ws/graphdb/common/target/checkstyle-result.xml>
with 5910 unique warnings and 0 duplicates.
[CHECKSTYLE] Successfully parsed file <https://builds.apache.org/job/Atlas-0.8-IntegrationTests/ws/graphdb/graphdb-impls/target/checkstyle-result.xml>
with 5910 unique warnings and 0 duplicates.
[CHECKSTYLE] Successfully parsed file <https://builds.apache.org/job/Atlas-0.8-IntegrationTests/ws/graphdb/target/checkstyle-result.xml>
with 5910 unique warnings and 0 duplicates.
[CHECKSTYLE] Successfully parsed file <https://builds.apache.org/job/Atlas-0.8-IntegrationTests/ws/graphdb/titan0/target/checkstyle-result.xml>
with 8312 unique warnings and 0 duplicates.
[CHECKSTYLE] Successfully parsed file <https://builds.apache.org/job/Atlas-0.8-IntegrationTests/ws/graphdb/titan1/target/checkstyle-result.xml>
with 9279 unique warnings and 0 duplicates.
[CHECKSTYLE] Successfully parsed file <https://builds.apache.org/job/Atlas-0.8-IntegrationTests/ws/intg/target/checkstyle-result.xml>
with 15728 unique warnings and 0 duplicates.
[CHECKSTYLE] Successfully parsed file <https://builds.apache.org/job/Atlas-0.8-IntegrationTests/ws/notification/target/checkstyle-result.xml>
with 16938 unique warnings and 0 duplicates.
[CHECKSTYLE] Successfully parsed file <https://builds.apache.org/job/Atlas-0.8-IntegrationTests/ws/repository/target/checkstyle-result.xml>
with 35859 unique warnings and 0 duplicates.
[CHECKSTYLE] Successfully parsed file <https://builds.apache.org/job/Atlas-0.8-IntegrationTests/ws/server-api/target/checkstyle-result.xml>
with 36238 unique warnings and 0 duplicates.
[CHECKSTYLE] Successfully parsed file <https://builds.apache.org/job/Atlas-0.8-IntegrationTests/ws/shaded/hbase-client-shaded/target/checkstyle-result.xml>
with 36238 unique warnings and 0 duplicates.
[CHECKSTYLE] Successfully parsed file <https://builds.apache.org/job/Atlas-0.8-IntegrationTests/ws/shaded/hbase-server-shaded/target/checkstyle-result.xml>
with 36238 unique warnings and 0 duplicates.
[CHECKSTYLE] Successfully parsed file <https://builds.apache.org/job/Atlas-0.8-IntegrationTests/ws/target/checkstyle-result.xml>
with 36238 unique warnings and 0 duplicates.
[CHECKSTYLE] Successfully parsed file <https://builds.apache.org/job/Atlas-0.8-IntegrationTests/ws/typesystem/target/checkstyle-result.xml>
with 40456 unique warnings and 0 duplicates.
<Git Blamer> Using GitBlamer to create author and commit information for all warnings.
<Git Blamer> GIT_COMMIT=36c2e3c09724e1870ef707e776a048e07df84e8b, workspace=<https://builds.apache.org/job/Atlas-0.8-IntegrationTests/ws/>
 > git rev-parse 36c2e3c09724e1870ef707e776a048e07df84e8b^{commit} # timeout=10
[FINDBUGS] Collecting findbugs analysis files...
[FINDBUGS] Searching for all files in <https://builds.apache.org/job/Atlas-0.8-IntegrationTests/ws/>
that match the pattern **/target/findbugs.xml
[FINDBUGS] Parsing 12 files in <https://builds.apache.org/job/Atlas-0.8-IntegrationTests/ws/>
[FINDBUGS] Successfully parsed file <https://builds.apache.org/job/Atlas-0.8-IntegrationTests/ws/authorization/target/findbugs.xml>
with 0 unique warnings and 0 duplicates.
[FINDBUGS] Successfully parsed file <https://builds.apache.org/job/Atlas-0.8-IntegrationTests/ws/catalog/target/findbugs.xml>
with 0 unique warnings and 0 duplicates.
[FINDBUGS] Successfully parsed file <https://builds.apache.org/job/Atlas-0.8-IntegrationTests/ws/client/target/findbugs.xml>
with 0 unique warnings and 0 duplicates.
[FINDBUGS] Successfully parsed file <https://builds.apache.org/job/Atlas-0.8-IntegrationTests/ws/common/target/findbugs.xml>
with 0 unique warnings and 0 duplicates.
[FINDBUGS] Successfully parsed file <https://builds.apache.org/job/Atlas-0.8-IntegrationTests/ws/graphdb/api/target/findbugs.xml>
with 0 unique warnings and 0 duplicates.
[FINDBUGS] Successfully parsed file <https://builds.apache.org/job/Atlas-0.8-IntegrationTests/ws/graphdb/common/target/findbugs.xml>
with 0 unique warnings and 0 duplicates.
[FINDBUGS] Successfully parsed file <https://builds.apache.org/job/Atlas-0.8-IntegrationTests/ws/graphdb/titan0/target/findbugs.xml>
with 0 unique warnings and 0 duplicates.
[FINDBUGS] Successfully parsed file <https://builds.apache.org/job/Atlas-0.8-IntegrationTests/ws/intg/target/findbugs.xml>
with 0 unique warnings and 0 duplicates.
[FINDBUGS] Successfully parsed file <https://builds.apache.org/job/Atlas-0.8-IntegrationTests/ws/notification/target/findbugs.xml>
with 0 unique warnings and 0 duplicates.
[FINDBUGS] Successfully parsed file <https://builds.apache.org/job/Atlas-0.8-IntegrationTests/ws/repository/target/findbugs.xml>
with 0 unique warnings and 0 duplicates.
[FINDBUGS] Successfully parsed file <https://builds.apache.org/job/Atlas-0.8-IntegrationTests/ws/server-api/target/findbugs.xml>
with 0 unique warnings and 0 duplicates.
[FINDBUGS] Successfully parsed file <https://builds.apache.org/job/Atlas-0.8-IntegrationTests/ws/typesystem/target/findbugs.xml>
with 0 unique warnings and 0 duplicates.
<Git Blamer> Using GitBlamer to create author and commit information for all warnings.
<Git Blamer> GIT_COMMIT=36c2e3c09724e1870ef707e776a048e07df84e8b, workspace=<https://builds.apache.org/job/Atlas-0.8-IntegrationTests/ws/>
Archiving artifacts
[Fast Archiver] No prior successful build to compare, so performing full copy of artifacts
TestNG Reports Processing: START
Looking for TestNG results report in workspace using pattern: **/target/surefire-reports/testng-results.xml,**/target/failsafe-reports/testng-results.xml
Saving reports...
Processing '/x1/jenkins/jenkins-home/jobs/Atlas-0.8-IntegrationTests/builds/82/testng/testng-results.xml'
TestNG Reports Processing: FINISH

Mime
View raw message