atlas-dev mailing list archives

Site index · List index
Message view « Date » · « Thread »
Top « Date » · « Thread »
From Apache Jenkins Server <jenk...@builds.apache.org>
Subject Build failed in Jenkins: Atlas-master-UnitTests #92
Date Fri, 22 Sep 2017 13:45:11 GMT
See <https://builds.apache.org/job/Atlas-master-UnitTests/92/display/redirect?page=changes>

Changes:

[kbhatt] ATLAS-2039 : Unable to edit date value from UI when entity definition is

[kbhatt] ATLAS-1905 : Search UI is confusing to user

[kbhatt] ATLAS-2162 : Add hyperlink for URI formatted attribute value on property

------------------------------------------
[...truncated 261.56 KB...]
Running org.apache.atlas.lineage.EntityLineageServiceTest
Running org.apache.atlas.discovery.DataSetLineageServiceTest
Running org.apache.atlas.RepositoryServiceLoadingTest
Running org.apache.atlas.repository.store.graph.v1.HardDeleteHandlerV1Test
Running org.apache.atlas.util.CompiledQueryCacheKeyTest
Running org.apache.atlas.services.MetricsServiceTest
Running org.apache.atlas.service.StoreBackedTypeCacheMetadataServiceTest
Running org.apache.atlas.discovery.EntityDiscoveryServiceTest
Running org.apache.atlas.repository.store.graph.v1.AtlasRelationshipStoreV1Test
Running org.apache.atlas.repository.store.graph.v1.InverseReferenceUpdateSoftDeleteV1Test
Running org.apache.atlas.repository.store.graph.v1.AtlasRelationshipStoreHardDeleteV1Test
Running org.apache.atlas.repository.store.graph.v1.AtlasEntityStoreV1Test
Running org.apache.atlas.repository.store.graph.v1.AtlasEntityDefStoreV1Test
Running org.apache.atlas.repository.store.graph.v1.AtlasRelationshipDefStoreV1Test
Running org.apache.atlas.repository.store.graph.v1.AtlasRelationshipStoreSoftDeleteV1Test
Running org.apache.atlas.repository.store.graph.v1.InverseReferenceUpdateV1Test
Running org.apache.atlas.repository.store.graph.v1.SoftDeleteHandlerV1Test
Running org.apache.atlas.repository.store.graph.v1.AtlasDeleteHandlerV1Test
Running org.apache.atlas.repository.store.graph.v1.InverseReferenceUpdateHardDeleteV1Test
Tests run: 0, Failures: 0, Errors: 0, Skipped: 0, Time elapsed: 34.393 sec - in org.apache.atlas.query.BaseGremlinTest
Running org.apache.atlas.repository.store.graph.AtlasTypeDefGraphStoreTest
Tests run: 1, Failures: 0, Errors: 0, Skipped: 0, Time elapsed: 36.909 sec - in org.apache.atlas.query.LexerTest
Tests run: 14, Failures: 0, Errors: 0, Skipped: 0, Time elapsed: 37.453 sec - in org.apache.atlas.query.ParserTest
Tests run: 0, Failures: 0, Errors: 0, Skipped: 0, Time elapsed: 37.053 sec - in org.apache.atlas.TestModules
Tests run: 9, Failures: 0, Errors: 0, Skipped: 0, Time elapsed: 37.98 sec - in org.apache.atlas.utils.ObjectUpdateSynchronizerTest
Running org.apache.atlas.repository.typestore.GraphBackedTypeStoreTest
Running org.apache.atlas.repository.typestore.StoreBackedTypeCacheTest
Tests run: 0, Failures: 0, Errors: 0, Skipped: 0, Time elapsed: 36.766 sec - in org.apache.atlas.repository.store.graph.v1.InverseReferenceUpdateV1Test
Tests run: 0, Failures: 0, Errors: 0, Skipped: 0, Time elapsed: 38.618 sec - in org.apache.atlas.BaseRepositoryTest
Running org.apache.atlas.repository.graph.Gremlin2QueryOptimizerTest
Running org.apache.atlas.repository.graph.AbstractGremlinQueryOptimizerTest
Tests run: 5, Failures: 0, Errors: 0, Skipped: 0, Time elapsed: 40.005 sec - in org.apache.atlas.query.QueryProcessorTest
Tests run: 0, Failures: 0, Errors: 0, Skipped: 0, Time elapsed: 38.053 sec - in org.apache.atlas.repository.store.graph.v1.AtlasRelationshipStoreV1Test
Tests run: 19, Failures: 0, Errors: 0, Skipped: 0, Time elapsed: 41.215 sec - in org.apache.atlas.query.ExpressionTest
Running org.apache.atlas.repository.graph.TestIntSequence
Running org.apache.atlas.repository.graph.GraphBackedSearchIndexerTest
Tests run: 0, Failures: 0, Errors: 0, Skipped: 0, Time elapsed: 38.177 sec - in org.apache.atlas.repository.store.graph.v1.AtlasDeleteHandlerV1Test
Running org.apache.atlas.repository.graph.ReverseReferenceUpdateHardDeleteTest
Running org.apache.atlas.repository.graph.GraphRepoMapperScaleTest
Running org.apache.atlas.repository.graph.GraphHelperTest
Running org.apache.atlas.repository.graph.Gremlin3QueryOptimizerTest
Tests run: 5, Failures: 0, Errors: 0, Skipped: 0, Time elapsed: 41.361 sec - in org.apache.atlas.util.CompiledQueryCacheKeyTest
Tests run: 9, Failures: 0, Errors: 0, Skipped: 0, Time elapsed: 42.793 sec - in org.apache.atlas.repository.store.graph.v1.AtlasEntityStoreV1BulkImportPercentTest
Running org.apache.atlas.repository.graph.ReverseReferenceUpdateSoftDeleteTest
Running org.apache.atlas.repository.graph.GraphBackedRepositoryHardDeleteTest
Tests run: 0, Failures: 0, Errors: 0, Skipped: 0, Time elapsed: 47.733 sec - in org.apache.atlas.discovery.DataSetLineageServiceTest
Tests run: 1, Failures: 0, Errors: 0, Skipped: 0, Time elapsed: 47.621 sec - in org.apache.atlas.services.MetricsServiceTest
Running org.apache.atlas.repository.graph.GraphBackedSearchIndexerMockTest
Running org.apache.atlas.repository.graph.GraphBackedRepositorySoftDeleteTest
Tests run: 1, Failures: 0, Errors: 0, Skipped: 0, Time elapsed: 53.625 sec - in org.apache.atlas.RepositoryServiceLoadingTest
Running org.apache.atlas.repository.graph.GraphHelperMockTest
Tests run: 6, Failures: 0, Errors: 0, Skipped: 0, Time elapsed: 55.405 sec - in org.apache.atlas.discovery.EntityDiscoveryServiceTest
Running org.apache.atlas.repository.graph.GraphBackedMetadataRepositoryTest
Tests run: 1, Failures: 0, Errors: 0, Skipped: 0, Time elapsed: 57.626 sec - in org.apache.atlas.repository.store.graph.v1.AtlasEntityDefStoreV1Test
Tests run: 10, Failures: 0, Errors: 0, Skipped: 0, Time elapsed: 59.69 sec - in org.apache.atlas.repository.store.graph.v1.AtlasRelationshipDefStoreV1Test
Running org.apache.atlas.repository.userprofile.UserProfileServiceTest
Running org.apache.atlas.repository.impexp.ImportTransformerJSONTest
Tests run: 0, Failures: 0, Errors: 0, Skipped: 0, Time elapsed: 36.204 sec - in org.apache.atlas.repository.graph.AbstractGremlinQueryOptimizerTest
Tests run: 0, Failures: 0, Errors: 0, Skipped: 0, Time elapsed: 36.488 sec - in org.apache.atlas.repository.graph.TestIntSequence
Running org.apache.atlas.repository.impexp.ImportTransformsTest
Tests run: 3, Failures: 0, Errors: 0, Skipped: 0, Time elapsed: 77.084 sec - in org.apache.atlas.service.StoreBackedTypeCacheMetadataServiceTest
Running org.apache.atlas.repository.impexp.ExportServiceTest
Running org.apache.atlas.repository.impexp.UniqueListTest
Tests run: 33, Failures: 0, Errors: 0, Skipped: 0, Time elapsed: 42.025 sec - in org.apache.atlas.repository.graph.Gremlin2QueryOptimizerTest
Tests run: 33, Failures: 0, Errors: 0, Skipped: 0, Time elapsed: 39.312 sec - in org.apache.atlas.repository.graph.Gremlin3QueryOptimizerTest
Running org.apache.atlas.repository.impexp.AtlasImportRequestTest
Running org.apache.atlas.repository.impexp.ZipSinkTest
Tests run: 3, Failures: 0, Errors: 0, Skipped: 0, Time elapsed: 36.197 sec - in org.apache.atlas.repository.graph.GraphBackedSearchIndexerMockTest
Running org.apache.atlas.repository.impexp.ZipSourceTest
Tests run: 5, Failures: 0, Errors: 0, Skipped: 0, Time elapsed: 89.405 sec - in org.apache.atlas.repository.store.graph.v1.AtlasRelationshipStoreSoftDeleteV1Test
Tests run: 5, Failures: 0, Errors: 0, Skipped: 0, Time elapsed: 51.137 sec - in org.apache.atlas.repository.graph.GraphBackedSearchIndexerTest
Tests run: 5, Failures: 0, Errors: 0, Skipped: 0, Time elapsed: 89.99 sec - in org.apache.atlas.repository.store.graph.v1.AtlasRelationshipStoreHardDeleteV1Test
Tests run: 5, Failures: 0, Errors: 0, Skipped: 0, Time elapsed: 89.653 sec - in org.apache.atlas.repository.store.graph.v1.InverseReferenceUpdateHardDeleteV1Test
Running org.apache.atlas.repository.impexp.TypeAttributeDifferenceTest
Running org.apache.atlas.repository.impexp.ImportServiceTest
Running org.apache.atlas.repository.impexp.ImportTransformerTest
Tests run: 5, Failures: 0, Errors: 0, Skipped: 0, Time elapsed: 91.544 sec - in org.apache.atlas.repository.store.graph.v1.InverseReferenceUpdateSoftDeleteV1Test
Running org.apache.atlas.repository.audit.HBaseBasedAuditRepositoryTest
Tests run: 5, Failures: 0, Errors: 0, Skipped: 0, Time elapsed: 55.943 sec - in org.apache.atlas.repository.typestore.GraphBackedTypeStoreTest
Running org.apache.atlas.repository.audit.InMemoryAuditRepositoryTest
Running org.apache.atlas.repository.audit.HBaseBasedAuditRepositoryHATest
Tests run: 2, Failures: 0, Errors: 0, Skipped: 0, Time elapsed: 57.369 sec - in org.apache.atlas.repository.typestore.StoreBackedTypeCacheTest
Tests run: 5, Failures: 0, Errors: 0, Skipped: 0, Time elapsed: 97.066 sec - in org.apache.atlas.query.LineageQueryTest
Running org.apache.atlas.repository.BaseTest
Running org.apache.atlas.TestUtils
Tests run: 2, Failures: 0, Errors: 0, Skipped: 0, Time elapsed: 42.054 sec - in org.apache.atlas.repository.graph.GraphHelperMockTest
Tests run: 1, Failures: 0, Errors: 0, Skipped: 0, Time elapsed: 36.299 sec - in org.apache.atlas.repository.impexp.ImportTransformerJSONTest
Tests run: 5, Failures: 0, Errors: 0, Skipped: 0, Time elapsed: 63.406 sec - in org.apache.atlas.repository.graph.ReverseReferenceUpdateHardDeleteTest
Tests run: 5, Failures: 0, Errors: 0, Skipped: 0, Time elapsed: 64.685 sec - in org.apache.atlas.repository.graph.ReverseReferenceUpdateSoftDeleteTest
Tests run: 3, Failures: 0, Errors: 0, Skipped: 0, Time elapsed: 31.43 sec - in org.apache.atlas.repository.impexp.ImportTransformsTest
Tests run: 14, Failures: 0, Errors: 0, Skipped: 0, Time elapsed: 110.448 sec - in org.apache.atlas.repository.store.graph.v1.AtlasEntityStoreV1Test
Tests run: 4, Failures: 0, Errors: 0, Skipped: 0, Time elapsed: 33.046 sec - in org.apache.atlas.repository.impexp.UniqueListTest
Tests run: 21, Failures: 0, Errors: 0, Skipped: 0, Time elapsed: 114.226 sec - in org.apache.atlas.query.GremlinTest
Tests run: 8, Failures: 0, Errors: 0, Skipped: 0, Time elapsed: 33.819 sec - in org.apache.atlas.repository.impexp.ZipSinkTest
Tests run: 14, Failures: 0, Errors: 0, Skipped: 0, Time elapsed: 77.233 sec - in org.apache.atlas.repository.graph.GraphHelperTest
Tests run: 6, Failures: 0, Errors: 0, Skipped: 0, Time elapsed: 36.643 sec - in org.apache.atlas.repository.impexp.AtlasImportRequestTest
Tests run: 6, Failures: 0, Errors: 0, Skipped: 0, Time elapsed: 32.395 sec - in org.apache.atlas.repository.impexp.ZipSourceTest
Tests run: 11, Failures: 0, Errors: 0, Skipped: 0, Time elapsed: 119.521 sec - in org.apache.atlas.repository.store.graph.v1.HardDeleteHandlerV1Test
Tests run: 8, Failures: 0, Errors: 0, Skipped: 0, Time elapsed: 30.166 sec - in org.apache.atlas.repository.impexp.ImportTransformerTest
Tests run: 6, Failures: 0, Errors: 0, Skipped: 0, Time elapsed: 31.908 sec - in org.apache.atlas.repository.impexp.TypeAttributeDifferenceTest
Tests run: 2, Failures: 0, Errors: 0, Skipped: 0, Time elapsed: 29.634 sec - in org.apache.atlas.repository.audit.HBaseBasedAuditRepositoryHATest
Tests run: 3, Failures: 0, Errors: 0, Skipped: 0, Time elapsed: 31.8 sec - in org.apache.atlas.repository.audit.InMemoryAuditRepositoryTest
Tests run: 0, Failures: 0, Errors: 0, Skipped: 0, Time elapsed: 29.095 sec - in org.apache.atlas.repository.BaseTest
Tests run: 0, Failures: 0, Errors: 0, Skipped: 0, Time elapsed: 29.655 sec - in org.apache.atlas.TestUtils
Tests run: 11, Failures: 0, Errors: 0, Skipped: 0, Time elapsed: 126.128 sec - in org.apache.atlas.repository.store.graph.v1.SoftDeleteHandlerV1Test
Tests run: 23, Failures: 0, Errors: 0, Skipped: 0, Time elapsed: 128.659 sec - in org.apache.atlas.lineage.EntityLineageServiceTest
Tests run: 17, Failures: 0, Errors: 0, Skipped: 0, Time elapsed: 96.303 sec - in org.apache.atlas.repository.store.graph.AtlasTypeDefGraphStoreTest
Tests run: 26, Failures: 0, Errors: 0, Skipped: 0, Time elapsed: 133.148 sec - in org.apache.atlas.service.DefaultMetadataServiceTest
Tests run: 11, Failures: 0, Errors: 0, Skipped: 0, Time elapsed: 72.521 sec - in org.apache.atlas.repository.userprofile.UserProfileServiceTest
Tests run: 21, Failures: 0, Errors: 0, Skipped: 0, Time elapsed: 90.076 sec - in org.apache.atlas.repository.graph.GraphBackedRepositoryHardDeleteTest
Tests run: 30, Failures: 0, Errors: 0, Skipped: 0, Time elapsed: 79.005 sec - in org.apache.atlas.repository.graph.GraphBackedMetadataRepositoryTest
Tests run: 21, Failures: 0, Errors: 0, Skipped: 0, Time elapsed: 89.034 sec - in org.apache.atlas.repository.graph.GraphBackedRepositorySoftDeleteTest
Tests run: 10, Failures: 0, Errors: 0, Skipped: 0, Time elapsed: 70.177 sec - in org.apache.atlas.repository.impexp.ExportServiceTest
Tests run: 4, Failures: 0, Errors: 0, Skipped: 0, Time elapsed: 57.402 sec - in org.apache.atlas.repository.audit.HBaseBasedAuditRepositoryTest
Tests run: 9, Failures: 1, Errors: 0, Skipped: 0, Time elapsed: 68.768 sec <<< FAILURE!
- in org.apache.atlas.repository.impexp.ImportServiceTest
importCTAS(org.apache.atlas.repository.impexp.ImportServiceTest)  Time elapsed: 5.859 sec
 <<< FAILURE!
org.apache.atlas.exception.AtlasBaseException: Given instance is invalid/not found: Could
not find entities in the repository with guids: [73cb606c-6846-4718-a859-40c9c17e0b32]
	at org.apache.atlas.repository.converters.AtlasInstanceConverter.toAtlasBaseException(AtlasInstanceConverter.java:213)
	at org.apache.atlas.repository.converters.AtlasInstanceConverter.getITypedReferenceable(AtlasInstanceConverter.java:115)
	at org.apache.atlas.repository.store.graph.v1.AtlasEntityChangeNotifier.toITypedReferenceable(AtlasEntityChangeNotifier.java:184)
	at org.apache.atlas.repository.store.graph.v1.AtlasEntityChangeNotifier.notifyListeners(AtlasEntityChangeNotifier.java:158)
	at org.apache.atlas.repository.store.graph.v1.AtlasEntityChangeNotifier.onEntitiesMutated(AtlasEntityChangeNotifier.java:84)
	at org.apache.atlas.repository.store.graph.v1.AtlasEntityStoreV1.createOrUpdate(AtlasEntityStoreV1.java:165)
	at org.apache.atlas.repository.store.graph.v1.AtlasEntityStoreV1.createOrUpdateForImport(AtlasEntityStoreV1.java:179)
	at org.apache.atlas.GraphTransactionInterceptor.invoke(GraphTransactionInterceptor.java:60)
	at org.apache.atlas.repository.store.graph.v1.BulkImporterImpl.bulkImport(BulkImporterImpl.java:82)
	at org.apache.atlas.repository.impexp.ImportService.processEntities(ImportService.java:161)
	at org.apache.atlas.repository.impexp.ImportService.run(ImportService.java:82)
	at org.apache.atlas.repository.impexp.ImportService.run(ImportService.java:61)
	at org.apache.atlas.repository.impexp.ZipFileResourceTestUtils.runImportWithNoParameters(ZipFileResourceTestUtils.java:209)
	at org.apache.atlas.repository.impexp.ImportServiceTest.importCTAS(ImportServiceTest.java:168)

Tests run: 338, Failures: 0, Errors: 0, Skipped: 0, Time elapsed: 304.493 sec - in org.apache.atlas.discovery.GraphBackedDiscoveryServiceTest
Tests run: 2, Failures: 0, Errors: 0, Skipped: 0, Time elapsed: 301.552 sec - in org.apache.atlas.repository.graph.GraphRepoMapperScaleTest

Results :

Failed tests: 
  ImportServiceTest.importCTAS:168 » AtlasBase Given instance is invalid/not fou...

Tests run: 832, Failures: 1, Errors: 0, Skipped: 0

[INFO] ------------------------------------------------------------------------
[INFO] Reactor Summary:
[INFO] 
[INFO] Apache Atlas Server Build Tools .................... SUCCESS [  1.164 s]
[INFO] apache-atlas ....................................... SUCCESS [  4.736 s]
[INFO] Apache Atlas Integration ........................... SUCCESS [ 36.230 s]
[INFO] Apache Atlas Common ................................ SUCCESS [ 17.496 s]
[INFO] Apache Atlas Typesystem ............................ SUCCESS [01:21 min]
[INFO] Apache Atlas Client ................................ SUCCESS [ 19.743 s]
[INFO] Apache Atlas Server API ............................ SUCCESS [ 10.197 s]
[INFO] Apache Atlas Notification .......................... SUCCESS [ 27.820 s]
[INFO] Apache Atlas Graph Database Projects ............... SUCCESS [  0.737 s]
[INFO] Apache Atlas Graph Database API .................... SUCCESS [  8.851 s]
[INFO] Graph Database Common Code ......................... SUCCESS [  8.149 s]
[INFO] Apache Atlas Titan 1.0.0 GraphDB Impl .............. SUCCESS [ 34.697 s]
[INFO] Shaded version of Apache hbase client .............. SUCCESS [  8.683 s]
[INFO] Apache Atlas Titan 0.5.4 Graph DB Impl ............. SUCCESS [01:28 min]
[INFO] Apache Atlas Graph Database Implementation Dependencies SUCCESS [  0.869 s]
[INFO] Shaded version of Apache hbase server .............. SUCCESS [ 27.855 s]
[INFO] Apache Atlas Repository ............................ FAILURE [06:53 min]
[INFO] Apache Atlas Authorization ......................... SKIPPED
[INFO] Apache Atlas Business Catalog ...................... SKIPPED
[INFO] Apache Atlas UI .................................... SKIPPED
[INFO] Apache Atlas Web Application ....................... SKIPPED
[INFO] Apache Atlas Documentation ......................... SKIPPED
[INFO] Apache Atlas FileSystem Model ...................... SKIPPED
[INFO] Apache Atlas Plugin Classloader .................... SKIPPED
[INFO] Apache Atlas Hive Bridge Shim ...................... SKIPPED
[INFO] Apache Atlas Hive Bridge ........................... SKIPPED
[INFO] Apache Atlas Falcon Bridge Shim .................... SKIPPED
[INFO] Apache Atlas Falcon Bridge ......................... SKIPPED
[INFO] Apache Atlas Sqoop Bridge Shim ..................... SKIPPED
[INFO] Apache Atlas Sqoop Bridge .......................... SKIPPED
[INFO] Apache Atlas Storm Bridge Shim ..................... SKIPPED
[INFO] Apache Atlas Storm Bridge .......................... SKIPPED
[INFO] Apache Atlas Distribution .......................... SKIPPED
[INFO] ------------------------------------------------------------------------
[INFO] BUILD FAILURE
[INFO] ------------------------------------------------------------------------
[INFO] Total time: 13:12 min
[INFO] Finished at: 2017-09-22T13:39:41Z
[INFO] Final Memory: 154M/1792M
[INFO] ------------------------------------------------------------------------
[ERROR] Failed to execute goal org.apache.maven.plugins:maven-surefire-plugin:2.18.1:test
(default-test) on project atlas-repository: There are test failures.
[ERROR] 
[ERROR] Please refer to <https://builds.apache.org/job/Atlas-master-UnitTests/ws/repository/target/surefire-reports>
for the individual test results.
[ERROR] -> [Help 1]
[ERROR] 
[ERROR] To see the full stack trace of the errors, re-run Maven with the -e switch.
[ERROR] Re-run Maven using the -X switch to enable full debug logging.
[ERROR] 
[ERROR] For more information about the errors and possible solutions, please read the following
articles:
[ERROR] [Help 1] http://cwiki.apache.org/confluence/display/MAVEN/MojoFailureException
[ERROR] 
[ERROR] After correcting the problems, you can resume the build with the command
[ERROR]   mvn <goals> -rf :atlas-repository
Build step 'Execute shell' marked build as failure
[CHECKSTYLE] Collecting checkstyle analysis files...
[CHECKSTYLE] Searching for all files in <https://builds.apache.org/job/Atlas-master-UnitTests/ws/>
that match the pattern **/target/checkstyle-result.xml
[CHECKSTYLE] Parsing 15 files in <https://builds.apache.org/job/Atlas-master-UnitTests/ws/>
[CHECKSTYLE] Successfully parsed file <https://builds.apache.org/job/Atlas-master-UnitTests/ws/client/target/checkstyle-result.xml>
with 1637 unique warnings and 0 duplicates.
[CHECKSTYLE] Successfully parsed file <https://builds.apache.org/job/Atlas-master-UnitTests/ws/common/target/checkstyle-result.xml>
with 2851 unique warnings and 0 duplicates.
[CHECKSTYLE] Successfully parsed file <https://builds.apache.org/job/Atlas-master-UnitTests/ws/graphdb/api/target/checkstyle-result.xml>
with 3120 unique warnings and 0 duplicates.
[CHECKSTYLE] Successfully parsed file <https://builds.apache.org/job/Atlas-master-UnitTests/ws/graphdb/common/target/checkstyle-result.xml>
with 3307 unique warnings and 0 duplicates.
[CHECKSTYLE] Successfully parsed file <https://builds.apache.org/job/Atlas-master-UnitTests/ws/graphdb/graphdb-impls/target/checkstyle-result.xml>
with 3307 unique warnings and 0 duplicates.
[CHECKSTYLE] Successfully parsed file <https://builds.apache.org/job/Atlas-master-UnitTests/ws/graphdb/target/checkstyle-result.xml>
with 3307 unique warnings and 0 duplicates.
[CHECKSTYLE] Successfully parsed file <https://builds.apache.org/job/Atlas-master-UnitTests/ws/graphdb/titan0/target/checkstyle-result.xml>
with 5692 unique warnings and 0 duplicates.
[CHECKSTYLE] Successfully parsed file <https://builds.apache.org/job/Atlas-master-UnitTests/ws/graphdb/titan1/target/checkstyle-result.xml>
with 6640 unique warnings and 0 duplicates.
[CHECKSTYLE] Successfully parsed file <https://builds.apache.org/job/Atlas-master-UnitTests/ws/intg/target/checkstyle-result.xml>
with 14589 unique warnings and 0 duplicates.
[CHECKSTYLE] Successfully parsed file <https://builds.apache.org/job/Atlas-master-UnitTests/ws/notification/target/checkstyle-result.xml>
with 15799 unique warnings and 0 duplicates.
[CHECKSTYLE] Successfully parsed file <https://builds.apache.org/job/Atlas-master-UnitTests/ws/server-api/target/checkstyle-result.xml>
with 16178 unique warnings and 0 duplicates.
[CHECKSTYLE] Successfully parsed file <https://builds.apache.org/job/Atlas-master-UnitTests/ws/shaded/hbase-client-shaded/target/checkstyle-result.xml>
with 16178 unique warnings and 0 duplicates.
[CHECKSTYLE] Successfully parsed file <https://builds.apache.org/job/Atlas-master-UnitTests/ws/shaded/hbase-server-shaded/target/checkstyle-result.xml>
with 16178 unique warnings and 0 duplicates.
[CHECKSTYLE] Successfully parsed file <https://builds.apache.org/job/Atlas-master-UnitTests/ws/target/checkstyle-result.xml>
with 16178 unique warnings and 0 duplicates.
[CHECKSTYLE] Successfully parsed file <https://builds.apache.org/job/Atlas-master-UnitTests/ws/typesystem/target/checkstyle-result.xml>
with 20396 unique warnings and 0 duplicates.
<Git Blamer> Using GitBlamer to create author and commit information for all warnings.
<Git Blamer> GIT_COMMIT=30138316734373b83f9fb1cdb59857bbfa6bb9fa, workspace=<https://builds.apache.org/job/Atlas-master-UnitTests/ws/>
 > git rev-parse 30138316734373b83f9fb1cdb59857bbfa6bb9fa^{commit} # timeout=10
<Git Blamer> Skipping file <https://builds.apache.org/job/Atlas-master-UnitTests/ws/graphdb/titan1/src/main/java/org/apache/atlas/repository/graphdb/titan1/graphson/AtlasGraphSONMode.java,>
no result found.
[CHECKSTYLE] Computing warning deltas based on reference build #59
[FINDBUGS] Collecting findbugs analysis files...
[FINDBUGS] Searching for all files in <https://builds.apache.org/job/Atlas-master-UnitTests/ws/>
that match the pattern **/target/findbugs.xml
[FINDBUGS] Parsing 9 files in <https://builds.apache.org/job/Atlas-master-UnitTests/ws/>
[FINDBUGS] Successfully parsed file <https://builds.apache.org/job/Atlas-master-UnitTests/ws/client/target/findbugs.xml>
with 0 unique warnings and 0 duplicates.
[FINDBUGS] Successfully parsed file <https://builds.apache.org/job/Atlas-master-UnitTests/ws/common/target/findbugs.xml>
with 0 unique warnings and 0 duplicates.
[FINDBUGS] Successfully parsed file <https://builds.apache.org/job/Atlas-master-UnitTests/ws/graphdb/api/target/findbugs.xml>
with 0 unique warnings and 0 duplicates.
[FINDBUGS] Successfully parsed file <https://builds.apache.org/job/Atlas-master-UnitTests/ws/graphdb/common/target/findbugs.xml>
with 0 unique warnings and 0 duplicates.
[FINDBUGS] Successfully parsed file <https://builds.apache.org/job/Atlas-master-UnitTests/ws/graphdb/titan0/target/findbugs.xml>
with 0 unique warnings and 0 duplicates.
[FINDBUGS] Successfully parsed file <https://builds.apache.org/job/Atlas-master-UnitTests/ws/intg/target/findbugs.xml>
with 0 unique warnings and 0 duplicates.
[FINDBUGS] Successfully parsed file <https://builds.apache.org/job/Atlas-master-UnitTests/ws/notification/target/findbugs.xml>
with 0 unique warnings and 0 duplicates.
[FINDBUGS] Successfully parsed file <https://builds.apache.org/job/Atlas-master-UnitTests/ws/server-api/target/findbugs.xml>
with 0 unique warnings and 0 duplicates.
[FINDBUGS] Successfully parsed file <https://builds.apache.org/job/Atlas-master-UnitTests/ws/typesystem/target/findbugs.xml>
with 0 unique warnings and 0 duplicates.
<Git Blamer> Using GitBlamer to create author and commit information for all warnings.
<Git Blamer> GIT_COMMIT=30138316734373b83f9fb1cdb59857bbfa6bb9fa, workspace=<https://builds.apache.org/job/Atlas-master-UnitTests/ws/>
[FINDBUGS] Computing warning deltas based on reference build #59
Archiving artifacts
TestNG Reports Processing: START
Looking for TestNG results report in workspace using pattern: **/target/surefire-reports/testng-results.xml,**/target/failsafe-reports/testng-results.xml
Saving reports...
Processing '/x1/jenkins/jenkins-home/jobs/Atlas-master-UnitTests/builds/92/testng/testng-results-1.xml'
Processing '/x1/jenkins/jenkins-home/jobs/Atlas-master-UnitTests/builds/92/testng/testng-results-2.xml'
Processing '/x1/jenkins/jenkins-home/jobs/Atlas-master-UnitTests/builds/92/testng/testng-results-3.xml'
Processing '/x1/jenkins/jenkins-home/jobs/Atlas-master-UnitTests/builds/92/testng/testng-results-4.xml'
Processing '/x1/jenkins/jenkins-home/jobs/Atlas-master-UnitTests/builds/92/testng/testng-results-5.xml'
Processing '/x1/jenkins/jenkins-home/jobs/Atlas-master-UnitTests/builds/92/testng/testng-results-6.xml'
Processing '/x1/jenkins/jenkins-home/jobs/Atlas-master-UnitTests/builds/92/testng/testng-results.xml'
TestNG Reports Processing: FINISH

Mime
View raw message