atlas-dev mailing list archives

Site index · List index
Message view « Date » · « Thread »
Top « Date » · « Thread »
From Apache Jenkins Server <jenk...@builds.apache.org>
Subject Build failed in Jenkins: Atlas-0.8-IntegrationTests #21
Date Wed, 23 Aug 2017 06:35:21 GMT
See <https://builds.apache.org/job/Atlas-0.8-IntegrationTests/21/display/redirect?page=changes>

Changes:

[ssubramanian] ATLAS-2078: Type update using v1 API doesn't route to

[ssubramanian] ATLAS-2079: Fix coverity scan issue and IT failures introduced by

------------------------------------------
[...truncated 507.05 KB...]
127.0.0.1 - - [23/Aug/2017:06:29:18 +0000] "GET /api/atlas/entities?type=testoLovePI1Y7 HTTP/1.1"
200 - "-" "Java/1.7.0_80"
127.0.0.1 - - [23/Aug/2017:06:29:18 +0000] "GET /api/atlas/entities/blah HTTP/1.1" 404 - "-"
"Java/1.7.0_80"
127.0.0.1 - - [23/Aug/2017:06:29:18 +0000] "POST /api/atlas/entities HTTP/1.1" 201 - "-" "Java/1.7.0_80"
127.0.0.1 - - [23/Aug/2017:06:29:18 +0000] "POST /api/atlas/entities HTTP/1.1" 201 - "-" "Java/1.7.0_80"
127.0.0.1 - - [23/Aug/2017:06:29:18 +0000] "GET /api/atlas/v2/types/typedef/name/PII_TraitquoVT9YlmT
HTTP/1.1" 404 - "-" "Java/1.7.0_80"
127.0.0.1 - - [23/Aug/2017:06:29:18 +0000] "POST /api/atlas/types HTTP/1.1" 201 - "-" "Java/1.7.0_80"
127.0.0.1 - - [23/Aug/2017:06:29:18 +0000] "POST /api/atlas/entities/c7157716-334a-4ecc-b069-5aef627c7b0c/traits
HTTP/1.1" 201 - "-" "Java/1.7.0_80"
127.0.0.1 - - [23/Aug/2017:06:29:18 +0000] "GET /api/atlas/entities/c7157716-334a-4ecc-b069-5aef627c7b0c/traitDefinitions/PII_TraitquoVT9YlmT
HTTP/1.1" 200 - "-" "Java/1.7.0_80"
127.0.0.1 - - [23/Aug/2017:06:29:18 +0000] "GET /api/atlas/entities/c7157716-334a-4ecc-b069-5aef627c7b0c/traitDefinitions
HTTP/1.1" 200 - "-" "Java/1.7.0_80"
127.0.0.1 - - [23/Aug/2017:06:29:18 +0000] "POST /api/atlas/entities HTTP/1.1" 201 - "-" "Java/1.7.0_80"
127.0.0.1 - - [23/Aug/2017:06:29:18 +0000] "POST /api/atlas/entities HTTP/1.1" 201 - "-" "Java/1.7.0_80"
127.0.0.1 - - [23/Aug/2017:06:29:18 +0000] "GET /api/atlas/entities/e5a51065-a893-4587-a687-f5179568c1ef/traits
HTTP/1.1" 200 - "-" "Java/1.7.0_80"
127.0.0.1 - - [23/Aug/2017:06:29:18 +0000] "POST /api/atlas/entities HTTP/1.1" 201 - "-" "Java/1.7.0_80"
127.0.0.1 - - [23/Aug/2017:06:29:18 +0000] "POST /api/atlas/entities HTTP/1.1" 201 - "-" "Java/1.7.0_80"
127.0.0.1 - - [23/Aug/2017:06:29:18 +0000] "POST /api/atlas/entities/0fbdc1d3-1eb2-4e02-ba05-b28cb5302b88
HTTP/1.1" 200 - "-" "Java/1.7.0_80"
127.0.0.1 - - [23/Aug/2017:06:29:18 +0000] "GET /api/atlas/entities/0fbdc1d3-1eb2-4e02-ba05-b28cb5302b88
HTTP/1.1" 200 - "-" "Java/1.7.0_80"
127.0.0.1 - - [23/Aug/2017:06:29:18 +0000] "POST /api/atlas/entities HTTP/1.1" 201 - "-" "Java/1.7.0_80"
127.0.0.1 - - [23/Aug/2017:06:29:18 +0000] "POST /api/atlas/entities HTTP/1.1" 201 - "-" "Java/1.7.0_80"
127.0.0.1 - - [23/Aug/2017:06:29:18 +0000] "POST /api/atlas/entities/qualifiedName?type=hive_table&property=qualifiedName&value=tableTcgMHVtgov
HTTP/1.1" 200 - "-" "Java/1.7.0_80"
127.0.0.1 - - [23/Aug/2017:06:29:18 +0000] "GET /api/atlas/entities/b3ed8ee5-d780-404a-a4f3-850f8c81f5d1
HTTP/1.1" 200 - "-" "Java/1.7.0_80"
127.0.0.1 - - [23/Aug/2017:06:29:18 +0000] "POST /api/atlas/entities HTTP/1.1" 201 - "-" "Java/1.7.0_80"
127.0.0.1 - - [23/Aug/2017:06:29:18 +0000] "GET /api/atlas/entities/35abd2ac-1d5a-40e3-8a9e-0ae8cc6a0997/audit?count=10
HTTP/1.1" 200 - "-" "Java/1.7.0_80"
127.0.0.1 - - [23/Aug/2017:06:29:18 +0000] "POST /api/atlas/entities HTTP/1.1" 201 - "-" "Java/1.7.0_80"
127.0.0.1 - - [23/Aug/2017:06:29:18 +0000] "POST /api/atlas/entities HTTP/1.1" 201 - "-" "Java/1.7.0_80"
127.0.0.1 - - [23/Aug/2017:06:29:19 +0000] "POST /api/atlas/entities HTTP/1.1" 201 - "-" "Java/1.7.0_80"
127.0.0.1 - - [23/Aug/2017:06:29:19 +0000] "POST /api/atlas/entities HTTP/1.1" 400 - "-" "Java/1.7.0_80"
127.0.0.1 - - [23/Aug/2017:06:29:19 +0000] "POST /api/atlas/entities HTTP/1.1" 201 - "-" "Java/1.7.0_80"
127.0.0.1 - - [23/Aug/2017:06:29:19 +0000] "GET /api/atlas/v2/types/typedef/name/rTqZj2RgYo
HTTP/1.1" 404 - "-" "Java/1.7.0_80"
127.0.0.1 - - [23/Aug/2017:06:29:19 +0000] "POST /api/atlas/types HTTP/1.1" 201 - "-" "Java/1.7.0_80"
127.0.0.1 - - [23/Aug/2017:06:29:19 +0000] "POST /api/atlas/entities HTTP/1.1" 201 - "-" "Java/1.7.0_80"
127.0.0.1 - - [23/Aug/2017:06:29:19 +0000] "GET /api/atlas/entities/8d3280dd-78e9-4210-83d7-53c0d211659b
HTTP/1.1" 200 - "-" "Java/1.7.0_80"
127.0.0.1 - - [23/Aug/2017:06:29:19 +0000] "GET /api/atlas/v2/entity/guid/a800b97f-6405-4014-a683-cf2eeca72ee6
HTTP/1.1" 200 - "-" "Java/1.7.0_80"
127.0.0.1 - - [23/Aug/2017:06:29:19 +0000] "POST /api/atlas/v2/entity/ HTTP/1.1" 200 - "-"
"Java/1.7.0_80"
127.0.0.1 - - [23/Aug/2017:06:29:19 +0000] "POST /api/atlas/v2/entity/guid/random/classifications
HTTP/1.1" 404 - "-" "Java/1.7.0_80"
127.0.0.1 - - [23/Aug/2017:06:29:19 +0000] "POST /api/atlas/v2/entity/bulk/ HTTP/1.1" 200
- "-" "Java/1.7.0_80"
127.0.0.1 - - [23/Aug/2017:06:29:19 +0000] "POST /api/atlas/v2/entity/ HTTP/1.1" 200 - "-"
"Java/1.7.0_80"
127.0.0.1 - - [23/Aug/2017:06:29:19 +0000] "POST /api/atlas/v2/entity/ HTTP/1.1" 200 - "-"
"Java/1.7.0_80"
127.0.0.1 - - [23/Aug/2017:06:29:19 +0000] "DELETE /api/atlas/v2/entity/bulk/?guid=fce34c1c-bf65-4ecc-8225-73731af8dfc8&guid=d58f6c39-c677-46d7-b985-1bc8990e810f
HTTP/1.1" 200 - "-" "Java/1.7.0_80"
127.0.0.1 - - [23/Aug/2017:06:29:19 +0000] "POST /api/atlas/v2/entity/ HTTP/1.1" 200 - "-"
"Java/1.7.0_80"
127.0.0.1 - - [23/Aug/2017:06:29:19 +0000] "DELETE /api/atlas/v2/entity/uniqueAttribute/type/hive_db_v2?attr:name=dbbmNftAiPiV%EC%86%BF%E6%91%B8%E2%B2%90%ED%8E%BE%E3%AB%99%E7%AA%B8%E2%A7%93%E4%A6%B5%C5%B2%E9%86%85
HTTP/1.1" 200 - "-" "Java/1.7.0_80"
127.0.0.1 - - [23/Aug/2017:06:29:19 +0000] "DELETE /api/atlas/v2/entity/guid/random/classification/blah_trait
HTTP/1.1" 400 - "-" "Java/1.7.0_80"
127.0.0.1 - - [23/Aug/2017:06:29:19 +0000] "GET /api/atlas/discovery/search/dsl?query=hive_db_v2+where+name%3D'dbbmNftAiPiV'&limit=10&offset=0
HTTP/1.1" 200 - "-" "Java/1.7.0_80"
127.0.0.1 - - [23/Aug/2017:06:29:20 +0000] "GET /api/atlas/discovery/search/dsl?query=hive_db_v2+where+name%3D'dbbmNftAiPiV'&limit=10&offset=0
HTTP/1.1" 200 - "-" "Java/1.7.0_80"
127.0.0.1 - - [23/Aug/2017:06:29:21 +0000] "POST /api/atlas/v2/entity/ HTTP/1.1" 200 - "-"
"Java/1.7.0_80"
127.0.0.1 - - [23/Aug/2017:06:29:21 +0000] "GET /api/atlas/discovery/search/dsl?query=hive_db_v2+where+name%3D'dbbmNftAiPiV'&limit=10&offset=0
HTTP/1.1" 200 - "-" "Java/1.7.0_80"
127.0.0.1 - - [23/Aug/2017:06:29:22 +0000] "POST /api/atlas/v2/types/typedefs/ HTTP/1.1" 200
- "-" "Java/1.7.0_80"
127.0.0.1 - - [23/Aug/2017:06:29:22 +0000] "POST /api/atlas/v2/entity/ HTTP/1.1" 200 - "-"
"Java/1.7.0_80"
127.0.0.1 - - [23/Aug/2017:06:29:22 +0000] "PUT /api/atlas/v2/types/typedefs/ HTTP/1.1" 200
- "-" "Java/1.7.0_80"
127.0.0.1 - - [23/Aug/2017:06:29:22 +0000] "GET /api/atlas/v2/entity/guid/3f4be54b-7b5f-4235-a3c3-c468c4f60c12
HTTP/1.1" 200 - "-" "Java/1.7.0_80"
127.0.0.1 - - [23/Aug/2017:06:29:22 +0000] "POST /api/atlas/v2/entity/ HTTP/1.1" 404 - "-"
"Java/1.7.0_80"
127.0.0.1 - - [23/Aug/2017:06:29:22 +0000] "POST /api/atlas/v2/entity/ HTTP/1.1" 200 - "-"
"Java/1.7.0_80"
127.0.0.1 - - [23/Aug/2017:06:29:22 +0000] "POST /api/atlas/v2/entity/ HTTP/1.1" 200 - "-"
"Java/1.7.0_80"
127.0.0.1 - - [23/Aug/2017:06:29:22 +0000] "GET /api/atlas/v2/entity/uniqueAttribute/type/hive_db_v2?attr:name=dbbmNftAiPiV
HTTP/1.1" 200 - "-" "Java/1.7.0_80"
127.0.0.1 - - [23/Aug/2017:06:29:23 +0000] "GET /api/atlas/v2/entity/guid/blah HTTP/1.1" 404
- "-" "Java/1.7.0_80"
127.0.0.1 - - [23/Aug/2017:06:29:23 +0000] "POST /api/atlas/v2/entity/ HTTP/1.1" 200 - "-"
"Java/1.7.0_80"
127.0.0.1 - - [23/Aug/2017:06:29:23 +0000] "GET /api/atlas/entities/af946e96-e29d-46e8-8ea0-60ffc97f2009/audit?count=10
HTTP/1.1" 200 - "-" "Java/1.7.0_80"
127.0.0.1 - - [23/Aug/2017:06:29:23 +0000] "POST /api/atlas/v2/entity/ HTTP/1.1" 200 - "-"
"Java/1.7.0_80"
127.0.0.1 - - [23/Aug/2017:06:29:23 +0000] "POST /api/atlas/v2/entity/ HTTP/1.1" 200 - "-"
"Java/1.7.0_80"
127.0.0.1 - - [23/Aug/2017:06:29:23 +0000] "GET /api/atlas/v2/types/typedef/name/XMf18Beiow
HTTP/1.1" 404 - "-" "Java/1.7.0_80"
127.0.0.1 - - [23/Aug/2017:06:29:23 +0000] "POST /api/atlas/v2/types/typedefs/ HTTP/1.1" 200
- "-" "Java/1.7.0_80"
127.0.0.1 - - [23/Aug/2017:06:29:23 +0000] "POST /api/atlas/v2/entity/ HTTP/1.1" 200 - "-"
"Java/1.7.0_80"
127.0.0.1 - - [23/Aug/2017:06:29:23 +0000] "GET /api/atlas/v2/entity/guid/075a17aa-6403-4015-9030-2aefa6b1bfcf
HTTP/1.1" 200 - "-" "Java/1.7.0_80"
127.0.0.1 - - [23/Aug/2017:06:29:23 +0000] "GET /api/atlas/discovery/search/dsl?query=from+hive_db_v1+name%3D%22dbpkUVhSWEax%22
HTTP/1.1" 200 - "-" "Java/1.7.0_80"
127.0.0.1 - - [23/Aug/2017:06:29:24 +0000] "GET /api/atlas/discovery/search/dsl?query=from+blah
HTTP/1.1" 400 - "-" "Java/1.7.0_80"
127.0.0.1 - - [23/Aug/2017:06:29:24 +0000] "GET /api/atlas/discovery/search?query=* HTTP/1.1"
200 - "-" "Java/1.7.0_80"
127.0.0.1 - - [23/Aug/2017:06:29:24 +0000] "GET /api/atlas/discovery/search?query=from+hive_db_v1+name%3D%22dbpkUVhSWEax%22
HTTP/1.1" 200 - "-" "Java/1.7.0_80"
127.0.0.1 - - [23/Aug/2017:06:29:25 +0000] "GET /api/atlas/discovery/search/gremlin?query=g.V.has('type',+'hive_table_v1').toList()
HTTP/1.1" 200 - "-" "Java/1.7.0_80"
127.0.0.1 - - [23/Aug/2017:06:29:26 +0000] "GET /api/atlas/v2/types/enumdef/name/blah HTTP/1.1"
404 - "-" "Java/1.7.0_80"
127.0.0.1 - - [23/Aug/2017:06:29:26 +0000] "GET /api/atlas/v2/types/enumdef/guid/blah HTTP/1.1"
404 - "-" "Java/1.7.0_80"
127.0.0.1 - - [23/Aug/2017:06:29:26 +0000] "GET /api/atlas/v2/types/structdef/name/blah HTTP/1.1"
404 - "-" "Java/1.7.0_80"
127.0.0.1 - - [23/Aug/2017:06:29:26 +0000] "GET /api/atlas/v2/types/structdef/guid/blah HTTP/1.1"
404 - "-" "Java/1.7.0_80"
127.0.0.1 - - [23/Aug/2017:06:29:26 +0000] "GET /api/atlas/v2/types/classificationdef/name/blah
HTTP/1.1" 404 - "-" "Java/1.7.0_80"
127.0.0.1 - - [23/Aug/2017:06:29:26 +0000] "GET /api/atlas/v2/types/classificationdef/guid/blah
HTTP/1.1" 404 - "-" "Java/1.7.0_80"
127.0.0.1 - - [23/Aug/2017:06:29:26 +0000] "GET /api/atlas/v2/types/entitydef/name/blah HTTP/1.1"
404 - "-" "Java/1.7.0_80"
127.0.0.1 - - [23/Aug/2017:06:29:26 +0000] "GET /api/atlas/v2/types/entitydef/guid/blah HTTP/1.1"
404 - "-" "Java/1.7.0_80"
127.0.0.1 - - [23/Aug/2017:06:29:26 +0000] "POST /api/atlas/v2/types/typedefs/ HTTP/1.1" 200
- "-" "Java/1.7.0_80"
127.0.0.1 - - [23/Aug/2017:06:29:26 +0000] "PUT /api/atlas/v2/types/typedefs/ HTTP/1.1" 200
- "-" "Java/1.7.0_80"
127.0.0.1 - - [23/Aug/2017:06:29:26 +0000] "GET /api/atlas/v2/types/typedefs/?type=ENTITY
HTTP/1.1" 200 - "-" "Java/1.7.0_80"
127.0.0.1 - - [23/Aug/2017:06:29:26 +0000] "POST /api/atlas/v2/types/typedefs/ HTTP/1.1" 200
- "-" "Java/1.7.0_80"
127.0.0.1 - - [23/Aug/2017:06:29:26 +0000] "GET /api/atlas/v2/types/typedefs/?supertype=Alh0nFfa9k4&type=CLASS
HTTP/1.1" 200 - "-" "Java/1.7.0_80"
127.0.0.1 - - [23/Aug/2017:06:29:26 +0000] "GET /api/atlas/v2/types/typedefs/?notsupertype=BUZtOFjbsVf&supertype=Alh0nFfa9k4&type=CLASS
HTTP/1.1" 200 - "-" "Java/1.7.0_80"
127.0.0.1 - - [23/Aug/2017:06:29:26 +0000] "POST /api/atlas/v2/types/typedefs/ HTTP/1.1" 200
- "-" "Java/1.7.0_80"
127.0.0.1 - - [23/Aug/2017:06:29:27 +0000] "POST /api/atlas/v2/types/typedefs/ HTTP/1.1" 409
- "-" "Java/1.7.0_80"
127.0.0.1 - - [23/Aug/2017:06:29:27 +0000] "POST /api/atlas/types HTTP/1.1" 201 - "-" "Java/1.7.0_80"
127.0.0.1 - - [23/Aug/2017:06:29:27 +0000] "POST /api/atlas/types HTTP/1.1" 409 - "-" "Java/1.7.0_80"
127.0.0.1 - - [23/Aug/2017:06:29:27 +0000] "GET /api/atlas/types/blah HTTP/1.1" 404 - "-"
"Java/1.7.0_80"
127.0.0.1 - - [23/Aug/2017:06:29:27 +0000] "GET /api/atlas/v2/types/typedef/name/class_trait
HTTP/1.1" 404 - "-" "Java/1.7.0_80"
127.0.0.1 - - [23/Aug/2017:06:29:27 +0000] "POST /api/atlas/types HTTP/1.1" 201 - "-" "Java/1.7.0_80"
127.0.0.1 - - [23/Aug/2017:06:29:27 +0000] "GET /api/atlas/v2/types/typedef/name/secure_trait
HTTP/1.1" 404 - "-" "Java/1.7.0_80"
127.0.0.1 - - [23/Aug/2017:06:29:27 +0000] "POST /api/atlas/types HTTP/1.1" 201 - "-" "Java/1.7.0_80"
127.0.0.1 - - [23/Aug/2017:06:29:27 +0000] "GET /api/atlas/v2/types/typedef/name/pii_trait
HTTP/1.1" 404 - "-" "Java/1.7.0_80"
127.0.0.1 - - [23/Aug/2017:06:29:27 +0000] "POST /api/atlas/types HTTP/1.1" 201 - "-" "Java/1.7.0_80"
127.0.0.1 - - [23/Aug/2017:06:29:27 +0000] "GET /api/atlas/v2/types/typedef/name/ssn_trait
HTTP/1.1" 404 - "-" "Java/1.7.0_80"
127.0.0.1 - - [23/Aug/2017:06:29:27 +0000] "POST /api/atlas/types HTTP/1.1" 201 - "-" "Java/1.7.0_80"
127.0.0.1 - - [23/Aug/2017:06:29:27 +0000] "GET /api/atlas/v2/types/typedef/name/salary_trait
HTTP/1.1" 404 - "-" "Java/1.7.0_80"
127.0.0.1 - - [23/Aug/2017:06:29:27 +0000] "POST /api/atlas/types HTTP/1.1" 201 - "-" "Java/1.7.0_80"
127.0.0.1 - - [23/Aug/2017:06:29:27 +0000] "GET /api/atlas/v2/types/typedef/name/sox_trait
HTTP/1.1" 404 - "-" "Java/1.7.0_80"
127.0.0.1 - - [23/Aug/2017:06:29:27 +0000] "POST /api/atlas/types HTTP/1.1" 201 - "-" "Java/1.7.0_80"
127.0.0.1 - - [23/Aug/2017:06:29:28 +0000] "GET /api/atlas/types?type=TRAIT HTTP/1.1" 200
- "-" "Java/1.7.0_80"
127.0.0.1 - - [23/Aug/2017:06:29:28 +0000] "GET /api/atlas/v2/types/typedef/name/AHss5D3YXWe
HTTP/1.1" 404 - "-" "Java/1.7.0_80"
127.0.0.1 - - [23/Aug/2017:06:29:28 +0000] "POST /api/atlas/types HTTP/1.1" 201 - "-" "Java/1.7.0_80"
127.0.0.1 - - [23/Aug/2017:06:29:28 +0000] "GET /api/atlas/v2/types/typedef/name/A1AtAXPAfOaq
HTTP/1.1" 404 - "-" "Java/1.7.0_80"
127.0.0.1 - - [23/Aug/2017:06:29:28 +0000] "POST /api/atlas/types HTTP/1.1" 201 - "-" "Java/1.7.0_80"
127.0.0.1 - - [23/Aug/2017:06:29:28 +0000] "GET /api/atlas/v2/types/typedef/name/BM39jpI7txH
HTTP/1.1" 404 - "-" "Java/1.7.0_80"
127.0.0.1 - - [23/Aug/2017:06:29:28 +0000] "POST /api/atlas/types HTTP/1.1" 201 - "-" "Java/1.7.0_80"
127.0.0.1 - - [23/Aug/2017:06:29:28 +0000] "GET /api/atlas/v2/types/typedef/name/Cc0Fiwje44z
HTTP/1.1" 404 - "-" "Java/1.7.0_80"
127.0.0.1 - - [23/Aug/2017:06:29:28 +0000] "POST /api/atlas/types HTTP/1.1" 201 - "-" "Java/1.7.0_80"
127.0.0.1 - - [23/Aug/2017:06:29:28 +0000] "GET /api/atlas/types?type=CLASS&supertype=AHss5D3YXWe&notsupertype=BM39jpI7txH
HTTP/1.1" 200 - "-" "Java/1.7.0_80"
127.0.0.1 - - [23/Aug/2017:06:29:28 +0000] "POST /api/atlas/types HTTP/1.1" 201 - "-" "Java/1.7.0_80"
127.0.0.1 - - [23/Aug/2017:06:29:28 +0000] "PUT /api/atlas/types HTTP/1.1" 200 - "-" "Java/1.7.0_80"
Tests run: 133, Failures: 1, Errors: 0, Skipped: 0, Time elapsed: 175.557 sec <<<
FAILURE! - in TestSuite
testUpdate(org.apache.atlas.web.integration.TypesJerseyResourceIT)  Time elapsed: 0.275 sec
 <<< FAILURE!
java.lang.AssertionError: expected:<1> but was:<0>
	at org.apache.atlas.web.integration.TypesJerseyResourceIT.testUpdate(TypesJerseyResourceIT.java:130)


Results :

Failed tests: 
  TypesJerseyResourceIT.testUpdate:130 expected:<1> but was:<0>

Tests run: 133, Failures: 1, Errors: 0, Skipped: 0

[INFO] 
[INFO] --- jetty-maven-plugin:9.2.12.v20150709:stop (stop-jetty) @ atlas-webapp ---
[INFO] Waiting 10 seconds for jetty to stop
[INFO] Stopped ServerConnector@388b1cf0{HTTP/1.1}{0.0.0.0:31000}
[INFO] Closing Spring root WebApplicationContext
[INFO] Shutting down log4j
[INFO] Stopped o.e.j.m.p.JettyWebAppContext@5e7186b6{/,<https://builds.apache.org/job/Atlas-0.8-IntegrationTests/ws/webapp/target/atlas-webapp-0.8.1/,UNAVAILABLE}{/home/jenkins/jenkins-slave/workspace/Atlas-0.8-IntegrationTests/webapp/target/atlas-webapp-0.8.1.war}>
[INFO] Server reports itself as stopped
[INFO] 
[INFO] --- maven-source-plugin:2.4:jar-no-fork (attach-sources) @ atlas-webapp ---
[INFO] Building jar: <https://builds.apache.org/job/Atlas-0.8-IntegrationTests/ws/webapp/target/atlas-webapp-0.8.1-sources.jar>
log4j:WARN No appenders could be found for logger (org.apache.zookeeper.ClientCnxn).
log4j:WARN Please initialize the log4j system properly.
log4j:WARN See http://logging.apache.org/log4j/1.2/faq.html#noconfig for more info.
[INFO] 
[INFO] --- maven-source-plugin:2.4:test-jar-no-fork (attach-sources) @ atlas-webapp ---
[INFO] Building jar: <https://builds.apache.org/job/Atlas-0.8-IntegrationTests/ws/webapp/target/atlas-webapp-0.8.1-test-sources.jar>
[INFO] 
[INFO] --- maven-failsafe-plugin:2.19.1:verify (verify) @ atlas-webapp ---
[INFO] ------------------------------------------------------------------------
[INFO] Reactor Summary:
[INFO] 
[INFO] Apache Atlas Server Build Tools .................... SUCCESS [  1.996 s]
[INFO] apache-atlas ....................................... SUCCESS [ 13.666 s]
[INFO] Apache Atlas Integration ........................... SUCCESS [ 35.240 s]
[INFO] Apache Atlas Common ................................ SUCCESS [ 17.645 s]
[INFO] Apache Atlas Typesystem ............................ SUCCESS [01:21 min]
[INFO] Apache Atlas Client ................................ SUCCESS [ 20.710 s]
[INFO] Apache Atlas Server API ............................ SUCCESS [ 12.286 s]
[INFO] Apache Atlas Notification .......................... SUCCESS [ 21.631 s]
[INFO] Apache Atlas Graph Database Projects ............... SUCCESS [  0.835 s]
[INFO] Apache Atlas Graph Database API .................... SUCCESS [ 10.913 s]
[INFO] Graph Database Common Code ......................... SUCCESS [  9.136 s]
[INFO] Apache Atlas Titan 1.0.0 GraphDB Impl .............. SUCCESS [ 37.402 s]
[INFO] Shaded version of Apache hbase client .............. SUCCESS [  9.987 s]
[INFO] Apache Atlas Titan 0.5.4 Graph DB Impl ............. SUCCESS [ 50.343 s]
[INFO] Apache Atlas Graph Database Implementation Dependencies SUCCESS [  0.786 s]
[INFO] Shaded version of Apache hbase server .............. SUCCESS [ 27.071 s]
[INFO] Apache Atlas Repository ............................ SUCCESS [02:16 min]
[INFO] Apache Atlas Authorization ......................... SUCCESS [ 14.461 s]
[INFO] Apache Atlas Business Catalog ...................... SUCCESS [ 19.834 s]
[INFO] Apache Atlas UI .................................... SUCCESS [01:14 min]
[INFO] Apache Atlas Web Application ....................... FAILURE [04:46 min]
[INFO] Apache Atlas Documentation ......................... SKIPPED
[INFO] Apache Atlas FileSystem Model ...................... SKIPPED
[INFO] Apache Atlas Plugin Classloader .................... SKIPPED
[INFO] Apache Atlas Hive Bridge Shim ...................... SKIPPED
[INFO] Apache Atlas Hive Bridge ........................... SKIPPED
[INFO] Apache Atlas Falcon Bridge Shim .................... SKIPPED
[INFO] Apache Atlas Falcon Bridge ......................... SKIPPED
[INFO] Apache Atlas Sqoop Bridge Shim ..................... SKIPPED
[INFO] Apache Atlas Sqoop Bridge .......................... SKIPPED
[INFO] Apache Atlas Storm Bridge Shim ..................... SKIPPED
[INFO] Apache Atlas Storm Bridge .......................... SKIPPED
[INFO] Apache Atlas Distribution .......................... SKIPPED
[INFO] ------------------------------------------------------------------------
[INFO] BUILD FAILURE
[INFO] ------------------------------------------------------------------------
[INFO] Total time: 14:46 min
[INFO] Finished at: 2017-08-23T06:29:36Z
[INFO] Final Memory: 373M/2177M
[INFO] ------------------------------------------------------------------------
[ERROR] Failed to execute goal org.apache.maven.plugins:maven-failsafe-plugin:2.19.1:verify
(verify) on project atlas-webapp: There are test failures.
[ERROR] 
[ERROR] Please refer to <https://builds.apache.org/job/Atlas-0.8-IntegrationTests/ws/webapp/target/failsafe-reports>
for the individual test results.
[ERROR] -> [Help 1]
[ERROR] 
[ERROR] To see the full stack trace of the errors, re-run Maven with the -e switch.
[ERROR] Re-run Maven using the -X switch to enable full debug logging.
[ERROR] 
[ERROR] For more information about the errors and possible solutions, please read the following
articles:
[ERROR] [Help 1] http://cwiki.apache.org/confluence/display/MAVEN/MojoFailureException
[ERROR] 
[ERROR] After correcting the problems, you can resume the build with the command
[ERROR]   mvn <goals> -rf :atlas-webapp
Build step 'Execute shell' marked build as failure
[CHECKSTYLE] Collecting checkstyle analysis files...
[CHECKSTYLE] Searching for all files in <https://builds.apache.org/job/Atlas-0.8-IntegrationTests/ws/>
that match the pattern **/target/checkstyle-result.xml
[CHECKSTYLE] Parsing 19 files in <https://builds.apache.org/job/Atlas-0.8-IntegrationTests/ws/>
[CHECKSTYLE] Successfully parsed file <https://builds.apache.org/job/Atlas-0.8-IntegrationTests/ws/authorization/target/checkstyle-result.xml>
with 467 unique warnings and 0 duplicates.
[CHECKSTYLE] Successfully parsed file <https://builds.apache.org/job/Atlas-0.8-IntegrationTests/ws/catalog/target/checkstyle-result.xml>
with 2612 unique warnings and 0 duplicates.
[CHECKSTYLE] Successfully parsed file <https://builds.apache.org/job/Atlas-0.8-IntegrationTests/ws/client/target/checkstyle-result.xml>
with 4250 unique warnings and 0 duplicates.
[CHECKSTYLE] Successfully parsed file <https://builds.apache.org/job/Atlas-0.8-IntegrationTests/ws/common/target/checkstyle-result.xml>
with 5456 unique warnings and 0 duplicates.
[CHECKSTYLE] Successfully parsed file <https://builds.apache.org/job/Atlas-0.8-IntegrationTests/ws/dashboardv2/target/checkstyle-result.xml>
with 5456 unique warnings and 0 duplicates.
[CHECKSTYLE] Successfully parsed file <https://builds.apache.org/job/Atlas-0.8-IntegrationTests/ws/graphdb/api/target/checkstyle-result.xml>
with 5725 unique warnings and 0 duplicates.
[CHECKSTYLE] Successfully parsed file <https://builds.apache.org/job/Atlas-0.8-IntegrationTests/ws/graphdb/common/target/checkstyle-result.xml>
with 5912 unique warnings and 0 duplicates.
[CHECKSTYLE] Successfully parsed file <https://builds.apache.org/job/Atlas-0.8-IntegrationTests/ws/graphdb/graphdb-impls/target/checkstyle-result.xml>
with 5912 unique warnings and 0 duplicates.
[CHECKSTYLE] Successfully parsed file <https://builds.apache.org/job/Atlas-0.8-IntegrationTests/ws/graphdb/target/checkstyle-result.xml>
with 5912 unique warnings and 0 duplicates.
[CHECKSTYLE] Successfully parsed file <https://builds.apache.org/job/Atlas-0.8-IntegrationTests/ws/graphdb/titan0/target/checkstyle-result.xml>
with 8186 unique warnings and 0 duplicates.
[CHECKSTYLE] Successfully parsed file <https://builds.apache.org/job/Atlas-0.8-IntegrationTests/ws/graphdb/titan1/target/checkstyle-result.xml>
with 9134 unique warnings and 0 duplicates.
[CHECKSTYLE] Successfully parsed file <https://builds.apache.org/job/Atlas-0.8-IntegrationTests/ws/intg/target/checkstyle-result.xml>
with 15446 unique warnings and 0 duplicates.
[CHECKSTYLE] Successfully parsed file <https://builds.apache.org/job/Atlas-0.8-IntegrationTests/ws/notification/target/checkstyle-result.xml>
with 16656 unique warnings and 0 duplicates.
[CHECKSTYLE] Successfully parsed file <https://builds.apache.org/job/Atlas-0.8-IntegrationTests/ws/repository/target/checkstyle-result.xml>
with 35028 unique warnings and 0 duplicates.
[CHECKSTYLE] Successfully parsed file <https://builds.apache.org/job/Atlas-0.8-IntegrationTests/ws/server-api/target/checkstyle-result.xml>
with 35407 unique warnings and 0 duplicates.
[CHECKSTYLE] Successfully parsed file <https://builds.apache.org/job/Atlas-0.8-IntegrationTests/ws/shaded/hbase-client-shaded/target/checkstyle-result.xml>
with 35407 unique warnings and 0 duplicates.
[CHECKSTYLE] Successfully parsed file <https://builds.apache.org/job/Atlas-0.8-IntegrationTests/ws/shaded/hbase-server-shaded/target/checkstyle-result.xml>
with 35407 unique warnings and 0 duplicates.
[CHECKSTYLE] Successfully parsed file <https://builds.apache.org/job/Atlas-0.8-IntegrationTests/ws/target/checkstyle-result.xml>
with 35407 unique warnings and 0 duplicates.
[CHECKSTYLE] Successfully parsed file <https://builds.apache.org/job/Atlas-0.8-IntegrationTests/ws/typesystem/target/checkstyle-result.xml>
with 39625 unique warnings and 0 duplicates.
<Git Blamer> Using GitBlamer to create author and commit information for all warnings.
<Git Blamer> GIT_COMMIT=5733834306bddbd7665c9ab200c6e217ac52e9b8, workspace=<https://builds.apache.org/job/Atlas-0.8-IntegrationTests/ws/>
 > git rev-parse 5733834306bddbd7665c9ab200c6e217ac52e9b8^{commit} # timeout=10
[FINDBUGS] Collecting findbugs analysis files...
[FINDBUGS] Searching for all files in <https://builds.apache.org/job/Atlas-0.8-IntegrationTests/ws/>
that match the pattern **/target/findbugs.xml
[FINDBUGS] Parsing 12 files in <https://builds.apache.org/job/Atlas-0.8-IntegrationTests/ws/>
[FINDBUGS] Successfully parsed file <https://builds.apache.org/job/Atlas-0.8-IntegrationTests/ws/authorization/target/findbugs.xml>
with 0 unique warnings and 0 duplicates.
[FINDBUGS] Successfully parsed file <https://builds.apache.org/job/Atlas-0.8-IntegrationTests/ws/catalog/target/findbugs.xml>
with 0 unique warnings and 0 duplicates.
[FINDBUGS] Successfully parsed file <https://builds.apache.org/job/Atlas-0.8-IntegrationTests/ws/client/target/findbugs.xml>
with 0 unique warnings and 0 duplicates.
[FINDBUGS] Successfully parsed file <https://builds.apache.org/job/Atlas-0.8-IntegrationTests/ws/common/target/findbugs.xml>
with 0 unique warnings and 0 duplicates.
[FINDBUGS] Successfully parsed file <https://builds.apache.org/job/Atlas-0.8-IntegrationTests/ws/graphdb/api/target/findbugs.xml>
with 0 unique warnings and 0 duplicates.
[FINDBUGS] Successfully parsed file <https://builds.apache.org/job/Atlas-0.8-IntegrationTests/ws/graphdb/common/target/findbugs.xml>
with 0 unique warnings and 0 duplicates.
[FINDBUGS] Successfully parsed file <https://builds.apache.org/job/Atlas-0.8-IntegrationTests/ws/graphdb/titan0/target/findbugs.xml>
with 0 unique warnings and 0 duplicates.
[FINDBUGS] Successfully parsed file <https://builds.apache.org/job/Atlas-0.8-IntegrationTests/ws/intg/target/findbugs.xml>
with 0 unique warnings and 0 duplicates.
[FINDBUGS] Successfully parsed file <https://builds.apache.org/job/Atlas-0.8-IntegrationTests/ws/notification/target/findbugs.xml>
with 0 unique warnings and 0 duplicates.
[FINDBUGS] Successfully parsed file <https://builds.apache.org/job/Atlas-0.8-IntegrationTests/ws/repository/target/findbugs.xml>
with 0 unique warnings and 0 duplicates.
[FINDBUGS] Successfully parsed file <https://builds.apache.org/job/Atlas-0.8-IntegrationTests/ws/server-api/target/findbugs.xml>
with 0 unique warnings and 0 duplicates.
[FINDBUGS] Successfully parsed file <https://builds.apache.org/job/Atlas-0.8-IntegrationTests/ws/typesystem/target/findbugs.xml>
with 0 unique warnings and 0 duplicates.
<Git Blamer> Using GitBlamer to create author and commit information for all warnings.
<Git Blamer> GIT_COMMIT=5733834306bddbd7665c9ab200c6e217ac52e9b8, workspace=<https://builds.apache.org/job/Atlas-0.8-IntegrationTests/ws/>
Archiving artifacts
[Fast Archiver] No prior successful build to compare, so performing full copy of artifacts
TestNG Reports Processing: START
Looking for TestNG results report in workspace using pattern: **/target/surefire-reports/testng-results.xml,**/target/failsafe-reports/testng-results.xml
Saving reports...
Processing '/x1/jenkins/jenkins-home/jobs/Atlas-0.8-IntegrationTests/builds/21/testng/testng-results.xml'
0.751880% of tests failed, which exceeded threshold of 0%. Marking build as UNSTABLE
TestNG Reports Processing: FINISH

Mime
View raw message