atlas-dev mailing list archives

Site index · List index
Message view « Date » · « Thread »
Top « Date » · « Thread »
From Apache Jenkins Server <jenk...@builds.apache.org>
Subject Build failed in Jenkins: Atlas-0.8-IntegrationTests #9
Date Wed, 16 Aug 2017 19:38:41 GMT
See <https://builds.apache.org/job/Atlas-0.8-IntegrationTests/9/display/redirect?page=changes>

Changes:

[madhan] ATLAS-2046: UI Regression - Columns Filter not listing all attributes of

[madhan] ATLAS-2003 Add Javadoc format to class summaries

[madhan] ATLAS-1867 ATLASClientV2 correct delete typedefs expected http code

[ssubramanian] ATLAS-2048: Fix for Unit test failure on 0.8-incubating branch

------------------------------------------
[...truncated 653.95 KB...]
127.0.0.1 - - [16/Aug/2017:19:34:01 +0000] "GET /api/atlas/v2/types/typedef/name/sox_trait
HTTP/1.1" 404 - "-" "Java/1.7.0_80"
127.0.0.1 - - [16/Aug/2017:19:34:01 +0000] "POST /api/atlas/types HTTP/1.1" 201 - "-" "Java/1.7.0_80"
127.0.0.1 - - [16/Aug/2017:19:34:01 +0000] "GET /api/atlas/types?type=TRAIT HTTP/1.1" 200
- "-" "Java/1.7.0_80"
127.0.0.1 - - [16/Aug/2017:19:34:01 +0000] "GET /api/atlas/v2/types/typedef/name/Axmss3PZ6La
HTTP/1.1" 404 - "-" "Java/1.7.0_80"
127.0.0.1 - - [16/Aug/2017:19:34:01 +0000] "POST /api/atlas/types HTTP/1.1" 201 - "-" "Java/1.7.0_80"
127.0.0.1 - - [16/Aug/2017:19:34:01 +0000] "GET /api/atlas/v2/types/typedef/name/A1DLq3Uc2UJv
HTTP/1.1" 404 - "-" "Java/1.7.0_80"
127.0.0.1 - - [16/Aug/2017:19:34:01 +0000] "POST /api/atlas/types HTTP/1.1" 201 - "-" "Java/1.7.0_80"
127.0.0.1 - - [16/Aug/2017:19:34:02 +0000] "GET /api/atlas/v2/types/typedef/name/BstnIjenBGW
HTTP/1.1" 404 - "-" "Java/1.7.0_80"
127.0.0.1 - - [16/Aug/2017:19:34:02 +0000] "POST /api/atlas/types HTTP/1.1" 201 - "-" "Java/1.7.0_80"
127.0.0.1 - - [16/Aug/2017:19:34:02 +0000] "GET /api/atlas/v2/types/typedef/name/CDDSnlQadsd
HTTP/1.1" 404 - "-" "Java/1.7.0_80"
127.0.0.1 - - [16/Aug/2017:19:34:02 +0000] "POST /api/atlas/types HTTP/1.1" 201 - "-" "Java/1.7.0_80"
127.0.0.1 - - [16/Aug/2017:19:34:02 +0000] "GET /api/atlas/types?type=CLASS&supertype=Axmss3PZ6La&notsupertype=BstnIjenBGW
HTTP/1.1" 200 - "-" "Java/1.7.0_80"
127.0.0.1 - - [16/Aug/2017:19:34:02 +0000] "POST /api/atlas/types HTTP/1.1" 201 - "-" "Java/1.7.0_80"
127.0.0.1 - - [16/Aug/2017:19:34:02 +0000] "PUT /api/atlas/types HTTP/1.1" 200 - "-" "Java/1.7.0_80"
127.0.0.1 - - [16/Aug/2017:19:34:02 +0000] "GET /api/atlas/types/ZPGyCNiCFW HTTP/1.1" 200
- "-" "Java/1.7.0_80"
127.0.0.1 - - [16/Aug/2017:19:34:07 +0000] "GET /api/atlas/v2/types/typedef/name/tableType
HTTP/1.1" 200 - "-" "Java/1.7.0_80"
127.0.0.1 - - [16/Aug/2017:19:34:07 +0000] "GET /api/atlas/v2/types/typedef/name/serdeType
HTTP/1.1" 200 - "-" "Java/1.7.0_80"
127.0.0.1 - - [16/Aug/2017:19:34:07 +0000] "GET /api/atlas/v2/types/typedef/name/classification
HTTP/1.1" 200 - "-" "Java/1.7.0_80"
127.0.0.1 - - [16/Aug/2017:19:34:07 +0000] "GET /api/atlas/v2/types/typedef/name/pii HTTP/1.1"
200 - "-" "Java/1.7.0_80"
127.0.0.1 - - [16/Aug/2017:19:34:07 +0000] "GET /api/atlas/v2/types/typedef/name/phi HTTP/1.1"
200 - "-" "Java/1.7.0_80"
127.0.0.1 - - [16/Aug/2017:19:34:07 +0000] "GET /api/atlas/v2/types/typedef/name/pci HTTP/1.1"
200 - "-" "Java/1.7.0_80"
127.0.0.1 - - [16/Aug/2017:19:34:07 +0000] "GET /api/atlas/v2/types/typedef/name/sox HTTP/1.1"
200 - "-" "Java/1.7.0_80"
127.0.0.1 - - [16/Aug/2017:19:34:07 +0000] "GET /api/atlas/v2/types/typedef/name/sec HTTP/1.1"
200 - "-" "Java/1.7.0_80"
127.0.0.1 - - [16/Aug/2017:19:34:07 +0000] "GET /api/atlas/v2/types/typedef/name/finance HTTP/1.1"
200 - "-" "Java/1.7.0_80"
127.0.0.1 - - [16/Aug/2017:19:34:07 +0000] "GET /api/atlas/v2/types/typedef/name/Fact HTTP/1.1"
200 - "-" "Java/1.7.0_80"
127.0.0.1 - - [16/Aug/2017:19:34:07 +0000] "GET /api/atlas/v2/types/typedef/name/ETL HTTP/1.1"
200 - "-" "Java/1.7.0_80"
127.0.0.1 - - [16/Aug/2017:19:34:07 +0000] "GET /api/atlas/v2/types/typedef/name/Dimension
HTTP/1.1" 200 - "-" "Java/1.7.0_80"
127.0.0.1 - - [16/Aug/2017:19:34:07 +0000] "GET /api/atlas/v2/types/typedef/name/Metric HTTP/1.1"
200 - "-" "Java/1.7.0_80"
127.0.0.1 - - [16/Aug/2017:19:34:07 +0000] "GET /api/atlas/v2/types/typedef/name/hive_db_v1
HTTP/1.1" 200 - "-" "Java/1.7.0_80"
127.0.0.1 - - [16/Aug/2017:19:34:07 +0000] "GET /api/atlas/v2/types/typedef/name/hive_column_v1
HTTP/1.1" 200 - "-" "Java/1.7.0_80"
127.0.0.1 - - [16/Aug/2017:19:34:07 +0000] "GET /api/atlas/v2/types/typedef/name/hive_table_v1
HTTP/1.1" 200 - "-" "Java/1.7.0_80"
127.0.0.1 - - [16/Aug/2017:19:34:07 +0000] "GET /api/atlas/v2/types/typedef/name/hive_process_v1
HTTP/1.1" 200 - "-" "Java/1.7.0_80"
127.0.0.1 - - [16/Aug/2017:19:34:07 +0000] "POST /api/atlas/types HTTP/1.1" 201 - "-" "Java/1.7.0_80"
127.0.0.1 - - [16/Aug/2017:19:34:07 +0000] "GET /api/atlas/v2/types/typedef/name/Fact HTTP/1.1"
200 - "-" "Java/1.7.0_80"
127.0.0.1 - - [16/Aug/2017:19:34:07 +0000] "GET /api/atlas/v2/types/typedef/name/ETL HTTP/1.1"
200 - "-" "Java/1.7.0_80"
127.0.0.1 - - [16/Aug/2017:19:34:07 +0000] "GET /api/atlas/v2/types/typedef/name/Dimension
HTTP/1.1" 200 - "-" "Java/1.7.0_80"
127.0.0.1 - - [16/Aug/2017:19:34:07 +0000] "GET /api/atlas/v2/types/typedef/name/Metric HTTP/1.1"
200 - "-" "Java/1.7.0_80"
127.0.0.1 - - [16/Aug/2017:19:34:07 +0000] "POST /api/atlas/types HTTP/1.1" 201 - "-" "Java/1.7.0_80"
127.0.0.1 - - [16/Aug/2017:19:34:07 +0000] "POST /api/atlas/entities HTTP/1.1" 201 - "-" "Java/1.7.0_80"
127.0.0.1 - - [16/Aug/2017:19:34:07 +0000] "POST /api/atlas/entities HTTP/1.1" 201 - "-" "Java/1.7.0_80"
127.0.0.1 - - [16/Aug/2017:19:34:07 +0000] "POST /api/atlas/entities HTTP/1.1" 201 - "-" "Java/1.7.0_80"
127.0.0.1 - - [16/Aug/2017:19:34:07 +0000] "POST /api/atlas/entities HTTP/1.1" 201 - "-" "Java/1.7.0_80"
127.0.0.1 - - [16/Aug/2017:19:34:07 +0000] "POST /api/atlas/entities HTTP/1.1" 201 - "-" "Java/1.7.0_80"
127.0.0.1 - - [16/Aug/2017:19:34:07 +0000] "POST /api/atlas/entities HTTP/1.1" 201 - "-" "Java/1.7.0_80"
127.0.0.1 - - [16/Aug/2017:19:34:07 +0000] "POST /api/atlas/entities HTTP/1.1" 201 - "-" "Java/1.7.0_80"
127.0.0.1 - - [16/Aug/2017:19:34:07 +0000] "POST /api/atlas/entities HTTP/1.1" 201 - "-" "Java/1.7.0_80"
127.0.0.1 - - [16/Aug/2017:19:34:07 +0000] "GET /api/atlas/v2/types/typedef/name/tableType
HTTP/1.1" 200 - "-" "Java/1.7.0_80"
127.0.0.1 - - [16/Aug/2017:19:34:07 +0000] "GET /api/atlas/v2/types/typedef/name/serdeType
HTTP/1.1" 200 - "-" "Java/1.7.0_80"
127.0.0.1 - - [16/Aug/2017:19:34:07 +0000] "GET /api/atlas/v2/types/typedef/name/classification
HTTP/1.1" 200 - "-" "Java/1.7.0_80"
127.0.0.1 - - [16/Aug/2017:19:34:07 +0000] "GET /api/atlas/v2/types/typedef/name/pii HTTP/1.1"
200 - "-" "Java/1.7.0_80"
127.0.0.1 - - [16/Aug/2017:19:34:07 +0000] "GET /api/atlas/v2/types/typedef/name/phi HTTP/1.1"
200 - "-" "Java/1.7.0_80"
127.0.0.1 - - [16/Aug/2017:19:34:07 +0000] "GET /api/atlas/v2/types/typedef/name/pci HTTP/1.1"
200 - "-" "Java/1.7.0_80"
127.0.0.1 - - [16/Aug/2017:19:34:07 +0000] "GET /api/atlas/v2/types/typedef/name/sox HTTP/1.1"
200 - "-" "Java/1.7.0_80"
127.0.0.1 - - [16/Aug/2017:19:34:07 +0000] "GET /api/atlas/v2/types/typedef/name/sec HTTP/1.1"
200 - "-" "Java/1.7.0_80"
127.0.0.1 - - [16/Aug/2017:19:34:07 +0000] "GET /api/atlas/v2/types/typedef/name/finance HTTP/1.1"
200 - "-" "Java/1.7.0_80"
127.0.0.1 - - [16/Aug/2017:19:34:07 +0000] "GET /api/atlas/v2/types/typedef/name/Fact HTTP/1.1"
200 - "-" "Java/1.7.0_80"
127.0.0.1 - - [16/Aug/2017:19:34:07 +0000] "GET /api/atlas/v2/types/typedef/name/ETL HTTP/1.1"
200 - "-" "Java/1.7.0_80"
127.0.0.1 - - [16/Aug/2017:19:34:07 +0000] "GET /api/atlas/v2/types/typedef/name/Dimension
HTTP/1.1" 200 - "-" "Java/1.7.0_80"
127.0.0.1 - - [16/Aug/2017:19:34:07 +0000] "GET /api/atlas/v2/types/typedef/name/Metric HTTP/1.1"
200 - "-" "Java/1.7.0_80"
127.0.0.1 - - [16/Aug/2017:19:34:07 +0000] "GET /api/atlas/v2/types/typedef/name/hive_db_v1
HTTP/1.1" 200 - "-" "Java/1.7.0_80"
127.0.0.1 - - [16/Aug/2017:19:34:07 +0000] "GET /api/atlas/v2/types/typedef/name/hive_column_v1
HTTP/1.1" 200 - "-" "Java/1.7.0_80"
127.0.0.1 - - [16/Aug/2017:19:34:07 +0000] "GET /api/atlas/v2/types/typedef/name/hive_table_v1
HTTP/1.1" 200 - "-" "Java/1.7.0_80"
127.0.0.1 - - [16/Aug/2017:19:34:07 +0000] "GET /api/atlas/v2/types/typedef/name/hive_process_v1
HTTP/1.1" 200 - "-" "Java/1.7.0_80"
127.0.0.1 - - [16/Aug/2017:19:34:07 +0000] "POST /api/atlas/types HTTP/1.1" 201 - "-" "Java/1.7.0_80"
127.0.0.1 - - [16/Aug/2017:19:34:07 +0000] "POST /api/atlas/entities HTTP/1.1" 201 - "-" "Java/1.7.0_80"
127.0.0.1 - - [16/Aug/2017:19:34:07 +0000] "POST /api/atlas/entities HTTP/1.1" 201 - "-" "Java/1.7.0_80"
127.0.0.1 - - [16/Aug/2017:19:34:07 +0000] "POST /api/atlas/entities HTTP/1.1" 201 - "-" "Java/1.7.0_80"
127.0.0.1 - - [16/Aug/2017:19:34:07 +0000] "POST /api/atlas/entities HTTP/1.1" 201 - "-" "Java/1.7.0_80"
127.0.0.1 - - [16/Aug/2017:19:34:08 +0000] "POST /api/atlas/entities HTTP/1.1" 201 - "-" "Java/1.7.0_80"
127.0.0.1 - - [16/Aug/2017:19:34:08 +0000] "POST /api/atlas/entities HTTP/1.1" 201 - "-" "Java/1.7.0_80"
127.0.0.1 - - [16/Aug/2017:19:34:08 +0000] "POST /api/atlas/entities HTTP/1.1" 201 - "-" "Java/1.7.0_80"
127.0.0.1 - - [16/Aug/2017:19:34:08 +0000] "POST /api/atlas/entities HTTP/1.1" 201 - "-" "Java/1.7.0_80"
127.0.0.1 - - [16/Aug/2017:19:34:08 +0000] "GET /api/atlas/entities?type=hive_table_v1&property=qualifiedName&value=sales_factFdQQBRVMUG
HTTP/1.1" 200 - "-" "Java/1.7.0_80"
127.0.0.1 - - [16/Aug/2017:19:34:08 +0000] "GET /api/atlas/lineage/73a18da3-a6e5-4251-a354-40f42962a1aa/schema
HTTP/1.1" 200 - "-" "Java/1.7.0_80"
127.0.0.1 - - [16/Aug/2017:19:34:09 +0000] "GET /api/atlas/lineage/hive/table/sales_fact_monthly_mvgy9iCBJMaN/inputs/graph
HTTP/1.1" 200 - "-" "Java/1.7.0_80"
127.0.0.1 - - [16/Aug/2017:19:34:11 +0000] "GET /api/atlas/entities?type=hive_table_v1&property=qualifiedName&value=sales_fact_monthly_mvx3YbwVGfMT
HTTP/1.1" 200 - "-" "Java/1.7.0_80"
127.0.0.1 - - [16/Aug/2017:19:34:11 +0000] "GET /api/atlas/v2/lineage/8ea8f9ac-d154-4d93-83d7-b5acde74b14c?direction=BOTH&depth=5
HTTP/1.1" 200 - "-" "Java/1.7.0_80"
127.0.0.1 - - [16/Aug/2017:19:34:13 +0000] "GET /api/atlas/entities?type=hive_table_v1&property=qualifiedName&value=sales_factFdQQBRVMUG
HTTP/1.1" 200 - "-" "Java/1.7.0_80"
127.0.0.1 - - [16/Aug/2017:19:34:13 +0000] "GET /api/atlas/lineage/73a18da3-a6e5-4251-a354-40f42962a1aa/outputs/graph
HTTP/1.1" 200 - "-" "Java/1.7.0_80"
127.0.0.1 - - [16/Aug/2017:19:34:14 +0000] "GET /api/atlas/entities?type=hive_table_v1&property=qualifiedName&value=sales_factexoG8vGZgG
HTTP/1.1" 200 - "-" "Java/1.7.0_80"
127.0.0.1 - - [16/Aug/2017:19:34:14 +0000] "GET /api/atlas/v2/lineage/a4269a0a-36ca-48b9-83fd-2b994ff19663?direction=OUTPUT&depth=5
HTTP/1.1" 200 - "-" "Java/1.7.0_80"
127.0.0.1 - - [16/Aug/2017:19:34:15 +0000] "GET /api/atlas/lineage/hive/table/blah/schema
HTTP/1.1" 404 - "-" "Java/1.7.0_80"
127.0.0.1 - - [16/Aug/2017:19:34:15 +0000] "GET /api/atlas/lineage/hive/table/sales_factFdQQBRVMUG/schema
HTTP/1.1" 200 - "-" "Java/1.7.0_80"
127.0.0.1 - - [16/Aug/2017:19:34:16 +0000] "GET /api/atlas/lineage/hive/table/sales_factFdQQBRVMUG/outputs/graph
HTTP/1.1" 200 - "-" "Java/1.7.0_80"
127.0.0.1 - - [16/Aug/2017:19:34:18 +0000] "GET /api/atlas/entities?type=hive_table_v1&property=qualifiedName&value=sales_fact_monthly_mvgy9iCBJMaN
HTTP/1.1" 200 - "-" "Java/1.7.0_80"
127.0.0.1 - - [16/Aug/2017:19:34:18 +0000] "GET /api/atlas/lineage/5bbe97f4-4c16-4742-92e9-97945eeb3592/inputs/graph
HTTP/1.1" 200 - "-" "Java/1.7.0_80"
127.0.0.1 - - [16/Aug/2017:19:34:19 +0000] "GET /api/atlas/lineage/hive/table/Salesw2YJDAR1XT/schema
HTTP/1.1" 404 - "-" "Java/1.7.0_80"
127.0.0.1 - - [16/Aug/2017:19:34:19 +0000] "GET /api/atlas/entities?type=hive_table_v1&property=qualifiedName&value=sales_fact_monthly_mvx3YbwVGfMT
HTTP/1.1" 200 - "-" "Java/1.7.0_80"
127.0.0.1 - - [16/Aug/2017:19:34:19 +0000] "GET /api/atlas/v2/lineage/8ea8f9ac-d154-4d93-83d7-b5acde74b14c?direction=INPUT&depth=5
HTTP/1.1" 200 - "-" "Java/1.7.0_80"
127.0.0.1 - - [16/Aug/2017:19:34:20 +0000] "GET /api/atlas/admin/session HTTP/1.1" 200 - "-"
"Java/1.7.0_80"
127.0.0.1 - - [16/Aug/2017:19:34:20 +0000] "GET /api/atlas/v1/taxonomies HTTP/1.1" 403 493
"-" "Java/1.7.0_80"
127.0.0.1 - - [16/Aug/2017:19:34:20 +0000] "GET /api/atlas/admin/status HTTP/1.1" 200 - "-"
"Java/1.7.0_80"
127.0.0.1 - - [16/Aug/2017:19:34:20 +0000] "GET /api/atlas/admin/session HTTP/1.1" 401 317
"-" "Java/1.7.0_80"
Tests run: 133, Failures: 4, Errors: 0, Skipped: 5, Time elapsed: 232.605 sec <<<
FAILURE! - in TestSuite
runQuickStart(org.apache.atlas.examples.QuickStartV2IT)  Time elapsed: 0.54 sec  <<<
FAILURE!
org.apache.atlas.AtlasServiceException: Metadata service API org.apache.atlas.AtlasBaseClient$APIInfo@5aadbaf2
failed with status 409 (Conflict) Response Body ({"errorCode":"ATLAS-409-00-001","errorMessage":"Given
type Dimension already exists"})
	at org.apache.atlas.examples.QuickStartV2IT.runQuickStart(QuickStartV2IT.java:49)

testDeleteByQualifiedName(org.apache.atlas.notification.NotificationHookConsumerIT)  Time
elapsed: 60.081 sec  <<< FAILURE!
java.lang.Exception: Waiting timed out after 60000 msec
	at org.apache.atlas.notification.NotificationHookConsumerIT.testDeleteByQualifiedName(NotificationHookConsumerIT.java:184)

testUpdateEntityPartial(org.apache.atlas.notification.NotificationHookConsumerIT)  Time elapsed:
60.142 sec  <<< FAILURE!
java.lang.Exception: Waiting timed out after 60000 msec
	at org.apache.atlas.notification.NotificationHookConsumerIT.testUpdateEntityPartial(NotificationHookConsumerIT.java:127)

testPartialUpdate(org.apache.atlas.web.integration.EntityJerseyResourceIT)  Time elapsed:
0.673 sec  <<< FAILURE!
org.apache.atlas.AtlasServiceException: Metadata service API org.apache.atlas.AtlasBaseClient$APIInfo@278f6847
failed with status 500 (Internal Server Error) Response Body ({"error":"Could not commit transaction
due to exception during persistence"})
	at org.apache.atlas.web.integration.EntityJerseyResourceIT.testPartialUpdate(EntityJerseyResourceIT.java:895)


Results :

Failed tests: 
  QuickStartV2IT.runQuickStart:49 » AtlasService Metadata service API org.apache...
  NotificationHookConsumerIT.testDeleteByQualifiedName:184->BaseResourceIT.waitFor:626
» 
  NotificationHookConsumerIT.testUpdateEntityPartial:127->BaseResourceIT.waitFor:626 »

  EntityJerseyResourceIT.testPartialUpdate:895 » AtlasService Metadata service A...

Tests run: 133, Failures: 4, Errors: 0, Skipped: 5

[INFO] 
[INFO] --- jetty-maven-plugin:9.2.12.v20150709:stop (stop-jetty) @ atlas-webapp ---
[INFO] Waiting 10 seconds for jetty to stop
[INFO] Stopped ServerConnector@bafc358{HTTP/1.1}{0.0.0.0:31000}
[INFO] Closing Spring root WebApplicationContext
[INFO] Shutting down log4j
[INFO] Stopped o.e.j.m.p.JettyWebAppContext@5eed74ff{/,<https://builds.apache.org/job/Atlas-0.8-IntegrationTests/ws/webapp/target/atlas-webapp-0.8.1-SNAPSHOT/,UNAVAILABLE}{/home/jenkins/jenkins-slave/workspace/Atlas-0.8-IntegrationTests/webapp/target/atlas-webapp-0.8.1-SNAPSHOT.war}>
[INFO] Server reports itself as stopped
[INFO] 
[INFO] --- maven-source-plugin:2.4:jar-no-fork (attach-sources) @ atlas-webapp ---
[INFO] Building jar: <https://builds.apache.org/job/Atlas-0.8-IntegrationTests/ws/webapp/target/atlas-webapp-0.8.1-SNAPSHOT-sources.jar>
[INFO] 
[INFO] --- maven-source-plugin:2.4:test-jar-no-fork (attach-sources) @ atlas-webapp ---
[INFO] Building jar: <https://builds.apache.org/job/Atlas-0.8-IntegrationTests/ws/webapp/target/atlas-webapp-0.8.1-SNAPSHOT-test-sources.jar>
[INFO] 
[INFO] --- maven-failsafe-plugin:2.19.1:verify (verify) @ atlas-webapp ---
[INFO] ------------------------------------------------------------------------
[INFO] Reactor Summary:
[INFO] 
[INFO] Apache Atlas Server Build Tools .................... SUCCESS [  0.941 s]
[INFO] apache-atlas ....................................... SUCCESS [  4.775 s]
[INFO] Apache Atlas Integration ........................... SUCCESS [ 27.310 s]
[INFO] Apache Atlas Common ................................ SUCCESS [ 14.688 s]
[INFO] Apache Atlas Typesystem ............................ SUCCESS [01:03 min]
[INFO] Apache Atlas Client ................................ SUCCESS [ 16.176 s]
[INFO] Apache Atlas Server API ............................ SUCCESS [  9.504 s]
[INFO] Apache Atlas Notification .......................... SUCCESS [ 15.583 s]
[INFO] Apache Atlas Graph Database Projects ............... SUCCESS [  0.566 s]
[INFO] Apache Atlas Graph Database API .................... SUCCESS [  7.490 s]
[INFO] Graph Database Common Code ......................... SUCCESS [  7.451 s]
[INFO] Apache Atlas Titan 1.0.0 GraphDB Impl .............. SUCCESS [ 30.950 s]
[INFO] Shaded version of Apache hbase client .............. SUCCESS [  8.259 s]
[INFO] Apache Atlas Titan 0.5.4 Graph DB Impl ............. SUCCESS [ 42.750 s]
[INFO] Apache Atlas Graph Database Implementation Dependencies SUCCESS [  0.696 s]
[INFO] Shaded version of Apache hbase server .............. SUCCESS [ 22.771 s]
[INFO] Apache Atlas Repository ............................ SUCCESS [01:43 min]
[INFO] Apache Atlas Authorization ......................... SUCCESS [ 11.480 s]
[INFO] Apache Atlas Business Catalog ...................... SUCCESS [ 16.143 s]
[INFO] Apache Atlas UI .................................... SUCCESS [ 58.620 s]
[INFO] Apache Atlas Web Application ....................... FAILURE [05:23 min]
[INFO] Apache Atlas Documentation ......................... SKIPPED
[INFO] Apache Atlas FileSystem Model ...................... SKIPPED
[INFO] Apache Atlas Plugin Classloader .................... SKIPPED
[INFO] Apache Atlas Hive Bridge Shim ...................... SKIPPED
[INFO] Apache Atlas Hive Bridge ........................... SKIPPED
[INFO] Apache Atlas Falcon Bridge Shim .................... SKIPPED
[INFO] Apache Atlas Falcon Bridge ......................... SKIPPED
[INFO] Apache Atlas Sqoop Bridge Shim ..................... SKIPPED
[INFO] Apache Atlas Sqoop Bridge .......................... SKIPPED
[INFO] Apache Atlas Storm Bridge Shim ..................... SKIPPED
[INFO] Apache Atlas Storm Bridge .......................... SKIPPED
[INFO] Apache Atlas Distribution .......................... SKIPPED
[INFO] ------------------------------------------------------------------------
[INFO] BUILD FAILURE
[INFO] ------------------------------------------------------------------------
[INFO] Total time: 13:08 min
[INFO] Finished at: 2017-08-16T19:34:25Z
[INFO] Final Memory: 353M/1971M
[INFO] ------------------------------------------------------------------------
log4j:WARN No appenders could be found for logger (org.apache.zookeeper.ClientCnxn).
log4j:WARN Please initialize the log4j system properly.
log4j:WARN See http://logging.apache.org/log4j/1.2/faq.html#noconfig for more info.
[ERROR] Failed to execute goal org.apache.maven.plugins:maven-failsafe-plugin:2.19.1:verify
(verify) on project atlas-webapp: There are test failures.
[ERROR] 
[ERROR] Please refer to <https://builds.apache.org/job/Atlas-0.8-IntegrationTests/ws/webapp/target/failsafe-reports>
for the individual test results.
[ERROR] -> [Help 1]
[ERROR] 
[ERROR] To see the full stack trace of the errors, re-run Maven with the -e switch.
[ERROR] Re-run Maven using the -X switch to enable full debug logging.
[ERROR] 
[ERROR] For more information about the errors and possible solutions, please read the following
articles:
[ERROR] [Help 1] http://cwiki.apache.org/confluence/display/MAVEN/MojoFailureException
[ERROR] 
[ERROR] After correcting the problems, you can resume the build with the command
[ERROR]   mvn <goals> -rf :atlas-webapp
Build step 'Execute shell' marked build as failure
[CHECKSTYLE] Collecting checkstyle analysis files...
[CHECKSTYLE] Searching for all files in <https://builds.apache.org/job/Atlas-0.8-IntegrationTests/ws/>
that match the pattern **/target/checkstyle-result.xml
[CHECKSTYLE] Parsing 19 files in <https://builds.apache.org/job/Atlas-0.8-IntegrationTests/ws/>
[CHECKSTYLE] Successfully parsed file <https://builds.apache.org/job/Atlas-0.8-IntegrationTests/ws/authorization/target/checkstyle-result.xml>
with 467 unique warnings and 0 duplicates.
[CHECKSTYLE] Successfully parsed file <https://builds.apache.org/job/Atlas-0.8-IntegrationTests/ws/catalog/target/checkstyle-result.xml>
with 2612 unique warnings and 0 duplicates.
[CHECKSTYLE] Successfully parsed file <https://builds.apache.org/job/Atlas-0.8-IntegrationTests/ws/client/target/checkstyle-result.xml>
with 4249 unique warnings and 0 duplicates.
[CHECKSTYLE] Successfully parsed file <https://builds.apache.org/job/Atlas-0.8-IntegrationTests/ws/common/target/checkstyle-result.xml>
with 5455 unique warnings and 0 duplicates.
[CHECKSTYLE] Successfully parsed file <https://builds.apache.org/job/Atlas-0.8-IntegrationTests/ws/dashboardv2/target/checkstyle-result.xml>
with 5455 unique warnings and 0 duplicates.
[CHECKSTYLE] Successfully parsed file <https://builds.apache.org/job/Atlas-0.8-IntegrationTests/ws/graphdb/api/target/checkstyle-result.xml>
with 5724 unique warnings and 0 duplicates.
[CHECKSTYLE] Successfully parsed file <https://builds.apache.org/job/Atlas-0.8-IntegrationTests/ws/graphdb/common/target/checkstyle-result.xml>
with 5911 unique warnings and 0 duplicates.
[CHECKSTYLE] Successfully parsed file <https://builds.apache.org/job/Atlas-0.8-IntegrationTests/ws/graphdb/graphdb-impls/target/checkstyle-result.xml>
with 5911 unique warnings and 0 duplicates.
[CHECKSTYLE] Successfully parsed file <https://builds.apache.org/job/Atlas-0.8-IntegrationTests/ws/graphdb/target/checkstyle-result.xml>
with 5911 unique warnings and 0 duplicates.
[CHECKSTYLE] Successfully parsed file <https://builds.apache.org/job/Atlas-0.8-IntegrationTests/ws/graphdb/titan0/target/checkstyle-result.xml>
with 8185 unique warnings and 0 duplicates.
[CHECKSTYLE] Successfully parsed file <https://builds.apache.org/job/Atlas-0.8-IntegrationTests/ws/graphdb/titan1/target/checkstyle-result.xml>
with 9133 unique warnings and 0 duplicates.
[CHECKSTYLE] Successfully parsed file <https://builds.apache.org/job/Atlas-0.8-IntegrationTests/ws/intg/target/checkstyle-result.xml>
with 15437 unique warnings and 0 duplicates.
[CHECKSTYLE] Successfully parsed file <https://builds.apache.org/job/Atlas-0.8-IntegrationTests/ws/notification/target/checkstyle-result.xml>
with 16647 unique warnings and 0 duplicates.
[CHECKSTYLE] Successfully parsed file <https://builds.apache.org/job/Atlas-0.8-IntegrationTests/ws/repository/target/checkstyle-result.xml>
with 34238 unique warnings and 0 duplicates.
[CHECKSTYLE] Successfully parsed file <https://builds.apache.org/job/Atlas-0.8-IntegrationTests/ws/server-api/target/checkstyle-result.xml>
with 34617 unique warnings and 0 duplicates.
[CHECKSTYLE] Successfully parsed file <https://builds.apache.org/job/Atlas-0.8-IntegrationTests/ws/shaded/hbase-client-shaded/target/checkstyle-result.xml>
with 34617 unique warnings and 0 duplicates.
[CHECKSTYLE] Successfully parsed file <https://builds.apache.org/job/Atlas-0.8-IntegrationTests/ws/shaded/hbase-server-shaded/target/checkstyle-result.xml>
with 34617 unique warnings and 0 duplicates.
[CHECKSTYLE] Successfully parsed file <https://builds.apache.org/job/Atlas-0.8-IntegrationTests/ws/target/checkstyle-result.xml>
with 34617 unique warnings and 0 duplicates.
[CHECKSTYLE] Successfully parsed file <https://builds.apache.org/job/Atlas-0.8-IntegrationTests/ws/typesystem/target/checkstyle-result.xml>
with 38835 unique warnings and 0 duplicates.
<Git Blamer> Using GitBlamer to create author and commit information for all warnings.
<Git Blamer> GIT_COMMIT=8967f0cf62cae4c6d6215a7fb4fc0b1d7bac9789, workspace=<https://builds.apache.org/job/Atlas-0.8-IntegrationTests/ws/>
 > git rev-parse 8967f0cf62cae4c6d6215a7fb4fc0b1d7bac9789^{commit} # timeout=10
<Git Blamer> Skipping file <https://builds.apache.org/job/Atlas-0.8-IntegrationTests/ws/repository/src/main/java/org/apache/atlas/discovery/SearchIndexer.java,>
no result found.
[FINDBUGS] Collecting findbugs analysis files...
[FINDBUGS] Searching for all files in <https://builds.apache.org/job/Atlas-0.8-IntegrationTests/ws/>
that match the pattern **/target/findbugs.xml
[FINDBUGS] Parsing 12 files in <https://builds.apache.org/job/Atlas-0.8-IntegrationTests/ws/>
[FINDBUGS] Successfully parsed file <https://builds.apache.org/job/Atlas-0.8-IntegrationTests/ws/authorization/target/findbugs.xml>
with 0 unique warnings and 0 duplicates.
[FINDBUGS] Successfully parsed file <https://builds.apache.org/job/Atlas-0.8-IntegrationTests/ws/catalog/target/findbugs.xml>
with 0 unique warnings and 0 duplicates.
[FINDBUGS] Successfully parsed file <https://builds.apache.org/job/Atlas-0.8-IntegrationTests/ws/client/target/findbugs.xml>
with 0 unique warnings and 0 duplicates.
[FINDBUGS] Successfully parsed file <https://builds.apache.org/job/Atlas-0.8-IntegrationTests/ws/common/target/findbugs.xml>
with 0 unique warnings and 0 duplicates.
[FINDBUGS] Successfully parsed file <https://builds.apache.org/job/Atlas-0.8-IntegrationTests/ws/graphdb/api/target/findbugs.xml>
with 0 unique warnings and 0 duplicates.
[FINDBUGS] Successfully parsed file <https://builds.apache.org/job/Atlas-0.8-IntegrationTests/ws/graphdb/common/target/findbugs.xml>
with 0 unique warnings and 0 duplicates.
[FINDBUGS] Successfully parsed file <https://builds.apache.org/job/Atlas-0.8-IntegrationTests/ws/graphdb/titan0/target/findbugs.xml>
with 0 unique warnings and 0 duplicates.
[FINDBUGS] Successfully parsed file <https://builds.apache.org/job/Atlas-0.8-IntegrationTests/ws/intg/target/findbugs.xml>
with 0 unique warnings and 0 duplicates.
[FINDBUGS] Successfully parsed file <https://builds.apache.org/job/Atlas-0.8-IntegrationTests/ws/notification/target/findbugs.xml>
with 0 unique warnings and 0 duplicates.
[FINDBUGS] Successfully parsed file <https://builds.apache.org/job/Atlas-0.8-IntegrationTests/ws/repository/target/findbugs.xml>
with 0 unique warnings and 0 duplicates.
[FINDBUGS] Successfully parsed file <https://builds.apache.org/job/Atlas-0.8-IntegrationTests/ws/server-api/target/findbugs.xml>
with 0 unique warnings and 0 duplicates.
[FINDBUGS] Successfully parsed file <https://builds.apache.org/job/Atlas-0.8-IntegrationTests/ws/typesystem/target/findbugs.xml>
with 0 unique warnings and 0 duplicates.
<Git Blamer> Using GitBlamer to create author and commit information for all warnings.
<Git Blamer> GIT_COMMIT=8967f0cf62cae4c6d6215a7fb4fc0b1d7bac9789, workspace=<https://builds.apache.org/job/Atlas-0.8-IntegrationTests/ws/>
Archiving artifacts
[Fast Archiver] No prior successful build to compare, so performing full copy of artifacts
TestNG Reports Processing: START
Looking for TestNG results report in workspace using pattern: **/target/surefire-reports/testng-results.xml,**/target/failsafe-reports/testng-results.xml
Saving reports...
Processing '/x1/jenkins/jenkins-home/jobs/Atlas-0.8-IntegrationTests/builds/9/testng/testng-results.xml'
2.272727% of tests failed, which exceeded threshold of 0%. Marking build as UNSTABLE
TestNG Reports Processing: FINISH
Not sending mail to unregistered user ssubramanian@hortonworks.com

Mime
View raw message